[gd_scene load_steps=7 format=3 uid="uid://ydet0281twtm"]

[ext_resource type="Shader" path="res://portal.gdshader" id="1_r53yx"]
[ext_resource type="Texture2D" uid="uid://dl5wad2oqn1ds" path="res://windowsxp.jpg" id="2_vx2ec"]
[ext_resource type="Script" path="res://usefulScripts/interaction/scene_change.gd" id="3_ornyn"]
[ext_resource type="PackedScene" uid="uid://c47grqxh258d2" path="res://usefulScripts/player/freecam_firstperson.tscn" id="4_vbtfy"]

[sub_resource type="ShaderMaterial" id="ShaderMaterial_yq4yi"]
render_priority = 0
shader = ExtResource("1_r53yx")
shader_parameter/uv1_scale = null
shader_parameter/uv1_offset = null
shader_parameter/texture_albedo = ExtResource("2_vx2ec")

[sub_resource type="PrismMesh" id="PrismMesh_cyik6"]

[node name="Node3D" type="Node3D"]

[node name="MeshInstance3D" type="MeshInstance3D" parent="." node_paths=PackedStringArray("player")]
transform = Transform3D(1, 0, 0, 0, 1, 0, 0, 0, 1, 0, 0, -6.16906)
material_override = SubResource("ShaderMaterial_yq4yi")
mesh = SubResource("PrismMesh_cyik6")
skeleton = NodePath("../freecam")
script = ExtResource("3_ornyn")
player = NodePath("../freecam")
otherScene = "res://main.tscn"

[node name="freecam" parent="." instance=ExtResource("4_vbtfy")]
