[gd_scene load_steps=3 format=3 uid="uid://c47grqxh258d2"]

[sub_resource type="SphereShape3D" id="SphereShape3D_3o0yw"]

[sub_resource type="SphereMesh" id="SphereMesh_0ppkb"]

[node name="freecam" type="CharacterBody3D"]

[node name="CollisionShape3d" type="CollisionShape3D" parent="."]
shape = SubResource("SphereShape3D_3o0yw")

[node name="MeshInstance3d" type="MeshInstance3D" parent="."]
mesh = SubResource("SphereMesh_0ppkb")

[node name="Head" type="Node3D" parent="."]

[node name="Camera3d" type="Camera3D" parent="Head"]
transform = Transform3D(1, 0, 0, 0, 1, 0, 0, 0, 1, 0, 0, -0.5)

[node name="RayCast3d" type="RayCast3D" parent="Head/Camera3d"]
transform = Transform3D(2.98023e-08, 0, 1, 0, 1, 0, -1, 0, 2.98023e-08, 0, -0.00588068, 0.463024)
target_position = Vector3(60, 0, 0)
