{
  "Chat Now": "Chat Now",
  "Communication channels": "Communication channels",
  "Fedora Chat": "Fedora Chat",
  "Fedora Discussion": "Fedora Discussion",
  "Fedora Podcast": "Fedora Podcast",
  "Fedora Podcast 23: Welcome to the Podcast": "Fedora Podcast 23: Welcome to the Podcast",
  "Fedora Podcast 24: Fedora Linux 38 Released": "Fedora Podcast 24: Fedora Linux 38 Released",
  "Fedora Podcast 25: Fedora Websites 3.0": "Fedora Podcast 25: Fedora Websites 3.0",
  "Fedora Podcast 26: Extra Packages for Enterprise Linux": "Fedora Podcast 26: Extra Packages for Enterprise Linux",
  "Fedora Podcast 27: Fedora Cloud Edition": "Fedora Podcast 27: Fedora Cloud Edition",
  "Fedora Podcast 28: Getting Fedora with your Lenovo": "Fedora Podcast 28: Getting Fedora with your Lenovo",
  "Fedora Podcast 29: Fedora Spins: Budgie": "Fedora Podcast 29: Fedora Spins: Budgie",
  "Fedora Podcast 30: Silverblue and Immutable Desktops": "Fedora Podcast 30: Silverblue and Immutable Desktops",
  "Fedora Podcast 31: Fedora Slimbook": "Fedora Podcast 31: Fedora Slimbook",
  "Fedora Podcast 32: How Do You Fedora: Neal Gompa": "Fedora Podcast 32: How Do You Fedora: Neal Gompa",
  "Fedora Podcast 33: The Birthday Episode": "Fedora Podcast 33: The Birthday Episode",
  "Fedora Podcast 34: Fedora Docs": "Fedora Podcast 34: Fedora Docs",
  "Fedora's Discourse-based discussion forum is a great place to connect with other Fedora Project users and contributors.": "Fedora's Discourse-based discussion forum is a great place to connect with other Fedora Project users and contributors.",
  "Fedora's Matrix-powered chat server is a great place to chat in real time with other Fedora Project users and contributors.": "Fedora's Matrix-powered chat server is a great place to chat in real time with other Fedora Project users and contributors.",
  "Visit Now": "Visit Now"
}