{
  "A previous version of your system is always kept around, just in case. If you need to go back in time, you can!": "A previous version of your system is always kept around, just in case. If you need to go back in time, you can!",
  "An immutable desktop operating system featuring the keyboard-driven Sway window manager.": "An immutable desktop operating system featuring the keyboard-driven Sway window manager.",
  "An immutable desktop operating system featuring the modern and elegant GNOME Desktop": "An immutable desktop operating system featuring the modern and elegant GNOME Desktop",
  "Applications as Flatpaks": "Applications as Flatpaks",
  "Atomic": "Atomic",
  "Built On Top of the Best": "Built On Top of the Best",
  "Containerized": "Containerized",
  "Developer-Friendly": "Developer-Friendly",
  "Documentation": "Documentation",
  "Download Now": "Download Now",
  "Download thousands of open-source and proprietary, containerized applications thanks to Flatpak and Flathub.": "Download thousands of open-source and proprietary, containerized applications thanks to Flatpak and Flathub.",
  "Each version is updated for approximately 13 months, and each update takes effect on your next reboot, keeping your system consistent. You can even keep working while the updates are being applied!": "Each version is updated for approximately 13 months, and each update takes effect on your next reboot, keeping your system consistent. You can even keep working while the updates are being applied!",
  "Easily create OCI containers which are fully-integrated with your host system, enabling seamless usage of both GUI and CLI tools.": "Easily create OCI containers which are fully-integrated with your host system, enabling seamless usage of both GUI and CLI tools.",
  "Fedora Community & Support": "Fedora Community & Support",
  "Fedora CoreOS is an automatically updating, minimal, monolithic, container-focused operating system, designed for clusters but also operable standalone, optimized for Kubernetes but also great without it.": "Fedora CoreOS is an automatically updating, minimal, monolithic, container-focused operating system, designed for clusters but also operable standalone, optimized for Kubernetes but also great without it.",
  "Fedora Kinoite Image": "Fedora Kinoite Image",
  "Fedora creates an innovative, free and open source platform for hardware, clouds, and containers that enables software developers and community members to build tailored solutions for their users.": "Fedora creates an innovative, free and open source platform for hardware, clouds, and containers that enables software developers and community members to build tailored solutions for their users.",
  "Graphical applications are installed via Flatpak, and keep themselves separate from the base system. They also allow for fine-grained control over their permissions.": "Graphical applications are installed via Flatpak, and keep themselves separate from the base system. They also allow for fine-grained control over their permissions.",
  "Includes the latest versions of the modern and modular desktop, built by the KDE community.": "Includes the latest versions of the modern and modular desktop, built by the KDE community.",
  "KDE Plasma Desktop": "KDE Plasma Desktop",
  "Private, Trusted, Open Source": "Private, Trusted, Open Source",
  "Related Projects": "Related Projects",
  "Reliable": "Reliable",
  "Safe": "Safe",
  "Screenshot of KDE Desktop": "Screenshot of KDE Desktop",
  "Screenshot of blank laptop as background to KDE desktop": "Screenshot of blank laptop as background to KDE desktop",
  "Surf the web, keep in touch with friends, manage files, enjoy music and video, and get productive at work without having to worry about breaking your system.": "Surf the web, keep in touch with friends, manage files, enjoy music and video, and get productive at work without having to worry about breaking your system.",
  "The KDE Plasma desktop, in an immutable fashion": "The KDE Plasma desktop, in an immutable fashion",
  "The whole system is updated in one go, and an update will not apply if anything goes wrong, meaning you will <i>always</i> have a working computer.": "The whole system is updated in one go, and an update will not apply if anything goes wrong, meaning you will <i>always</i> have a working computer.",
  "There are no ads, and all your data belongs to you! Fedora is built on the latest open source technologies, and backed by Red Hat.": "There are no ads, and all your data belongs to you! Fedora is built on the latest open source technologies, and backed by Red Hat.",
  "Toolbx for Development": "Toolbx for Development",
  "Toolbx keeps all of your development tools neatly organized per-project. Keep multiple versions of your tools independent from each other and unaffected by changes to the base system.": "Toolbx keeps all of your development tools neatly organized per-project. Keep multiple versions of your tools independent from each other and unaffected by changes to the base system.",
  "Why Fedora Kinoite?": "Why Fedora Kinoite?",
  "rpm-ostree is a hybrid image/package system. It combines libostree and libdnf to provide atomic and safe upgrades with local RPM package layering.": "rpm-ostree is a hybrid image/package system. It combines libostree and libdnf to provide atomic and safe upgrades with local RPM package layering."
}