{
  "Become a Fedora contributor": "Become a Fedora contributor",
  "Both the Fedora Community Blog and Fedora Magazine are always looking for article proposals, writers, and editors.": "Both the Fedora Community Blog and Fedora Magazine are always looking for article proposals, writers, and editors.",
  "Fedora Community Blog": "Fedora Community Blog",
  "Fedora Magazine": "Fedora Magazine",
  "Fedora Magazine is a website that hosts promotional articles and short guides contributed from the community about free/libre and open-source software that runs on or works with the Fedora Linux operating system.": "Fedora Magazine is a website that hosts promotional articles and short guides contributed from the community about free/libre and open-source software that runs on or works with the Fedora Linux operating system.",
  "Fedora Publications": "Fedora Publications",
  "Learn more": "Learn more",
  "The Community Blog provides a single source for members of the community to share important news, updates, and information about Fedora with others in the Project community.": "The Community Blog provides a single source for members of the community to share important news, updates, and information about Fedora with others in the Project community.",
  "Visit Now": "Visit Now",
  "Visit now": "Visit now"
}