PWD /home/kaiming/ucr/research/ANL/profile/AsHES-2020/ashes/2021/docs/proposal
INPUT /etc/texmf/web2c/texmf.cnf
INPUT /usr/share/texmf/web2c/texmf.cnf
INPUT /usr/share/texlive/texmf-dist/web2c/texmf.cnf
INPUT /var/lib/texmf/web2c/pdftex/pdflatex.fmt
INPUT /home/kaiming/ucr/research/ANL/profile/AsHES-2020/ashes/2021/docs/proposal/ashes.tex
OUTPUT /home/kaiming/ucr/research/ANL/profile/AsHES-2020/ashes/2021/docs/proposal/ashes.log
INPUT /home/kaiming/ucr/research/ANL/profile/AsHES-2020/ashes/2021/docs/proposal/style/IEEEtran.cls
INPUT /home/kaiming/ucr/research/ANL/profile/AsHES-2020/ashes/2021/docs/proposal/style/IEEEtran.cls
INPUT /usr/share/texlive/texmf-dist/tex/latex/psnfss/ot1ptm.fd
INPUT /usr/share/texlive/texmf-dist/tex/latex/psnfss/ot1ptm.fd
INPUT /usr/share/texlive/texmf-dist/fonts/map/fontname/texfonts.map
INPUT /usr/share/texlive/texmf-dist/fonts/tfm/adobe/times/ptmr7t.tfm
INPUT /usr/share/texlive/texmf-dist/fonts/tfm/adobe/times/ptmr7t.tfm
INPUT /usr/share/texlive/texmf-dist/fonts/tfm/adobe/times/ptmr7t.tfm
INPUT /usr/share/texlive/texmf-dist/fonts/tfm/adobe/times/ptmb7t.tfm
INPUT /usr/share/texlive/texmf-dist/fonts/tfm/adobe/times/ptmri7t.tfm
INPUT /usr/share/texlive/texmf-dist/fonts/tfm/adobe/times/ptmbi7t.tfm
INPUT /usr/share/texlive/texmf-dist/fonts/tfm/adobe/times/ptmr7t.tfm
INPUT /usr/share/texlive/texmf-dist/fonts/tfm/adobe/times/ptmb7t.tfm
INPUT /usr/share/texlive/texmf-dist/fonts/tfm/adobe/times/ptmri7t.tfm
INPUT /usr/share/texlive/texmf-dist/fonts/tfm/adobe/times/ptmbi7t.tfm
INPUT /usr/share/texlive/texmf-dist/fonts/tfm/adobe/times/ptmr7t.tfm
INPUT /usr/share/texlive/texmf-dist/fonts/tfm/adobe/times/ptmb7t.tfm
INPUT /usr/share/texlive/texmf-dist/fonts/tfm/adobe/times/ptmri7t.tfm
INPUT /usr/share/texlive/texmf-dist/fonts/tfm/adobe/times/ptmbi7t.tfm
INPUT /usr/share/texlive/texmf-dist/fonts/tfm/adobe/times/ptmb7t.tfm
INPUT /usr/share/texlive/texmf-dist/fonts/tfm/adobe/times/ptmri7t.tfm
INPUT /usr/share/texlive/texmf-dist/fonts/tfm/adobe/times/ptmbi7t.tfm
INPUT /usr/share/texlive/texmf-dist/fonts/tfm/adobe/times/ptmb7t.tfm
INPUT /usr/share/texlive/texmf-dist/fonts/tfm/adobe/times/ptmri7t.tfm
INPUT /usr/share/texlive/texmf-dist/fonts/tfm/adobe/times/ptmbi7t.tfm
INPUT /usr/share/texlive/texmf-dist/fonts/tfm/adobe/times/ptmr7t.tfm
INPUT /usr/share/texlive/texmf-dist/fonts/tfm/adobe/times/ptmb7t.tfm
INPUT /usr/share/texlive/texmf-dist/fonts/tfm/adobe/times/ptmri7t.tfm
INPUT /usr/share/texlive/texmf-dist/fonts/tfm/adobe/times/ptmbi7t.tfm
INPUT /usr/share/texlive/texmf-dist/fonts/tfm/adobe/times/ptmr7t.tfm
INPUT /usr/share/texlive/texmf-dist/fonts/tfm/adobe/times/ptmb7t.tfm
INPUT /usr/share/texlive/texmf-dist/fonts/tfm/adobe/times/ptmri7t.tfm
INPUT /usr/share/texlive/texmf-dist/fonts/tfm/adobe/times/ptmbi7t.tfm
INPUT /usr/share/texlive/texmf-dist/fonts/tfm/adobe/times/ptmr7t.tfm
INPUT /usr/share/texlive/texmf-dist/fonts/tfm/adobe/times/ptmb7t.tfm
INPUT /usr/share/texlive/texmf-dist/fonts/tfm/adobe/times/ptmri7t.tfm
INPUT /usr/share/texlive/texmf-dist/fonts/tfm/adobe/times/ptmbi7t.tfm
INPUT /usr/share/texlive/texmf-dist/fonts/tfm/adobe/times/ptmr7t.tfm
INPUT /usr/share/texlive/texmf-dist/fonts/tfm/adobe/times/ptmb7t.tfm
INPUT /usr/share/texlive/texmf-dist/fonts/tfm/adobe/times/ptmri7t.tfm
INPUT /usr/share/texlive/texmf-dist/fonts/tfm/adobe/times/ptmbi7t.tfm
INPUT /usr/share/texlive/texmf-dist/fonts/tfm/adobe/times/ptmr7t.tfm
INPUT /usr/share/texlive/texmf-dist/fonts/tfm/adobe/times/ptmb7t.tfm
INPUT /usr/share/texlive/texmf-dist/fonts/tfm/adobe/times/ptmri7t.tfm
INPUT /usr/share/texlive/texmf-dist/fonts/tfm/adobe/times/ptmbi7t.tfm
INPUT /usr/share/texlive/texmf-dist/tex/latex/hyperref/hyperref.sty
INPUT /usr/share/texlive/texmf-dist/tex/latex/hyperref/hyperref.sty
INPUT /usr/share/texlive/texmf-dist/tex/generic/oberdiek/hobsub-hyperref.sty
INPUT /usr/share/texlive/texmf-dist/tex/generic/oberdiek/hobsub-hyperref.sty
INPUT /usr/share/texlive/texmf-dist/tex/generic/oberdiek/hobsub-hyperref.sty
INPUT /usr/share/texlive/texmf-dist/tex/generic/oberdiek/hobsub-generic.sty
INPUT /usr/share/texlive/texmf-dist/tex/generic/oberdiek/hobsub-generic.sty
INPUT /usr/share/texlive/texmf-dist/tex/latex/graphics/keyval.sty
INPUT /usr/share/texlive/texmf-dist/tex/latex/graphics/keyval.sty
INPUT /usr/share/texlive/texmf-dist/tex/generic/ifxetex/ifxetex.sty
INPUT /usr/share/texlive/texmf-dist/tex/generic/ifxetex/ifxetex.sty
INPUT /usr/share/texlive/texmf-dist/tex/latex/oberdiek/auxhook.sty
INPUT /usr/share/texlive/texmf-dist/tex/latex/oberdiek/auxhook.sty
INPUT /usr/share/texlive/texmf-dist/tex/latex/oberdiek/kvoptions.sty
INPUT /usr/share/texlive/texmf-dist/tex/latex/oberdiek/kvoptions.sty
INPUT /usr/share/texlive/texmf-dist/tex/latex/hyperref/pd1enc.def
INPUT /usr/share/texlive/texmf-dist/tex/latex/hyperref/pd1enc.def
INPUT /usr/share/texlive/texmf-dist/tex/latex/latexconfig/hyperref.cfg
INPUT /usr/share/texlive/texmf-dist/tex/latex/latexconfig/hyperref.cfg
INPUT /usr/share/texlive/texmf-dist/tex/latex/url/url.sty
INPUT /usr/share/texlive/texmf-dist/tex/latex/url/url.sty
INPUT /usr/share/texlive/texmf-dist/tex/latex/hyperref/hpdftex.def
INPUT /usr/share/texlive/texmf-dist/tex/latex/hyperref/hpdftex.def
INPUT /usr/share/texlive/texmf-dist/tex/latex/oberdiek/rerunfilecheck.sty
INPUT /usr/share/texlive/texmf-dist/tex/latex/oberdiek/rerunfilecheck.sty
INPUT /usr/share/texlive/texmf-dist/tex/latex/graphics/color.sty
INPUT /usr/share/texlive/texmf-dist/tex/latex/graphics/color.sty
INPUT /usr/share/texlive/texmf-dist/tex/latex/graphics-cfg/color.cfg
INPUT /usr/share/texlive/texmf-dist/tex/latex/graphics-cfg/color.cfg
INPUT /usr/share/texlive/texmf-dist/tex/latex/graphics-def/pdftex.def
INPUT /usr/share/texlive/texmf-dist/tex/latex/graphics-def/pdftex.def
INPUT /usr/share/texlive/texmf-dist/tex/latex/fancyvrb/fancyvrb.sty
INPUT /usr/share/texlive/texmf-dist/tex/latex/fancyvrb/fancyvrb.sty
INPUT /home/kaiming/ucr/research/ANL/profile/AsHES-2020/ashes/2021/docs/proposal/ashes.aux
INPUT /home/kaiming/ucr/research/ANL/profile/AsHES-2020/ashes/2021/docs/proposal/ashes.aux
OUTPUT /home/kaiming/ucr/research/ANL/profile/AsHES-2020/ashes/2021/docs/proposal/ashes.aux
INPUT /usr/share/texlive/texmf-dist/tex/latex/hyperref/nameref.sty
INPUT /usr/share/texlive/texmf-dist/tex/latex/hyperref/nameref.sty
INPUT /usr/share/texlive/texmf-dist/tex/generic/oberdiek/gettitlestring.sty
INPUT /usr/share/texlive/texmf-dist/tex/generic/oberdiek/gettitlestring.sty
INPUT /home/kaiming/ucr/research/ANL/profile/AsHES-2020/ashes/2021/docs/proposal/ashes.out
INPUT /home/kaiming/ucr/research/ANL/profile/AsHES-2020/ashes/2021/docs/proposal/ashes.out
INPUT /home/kaiming/ucr/research/ANL/profile/AsHES-2020/ashes/2021/docs/proposal/ashes.out
INPUT /home/kaiming/ucr/research/ANL/profile/AsHES-2020/ashes/2021/docs/proposal/ashes.out
OUTPUT /home/kaiming/ucr/research/ANL/profile/AsHES-2020/ashes/2021/docs/proposal/ashes.pdf
INPUT /home/kaiming/ucr/research/ANL/profile/AsHES-2020/ashes/2021/docs/proposal/ashes.out
INPUT /home/kaiming/ucr/research/ANL/profile/AsHES-2020/ashes/2021/docs/proposal/ashes.out
OUTPUT /home/kaiming/ucr/research/ANL/profile/AsHES-2020/ashes/2021/docs/proposal/ashes.out
INPUT /usr/share/texlive/texmf-dist/tex/context/base/mkii/supp-pdf.mkii
INPUT /usr/share/texlive/texmf-dist/tex/context/base/mkii/supp-pdf.mkii
INPUT /usr/share/texlive/texmf-dist/fonts/tfm/public/cm/cmr10.tfm
INPUT /usr/share/texlive/texmf-dist/fonts/tfm/public/cm/cmr8.tfm
INPUT /usr/share/texlive/texmf-dist/fonts/tfm/public/cm/cmmi10.tfm
INPUT /usr/share/texlive/texmf-dist/fonts/tfm/public/cm/cmmi8.tfm
INPUT /usr/share/texlive/texmf-dist/fonts/tfm/public/cm/cmsy10.tfm
INPUT /usr/share/texlive/texmf-dist/fonts/tfm/public/cm/cmsy8.tfm
INPUT /usr/share/texlive/texmf-dist/fonts/tfm/adobe/times/ptmr7t.tfm
INPUT /usr/share/texlive/texmf-dist/fonts/tfm/public/cm/cmr6.tfm
INPUT /usr/share/texlive/texmf-dist/fonts/tfm/public/cm/cmmi6.tfm
INPUT /usr/share/texlive/texmf-dist/fonts/tfm/public/cm/cmsy6.tfm
INPUT /usr/share/texlive/texmf-dist/fonts/tfm/adobe/times/ptmrc7t.tfm
INPUT /usr/share/texlive/texmf-dist/tex/latex/psnfss/omsptm.fd
INPUT /usr/share/texlive/texmf-dist/tex/latex/psnfss/omsptm.fd
INPUT /usr/share/texlive/texmf-dist/fonts/vf/adobe/times/ptmr7t.vf
INPUT /usr/share/texlive/texmf-dist/fonts/tfm/adobe/times/ptmr8r.tfm
INPUT /var/lib/texmf/fonts/map/pdftex/updmap/pdftex.map
INPUT /usr/share/texlive/texmf-dist/fonts/vf/adobe/times/ptmr7t.vf
INPUT /usr/share/texlive/texmf-dist/fonts/tfm/adobe/times/ptmr8r.tfm
INPUT /usr/share/texlive/texmf-dist/fonts/vf/adobe/times/ptmr7t.vf
INPUT /usr/share/texlive/texmf-dist/fonts/tfm/adobe/times/ptmr8r.tfm
INPUT /usr/share/texlive/texmf-dist/fonts/vf/adobe/times/ptmrc7t.vf
INPUT /usr/share/texlive/texmf-dist/fonts/tfm/adobe/times/ptmr8r.tfm
INPUT /usr/share/texlive/texmf-dist/fonts/vf/adobe/times/ptmri7t.vf
INPUT /usr/share/texlive/texmf-dist/fonts/tfm/adobe/times/ptmri8r.tfm
INPUT /usr/share/texlive/texmf-dist/fonts/vf/adobe/times/ptmb7t.vf
INPUT /usr/share/texlive/texmf-dist/fonts/tfm/adobe/times/ptmb8r.tfm
INPUT /home/kaiming/ucr/research/ANL/profile/AsHES-2020/ashes/2021/docs/proposal/ashes.aux
INPUT /home/kaiming/ucr/research/ANL/profile/AsHES-2020/ashes/2021/docs/proposal/ashes.out
INPUT /home/kaiming/ucr/research/ANL/profile/AsHES-2020/ashes/2021/docs/proposal/ashes.out
INPUT /usr/share/texlive/texmf-dist/fonts/enc/dvips/base/8r.enc
INPUT /usr/share/texlive/texmf-dist/fonts/type1/public/amsfonts/cm/cmsy10.pfb
INPUT /usr/share/texlive/texmf-dist/fonts/type1/public/amsfonts/cm/cmsy7.pfb
INPUT /usr/share/texlive/texmf-dist/fonts/type1/public/amsfonts/cm/cmsy8.pfb
INPUT /usr/share/texlive/texmf-dist/fonts/type1/urw/times/utmb8a.pfb
INPUT /usr/share/texlive/texmf-dist/fonts/type1/urw/times/utmr8a.pfb
INPUT /usr/share/texlive/texmf-dist/fonts/type1/urw/times/utmri8a.pfb
