{
  "metadata": {
    "model_name": "TriNet"
  },
  "training_params": {
    "input_shape": [
      144,
      144,
      3
    ],
    "batch_size": 4,
    "optimizer": "adam",
    "learning_rate": 0.0001,
    "seg_epochs": 150,
    "clf_epochs": 50
  },
  "network_architecture": [
    {
      "category": "sequential",
      "name": "B7",
      "inputs": "default",
      "layers": [
        {
          "category": "layer",
          "name": "B7_conv_1_1",
          "type": "conv_2d",
          "num_filters": 8,
          "kernel_size": 7,
          "stride": 1,
          "padding": "same",
          "activation": "relu",
          "use_batch_norm": true
        },
        {
          "category": "layer",
          "name": "B7_conv_1_2",
          "type": "conv_2d",
          "num_filters": 8,
          "kernel_size": 7,
          "stride": 1,
          "padding": "same",
          "activation": "relu",
          "use_batch_norm": true
        },
        {
          "category": "layer",
          "name": "B7_maxpool_1",
          "type": "maxpool_2d",
          "pool_size": 2,
          "stride": 2,
          "padding": "valid"
        },
        {
          "category": "layer",
          "name": "B7_conv_2_1",
          "type": "conv_2d",
          "num_filters": 32,
          "kernel_size": 7,
          "stride": 1,
          "padding": "same",
          "activation": "relu",
          "use_batch_norm": true
        },
        {
          "category": "layer",
          "name": "B7_conv_2_2",
          "type": "conv_2d",
          "num_filters": 32,
          "kernel_size": 7,
          "stride": 1,
          "padding": "same",
          "activation": "relu",
          "use_batch_norm": true
        },
        {
          "category": "layer",
          "name": "B7_maxpool_2",
          "type": "maxpool_2d",
          "pool_size": 2,
          "stride": 1,
          "padding": "same"
        },
        {
          "category": "layer",
          "name": "B7_conv_feat",
          "type": "conv_2d",
          "num_filters": 8,
          "kernel_size": 7,
          "stride": 1,
          "padding": "same",
          "activation": "relu",
          "use_batch_norm": true
        }
      ]
    },
    {
      "category": "layer",
      "name": "B7_conv_aux",
      "type": "conv_2d",
      "inputs": "B7",
      "num_filters": 1,
      "kernel_size": 1,
      "stride": 1,
      "padding": "same",
      "activation": "sigmoid"
    },
    {
      "category": "layer",
      "name": "B7_mask",
      "type": "upsample_2d",
      "inputs": "B7_conv_aux",
      "output": true,
      "size": 2,
      "interpolation": "nearest"
    },
    {
      "category": "sequential",
      "name": "B5",
      "inputs": "default",
      "layers": [
        {
          "category": "layer",
          "name": "B5_conv_1_1",
          "type": "conv_2d",
          "num_filters": 32,
          "kernel_size": 5,
          "stride": 1,
          "padding": "same",
          "activation": "relu",
          "use_batch_norm": true
        },
        {
          "category": "layer",
          "name": "B5_maxpool_1",
          "type": "maxpool_2d",
          "pool_size": 2,
          "stride": 2,
          "padding": "valid"
        },
        {
          "category": "layer",
          "name": "B5_conv_2_1",
          "type": "conv_2d",
          "num_filters": 16,
          "kernel_size": 5,
          "stride": 1,
          "padding": "same",
          "activation": "relu",
          "use_batch_norm": true
        },
        {
          "category": "layer",
          "name": "B5_conv_2_2",
          "type": "conv_2d",
          "num_filters": 16,
          "kernel_size": 5,
          "stride": 1,
          "padding": "same",
          "activation": "relu",
          "use_batch_norm": true
        },
        {
          "category": "layer",
          "name": "B5_maxpool_2",
          "type": "maxpool_2d",
          "pool_size": 2,
          "stride": 1,
          "padding": "same"
        },
        {
          "category": "layer",
          "name": "B5_conv_feat",
          "type": "conv_2d",
          "num_filters": 8,
          "kernel_size": 5,
          "stride": 1,
          "padding": "same",
          "activation": "relu",
          "use_batch_norm": true
        }
      ]
    },
    {
      "category": "layer",
      "name": "B5_conv_aux",
      "type": "conv_2d",
      "inputs": "B5",
      "num_filters": 1,
      "kernel_size": 1,
      "stride": 1,
      "padding": "same",
      "activation": "sigmoid"
    },
    {
      "category": "layer",
      "name": "B5_mask",
      "type": "upsample_2d",
      "inputs": "B5_conv_aux",
      "output": true,
      "size": 2,
      "interpolation": "nearest"
    },
    {
      "category": "sequential",
      "name": "B3",
      "inputs": "default",
      "layers": [
        {
          "category": "layer",
          "name": "B3_conv_1_1",
          "type": "conv_2d",
          "num_filters": 32,
          "kernel_size": 3,
          "stride": 1,
          "padding": "same",
          "activation": "relu",
          "use_batch_norm": true
        },
        {
          "category": "layer",
          "name": "B3_maxpool_1",
          "type": "maxpool_2d",
          "pool_size": 2,
          "stride": 2,
          "padding": "valid"
        },
        {
          "category": "layer",
          "name": "B3_conv_2_1",
          "type": "conv_2d",
          "num_filters": 32,
          "kernel_size": 3,
          "stride": 1,
          "padding": "same",
          "activation": "relu",
          "use_batch_norm": true
        },
        {
          "category": "layer",
          "name": "B3_maxpool_2",
          "type": "maxpool_2d",
          "pool_size": 2,
          "stride": 1,
          "padding": "same"
        },
        {
          "category": "layer",
          "name": "B3_conv_feat",
          "type": "conv_2d",
          "num_filters": 16,
          "kernel_size": 3,
          "stride": 1,
          "padding": "same",
          "activation": "relu",
          "use_batch_norm": true
        }
      ]
    },
    {
      "category": "layer",
      "name": "B3_conv_aux",
      "type": "conv_2d",
      "inputs": "B3",
      "num_filters": 1,
      "kernel_size": 1,
      "stride": 1,
      "padding": "same",
      "activation": "sigmoid"
    },
    {
      "category": "layer",
      "name": "B3_mask",
      "type": "upsample_2d",
      "inputs": "B3_conv_aux",
      "output": true,
      "size": 2,
      "interpolation": "nearest"
    },
    {
      "category": "layer",
      "name": "B7_B5_B3_concat",
      "inputs": [
        "B7",
        "B5",
        "B3"
      ],
      "type": "concat",
      "axis": -1
    },
    {
      "category": "sequential",
      "name": "A",
      "inputs": "B7_B5_B3_concat",
      "layers": [
        {
          "category": "layer",
          "name": "A_conv_1",
          "type": "conv_2d",
          "num_filters": 192,
          "kernel_size": 3,
          "stride": 1,
          "padding": "same",
          "activation": "relu",
          "use_batch_norm": true
        },
        {
          "category": "layer",
          "name": "A_conv_2_1",
          "type": "conv_2d",
          "num_filters": 128,
          "kernel_size": 3,
          "stride": 1,
          "padding": "same",
          "activation": "relu",
          "use_batch_norm": true
        },
        {
          "category": "layer",
          "name": "A_conv_2_2",
          "type": "conv_2d",
          "num_filters": 128,
          "kernel_size": 3,
          "stride": 1,
          "padding": "same",
          "activation": "relu",
          "use_batch_norm": true
        },
        {
          "category": "layer",
          "name": "A_maxpool",
          "type": "maxpool_2d",
          "pool_size": 2,
          "stride": 2,
          "padding": "valid"
        },
        {
          "category": "layer",
          "name": "A_conv_3",
          "type": "conv_2d",
          "num_filters": 64,
          "kernel_size": 3,
          "stride": 1,
          "padding": "same",
          "activation": "relu",
          "use_batch_norm": true
        },
        {
          "category": "layer",
          "name": "A_conv_4_1",
          "type": "conv_2d",
          "num_filters": 8,
          "kernel_size": 3,
          "stride": 1,
          "padding": "same",
          "activation": "relu",
          "use_batch_norm": true
        },
        {
          "category": "layer",
          "name": "A_upsample",
          "type": "upsample_2d",
          "size": 2,
          "interpolation": "nearest"
        }
      ]
    },
    {
      "category": "layer",
      "name": "A_conv_aux",
      "inputs": "A",
      "type": "conv_2d",
      "num_filters": 1,
      "kernel_size": 1,
      "stride": 1,
      "padding": "same",
      "activation": "sigmoid"
    },
    {
      "category": "layer",
      "name": "A_mask",
      "type": "upsample_2d",
      "inputs": "A_conv_aux",
      "output": true,
      "size": 2,
      "interpolation": "nearest"
    },
    {
      "category": "layer",
      "name": "aux_all_concat",
      "inputs": [
        "B7",
        "B5",
        "B3",
        "A",
        "B7_conv_aux",
        "B5_conv_aux",
        "B3_conv_aux",
        "A_conv_aux"
      ],
      "type": "concat",
      "axis": -1
    },
    {
      "category": "sequential",
      "name": "final_seq",
      "inputs": "aux_all_concat",
      "layers": [
        {
          "category": "layer",
          "name": "final_seq_conv_1",
          "type": "conv_2d",
          "num_filters": 32,
          "kernel_size": 5,
          "stride": 1,
          "padding": "same",
          "activation": "relu",
          "use_batch_norm": true
        },
        {
          "category": "layer",
          "name": "final_seq_conv_2",
          "type": "conv_2d",
          "num_filters": 16,
          "kernel_size": 7,
          "stride": 1,
          "padding": "same",
          "activation": "relu",
          "use_batch_norm": true
        },
        {
          "category": "layer",
          "name": "final_seq_upsample",
          "type": "upsample_2d",
          "size": 2,
          "interpolation": "nearest"
        }
      ]
    },
    {
      "category": "layer",
      "name": "final_mask",
      "inputs": "final_seq",
      "output": true,
      "type": "conv_2d",
      "num_filters": 1,
      "kernel_size": 1,
      "stride": 1,
      "padding": "same",
      "activation": "sigmoid"
    },
    {
      "category": "layer",
      "name": "B7_global",
      "inputs": "B7_conv_aux",
      "type": "global_maxpool_2d"
    },
    {
      "category": "layer",
      "name": "B5_global",
      "inputs": "B5_conv_aux",
      "type": "global_maxpool_2d"
    },
    {
      "category": "layer",
      "name": "B3_global",
      "inputs": "B3_conv_aux",
      "type": "global_maxpool_2d"
    },
    {
      "category": "layer",
      "name": "A_global",
      "inputs": "A_conv_aux",
      "type": "global_maxpool_2d"
    },
    {
      "category": "layer",
      "name": "final_mask_global",
      "inputs": "final_mask",
      "type": "global_maxpool_2d"
    },
    {
      "category": "layer",
      "name": "global_concat",
      "inputs": [
        "B7_global",
        "B5_global",
        "B3_global",
        "A_global",
        "final_mask_global"
      ],
      "type": "concat",
      "axis": -1
    },
    {
      "category": "layer",
      "name": "clf_stop_grad",
      "inputs": "global_concat",
      "type": "stop_grad"
    },
    {
      "category": "layer",
      "name": "clf_dense",
      "inputs": "clf_stop_grad",
      "output": true,
      "type": "dense",
      "num_units": 1,
      "activation": "sigmoid"
    }
  ]
}