{
    "metadata": {
        "model_name": "MixedSupervision"
    },

    "training_params": {
        "input_shape": [640, 232, 3],
        "batch_size": 4,
        "optimizer": "adam",
        "learning_rate": 0.0001,
        "learning_decay": false,
        "epochs": 60,
        "dil_ksize": 15,
        "dist_trans_w": 3.0,
        "dist_trans_p": 2.0,
        "delta": 1.0
    },

    "network_architecture": [
        {
            "category": "sequential",
            "name": "seg_seq",
            "inputs": "default",
            "layers": [
                {
                    "category": "layer",
                    "name": "seg_conv_1_1",
                    "type": "conv_2d",
                    "num_filters": 32,
                    "kernel_size": 5,
                    "stride": 1,
                    "padding": "same",
                    "activation": "relu"
                },
                {
                    "category": "layer",
                    "name": "seg_conv_1_2",
                    "type": "conv_2d",
                    "num_filters": 32,
                    "kernel_size": 5,
                    "stride": 1,
                    "padding": "same",
                    "activation": "relu"
                },
                {
                    "category": "layer",
                    "name": "seg_maxpool_1",
                    "type": "maxpool_2d",
                    "pool_size": 2,
                    "stride": 2,
                    "padding": "valid"
                },
                {
                    "category": "layer",
                    "name": "seg_conv_2_1",
                    "type": "conv_2d",
                    "num_filters": 64,
                    "kernel_size": 5,
                    "stride": 1,
                    "padding": "same",
                    "activation": "relu"
                },
                {
                    "category": "layer",
                    "name": "seg_conv_2_2",
                    "type": "conv_2d",
                    "num_filters": 64,
                    "kernel_size": 5,
                    "stride": 1,
                    "padding": "same",
                    "activation": "relu"
                },
                {
                    "category": "layer",
                    "name": "seg_conv_2_3",
                    "type": "conv_2d",
                    "num_filters": 64,
                    "kernel_size": 5,
                    "stride": 1,
                    "padding": "same",
                    "activation": "relu"
                },
                {
                    "category": "layer",
                    "name": "seg_maxpool_2",
                    "type": "maxpool_2d",
                    "pool_size": 2,
                    "stride": 2,
                    "padding": "valid"
                },
                {
                    "category": "layer",
                    "name": "seg_conv_3_1",
                    "type": "conv_2d",
                    "num_filters": 64,
                    "kernel_size": 5,
                    "stride": 1,
                    "padding": "same",
                    "activation": "relu"
                },
                {
                    "category": "layer",
                    "name": "seg_conv_3_2",
                    "type": "conv_2d",
                    "num_filters": 64,
                    "kernel_size": 5,
                    "stride": 1,
                    "padding": "same",
                    "activation": "relu"
                },
                {
                    "category": "layer",
                    "name": "seg_conv_3_3",
                    "type": "conv_2d",
                    "num_filters": 64,
                    "kernel_size": 5,
                    "stride": 1,
                    "padding": "same",
                    "activation": "relu"
                },
                {
                    "category": "layer",
                    "name": "seg_conv_3_4",
                    "type": "conv_2d",
                    "num_filters": 64,
                    "kernel_size": 5,
                    "stride": 1,
                    "padding": "same",
                    "activation": "relu"
                },
                {
                    "category": "layer",
                    "name": "seg_maxpool_3",
                    "type": "maxpool_2d",
                    "pool_size": 2,
                    "stride": 2,
                    "padding": "valid"
                }
            ]
        },
        {
            "category": "layer",
            "name": "seg_conv_feat",
            "type": "conv_2d",
            "inputs": "seg_seq",
            "num_filters": 1024,
            "kernel_size": 5,
            "stride": 1,
            "padding": "same",
            "activation": "relu"
        },
        {
            "category": "layer",
            "name": "seg_conv_mask",
            "type": "conv_2d",
            "inputs": "seg_conv_feat",
            "num_filters": 1,
            "kernel_size": 1,
            "stride": 1,
            "padding": "same",
            "activation": "linear",
            "output": true
        },
        {
            "category": "layer",
            "name": "sf_stop_grad",
            "inputs": "seg_conv_feat",
            "type": "stop_grad"
        },
        {
            "category": "layer",
            "name": "sh_stop_grad",
            "inputs": "seg_conv_mask",
            "type": "stop_grad"
        },
        {
            "category": "layer",
            "name": "sf_sh_concat",
            "inputs": ["sf_stop_grad", "sh_stop_grad"],
            "type": "concat",
            "axis": -1
        },
        {
            "category": "sequential",
            "name": "clf_seq",
            "inputs": "sf_sh_concat",
            "layers": [
                {
                    "category": "layer",
                    "name": "clf_maxpool_1",
                    "type": "maxpool_2d",
                    "pool_size": 2,
                    "stride": 2,
                    "padding": "valid"
                },
                {
                    "category": "layer",
                    "name": "clf_conv_1",
                    "type": "conv_2d",
                    "num_filters": 8,
                    "kernel_size": 5,
                    "stride": 1,
                    "padding": "same",
                    "activation": "relu"
                },
                {
                    "category": "layer",
                    "name": "clf_maxpool_2",
                    "type": "maxpool_2d",
                    "pool_size": 2,
                    "stride": 2,
                    "padding": "valid"
                },
                {
                    "category": "layer",
                    "name": "clf_conv_2",
                    "type": "conv_2d",
                    "num_filters": 16,
                    "kernel_size": 5,
                    "stride": 1,
                    "padding": "same",
                    "activation": "relu"
                },
                {
                    "category": "layer",
                    "name": "clf_maxpool_3",
                    "type": "maxpool_2d",
                    "pool_size": 2,
                    "stride": 2,
                    "padding": "valid"
                },
                {
                    "category": "layer",
                    "name": "clf_conv_3",
                    "type": "conv_2d",
                    "num_filters": 32,
                    "kernel_size": 5,
                    "stride": 1,
                    "padding": "same",
                    "activation": "relu"
                }
            ]
        },
        {
            "category": "layer",
            "name": "cf_global_avg",
            "inputs": "clf_seq",
            "type": "global_avgpool_2d"
        },
        {
            "category": "layer",
            "name": "cf_global_max",
            "inputs": "clf_seq",
            "type": "global_maxpool_2d"
        },
        {
            "category": "layer",
            "name": "sh_global_avg",
            "inputs": "sh_stop_grad",
            "type": "global_avgpool_2d"
        },
        {
            "category": "layer",
            "name": "sh_global_max",
            "inputs": "sh_stop_grad",
            "type": "global_maxpool_2d"
        },
        {
            "category": "layer",
            "name": "clf_feat_concat",
            "inputs": ["cf_global_avg", "cf_global_max", "sh_global_avg", "sh_global_max"],
            "type": "concat",
            "axis": -1
        },
        {
            "category": "layer",
            "name": "clf_dense",
            "inputs": "clf_feat_concat",
            "output": true,
            "type": "dense",
            "num_units": 1,
            "activation": "linear"
        }
    ]
}
