%YAML 1.1
%TAG !u! tag:unity3d.com,2011:
--- !u!1001 &4538489604951756983
PrefabInstance:
  m_ObjectHideFlags: 0
  serializedVersion: 2
  m_Modification:
    m_TransformParent: {fileID: 0}
    m_Modifications:
    - target: {fileID: 5820912372599814438, guid: 5d18b6e68c889cc42ba628f188b8e71a,
        type: 3}
      propertyPath: m_Name
      value: stone3
      objectReference: {fileID: 0}
    - target: {fileID: 6291273775575030695, guid: 5d18b6e68c889cc42ba628f188b8e71a,
        type: 3}
      propertyPath: m_LocalPosition.x
      value: -0.26011
      objectReference: {fileID: 0}
    - target: {fileID: 6291273775575030695, guid: 5d18b6e68c889cc42ba628f188b8e71a,
        type: 3}
      propertyPath: m_LocalPosition.y
      value: -0.027983
      objectReference: {fileID: 0}
    - target: {fileID: 6291273775575030695, guid: 5d18b6e68c889cc42ba628f188b8e71a,
        type: 3}
      propertyPath: m_LocalPosition.z
      value: 0.031275
      objectReference: {fileID: 0}
    - target: {fileID: 6291273775575030695, guid: 5d18b6e68c889cc42ba628f188b8e71a,
        type: 3}
      propertyPath: m_LocalRotation.x
      value: 0
      objectReference: {fileID: 0}
    - target: {fileID: 6291273775575030695, guid: 5d18b6e68c889cc42ba628f188b8e71a,
        type: 3}
      propertyPath: m_LocalRotation.y
      value: 0
      objectReference: {fileID: 0}
    - target: {fileID: 6291273775575030695, guid: 5d18b6e68c889cc42ba628f188b8e71a,
        type: 3}
      propertyPath: m_LocalRotation.z
      value: 0
      objectReference: {fileID: 0}
    - target: {fileID: 6291273775575030695, guid: 5d18b6e68c889cc42ba628f188b8e71a,
        type: 3}
      propertyPath: m_LocalRotation.w
      value: 1
      objectReference: {fileID: 0}
    - target: {fileID: 6291273775575030695, guid: 5d18b6e68c889cc42ba628f188b8e71a,
        type: 3}
      propertyPath: m_RootOrder
      value: 0
      objectReference: {fileID: 0}
    - target: {fileID: 6291273775575030695, guid: 5d18b6e68c889cc42ba628f188b8e71a,
        type: 3}
      propertyPath: m_LocalEulerAnglesHint.x
      value: 0
      objectReference: {fileID: 0}
    - target: {fileID: 6291273775575030695, guid: 5d18b6e68c889cc42ba628f188b8e71a,
        type: 3}
      propertyPath: m_LocalEulerAnglesHint.y
      value: 0
      objectReference: {fileID: 0}
    - target: {fileID: 6291273775575030695, guid: 5d18b6e68c889cc42ba628f188b8e71a,
        type: 3}
      propertyPath: m_LocalEulerAnglesHint.z
      value: 0
      objectReference: {fileID: 0}
    - target: {fileID: 6291273775575030695, guid: 5d18b6e68c889cc42ba628f188b8e71a,
        type: 3}
      propertyPath: m_LocalScale.x
      value: 0.96968293
      objectReference: {fileID: 0}
    - target: {fileID: 6291273775575030695, guid: 5d18b6e68c889cc42ba628f188b8e71a,
        type: 3}
      propertyPath: m_LocalScale.y
      value: 0.96968293
      objectReference: {fileID: 0}
    - target: {fileID: 6291273775575030695, guid: 5d18b6e68c889cc42ba628f188b8e71a,
        type: 3}
      propertyPath: m_LocalScale.z
      value: 0.96968293
      objectReference: {fileID: 0}
    - target: {fileID: 8904251858885250631, guid: 5d18b6e68c889cc42ba628f188b8e71a,
        type: 3}
      propertyPath: m_Materials.Array.data[0]
      value: 
      objectReference: {fileID: 2100000, guid: 92769164913ec60fa99e9062d7cde5ae, type: 2}
    - target: {fileID: 2243634415451123023, guid: 5d18b6e68c889cc42ba628f188b8e71a,
        type: 3}
      propertyPath: m_Enabled
      value: 1
      objectReference: {fileID: 0}
    m_RemovedComponents: []
  m_SourcePrefab: {fileID: 100100000, guid: 5d18b6e68c889cc42ba628f188b8e71a, type: 3}
