// Jest Snapshot v1, https://goo.gl/fbAQLP

exports[`MapContainer render snapshot 1`] = `
"<Wrapper location={{...}} google={{...}}>
  <DefaultLoadingContainer>
    <div>
      Loading...
    </div>
  </DefaultLoadingContainer>
</Wrapper>"
`;
