<svg width="25" height="78" viewBox="0 0 25 78" fill="none" xmlns="http://www.w3.org/2000/svg">
<g clip-path="url(#clip0)">
<path d="M6.12636 76.032C6.88567 75.3285 6.94994 73.4749 6.22067 70.7873C5.78376 69.0443 5.82952 68.2985 7.18665 55.3863C8.51827 42.4062 8.6184 41.764 9.4099 40.4438C9.8498 39.6741 10.4442 38.3659 10.7006 37.479C11.8502 33.6834 14.2998 31.493 17.1727 31.795C18.4316 31.9273 18.8054 32.0972 19.2796 32.865C20.3145 34.5077 19.4739 37.2261 17.7683 37.9281C16.6131 38.3615 16.4807 39.0003 16.9432 41.4314C17.1948 42.7633 16.9897 45.6465 15.7378 57.5579L14.2178 72.0195L14.9126 71.9294C16.0084 71.7508 16.4842 72.1924 16.379 73.1931C16.3044 73.9033 16.0835 74.1412 15.4533 74.2381C14.7907 74.3317 14.6803 74.4506 14.9335 74.8362C15.3821 75.5361 16.393 75.5445 16.855 74.875C17.441 73.9575 17.4731 72.7207 16.9088 71.258C16.37 69.8632 16.3646 67.7413 16.9083 68.1574C17.0595 68.2712 17.1734 68.7401 17.1293 69.1597C17.0818 69.6117 17.3062 70.5817 17.5867 71.3292C18.0014 72.3519 18.0558 73.0756 17.8317 73.9659C17.3631 75.9402 18.6917 75.7208 19.3896 73.738C19.5798 73.1705 19.5049 72.0204 19.1156 70.4455L18.5494 68.0688L19.8998 55.2212C21.1483 43.3421 21.296 42.2479 22.1129 40.3756C22.9722 38.4098 22.979 38.3452 22.6133 35.9243C21.848 30.7851 21.5235 30.4573 16.9397 29.9755C13.2886 29.6244 12.6124 29.847 10.6591 32.2853C8.15018 35.3506 7.13438 36.3209 5.98257 36.722C4.65917 37.203 4.21248 38.0372 4.58647 39.4473C4.77685 40.12 4.40704 43.6386 3.21742 52.1624C1.05038 68.1225 0.689586 74.971 2.06077 75.8984C2.82028 76.4351 4.05034 76.5318 4.58543 76.0985C5.19188 75.6074 5.23928 74.5354 4.71571 72.6853C4.48112 71.8121 4.25156 70.5804 4.2124 70.0214C4.032 68.0116 4.58601 68.951 5.23714 71.761C5.68258 73.7334 5.78979 74.8869 5.58942 75.5513C5.20564 76.7185 5.26681 76.7576 6.12636 76.032ZM2.32211 74.0329C2.33219 73.316 2.50203 72.9422 2.8384 72.847C3.57571 72.6634 4.2792 73.4227 4.18421 74.3265C4.08921 75.2304 3.76815 75.4904 2.94243 75.273C2.46501 75.1576 2.30525 74.8144 2.32211 74.0329Z" fill="#4338CA"/>
<path d="M3.55556 74.0973C3.59288 73.7422 3.46202 73.4347 3.30061 73.4178C3.10693 73.3974 2.94728 73.6744 2.90996 74.0294C2.87263 74.3845 2.97122 74.6886 3.1649 74.709C3.3263 74.7259 3.51824 74.4524 3.55556 74.0973Z" fill="#4338CA"/>
<path d="M12.3866 73.9158C14.833 73.6181 15.5737 73.4022 15.7215 72.9282C15.8267 72.5476 15.7112 72.4049 15.4428 72.4746C15.1743 72.5443 13.2937 72.7383 11.2482 72.9476C8.77282 73.2096 7.53773 73.4714 7.50719 73.762C7.44612 74.343 8.61839 74.3683 12.3866 73.9158Z" fill="#4338CA"/>
<path d="M7.21403 35.2522C9.22869 33.4731 9.33058 33.1248 9.87497 27.0137L10.3787 21.2899L9.44253 21.1915C7.40887 20.9777 7.50396 20.694 6.73729 28.6094C6.31997 32.5799 6.10642 35.8538 6.23554 35.8674C6.36466 35.881 6.81824 35.6023 7.21403 35.2522ZM7.8512 24.8427C8.03615 23.3935 7.965 24.6915 7.64947 27.6936C7.33055 30.7279 7.14385 31.8832 7.27442 30.3304C7.37272 28.7741 7.63396 26.2886 7.8512 24.8427Z" fill="#4338CA"/>
<path d="M18.806 35.8178C19.0217 35.3183 19.1031 34.5436 18.9926 34.0424L18.8294 33.1114L18.6053 34.0017C18.4898 34.4791 18.4084 35.2539 18.4186 35.7771L18.4562 36.6623L18.806 35.8178Z" fill="#4338CA"/>
<path d="M22.2568 26.5853L22.6775 22.5825L21.2249 22.4298L19.7723 22.2771L19.3991 25.828C19.1276 28.4104 19.1159 29.4536 19.3997 29.5487C19.6188 29.637 20.2764 29.9019 20.8048 30.1533L21.8361 30.588L22.2568 26.5853ZM20.2162 25.1958C20.3621 24.4279 20.369 24.9835 20.2197 26.4038C20.0705 27.8241 19.9414 28.4307 19.9447 27.7783C19.9514 27.0936 20.0736 25.9315 20.2162 25.1958Z" fill="#4338CA"/>
<path d="M9.79751 20.6087C11.2705 20.5677 12.0486 19.9967 11.0393 19.6622C10.691 19.5603 11.1225 19.1813 12.473 18.4421C14.2058 17.4819 14.5711 17.4224 15.9456 17.6974C17.6683 18.0743 20.2459 19.9444 19.6395 20.4355C19.4611 20.58 19.2624 20.9181 19.2386 21.144C19.2013 21.4991 19.6787 21.6146 21.2027 21.7095L23.2465 21.8264L23.4994 20.3517C23.7761 18.651 23.5382 18.4302 20.633 18.1248C19.019 17.9552 18.9289 17.8804 18.1931 16.4976C17.4861 15.1505 17.2737 14.9976 15.8958 14.7549C14.4857 14.5087 14.3498 14.5597 13.3815 15.6982C12.2638 17.0167 10.8759 17.4909 9.14628 17.1786C8.56863 17.0853 7.88055 17.1109 7.64102 17.2162C7.19423 17.4304 6.91079 19.1956 7.14199 20.1011C7.27799 20.6702 7.40711 20.6838 9.79751 20.6087Z" fill="#4338CA"/>
<path d="M22.9061 17.6131C22.7616 17.4347 22.1551 17.3057 21.5673 17.3092C20.4918 17.2941 20.4884 17.3263 21.7984 17.5946C22.5306 17.7694 23.0505 17.7914 22.9061 17.6131Z" fill="#4338CA"/>
<path d="M10.9199 16.4512C10.9369 16.2898 10.3728 16.0673 9.66259 15.9927C8.95243 15.918 8.35442 16.0184 8.33745 16.1798C8.31709 16.3734 8.88457 16.5636 9.59474 16.6383C10.3049 16.7129 10.8995 16.6449 10.9199 16.4512Z" fill="#4338CA"/>
<path d="M16.8335 13.907C16.9762 13.7914 17.3546 11.1223 17.6871 7.95884L18.2265 2.20615L17.4721 1.93104C15.9022 1.34176 15.6865 1.84128 15.1319 8.04929L14.6317 13.7408L15.5899 13.9394C16.1319 14.0617 16.6874 14.0548 16.8335 13.907Z" fill="#4338CA"/>
</g>
<defs>
<clipPath id="clip0">
<rect width="25" height="78" fill="white"/>
</clipPath>
</defs>
</svg>
