<svg xmlns="http://www.w3.org/2000/svg" width="36" height="36" viewBox="0 0 36 36">
    <path d="M34.013 0H1.987A1.986 1.986 0 0 0 0 1.987v32.026A1.987 1.987 0 0 0 1.987 36h17.241V22.059h-4.687v-5.433h4.691v-4.007c0-4.65 2.84-7.182 6.988-7.182a38.513 38.513 0 0 1 4.192.214v4.859h-2.876c-2.256 0-2.693 1.072-2.693 2.645v3.469h5.38l-.7 5.433h-4.68V36h9.174a1.987 1.987 0 0 0 1.987-1.987V1.99A1.987 1.987 0 0 0 34.013 0z"/>
</svg>
