<svg width="1440" height="200" viewBox="0 0 1440 200" version="1.1" xmlns="http://www.w3.org/2000/svg" xmlns:xlink="http://www.w3.org/1999/xlink">
<title>Page 1</title>
<desc>Created using Figma</desc>
<g id="Canvas" transform="translate(-477 425)">
<g id="Page 1">
<g id="Stroke 1">
<use xlink:href="#path0_stroke" transform="translate(1037 -383)" fill="#947B21"/>
</g>
<mask id="mask0_outline" mask-type="alpha">
<g id="Clip 4">
<use xlink:href="#path1_fill" transform="translate(477 -425)" fill="#FFFFFF"/>
</g>
</mask>
<g id="Stroke 3" mask="url(#mask0_outline)">
<use xlink:href="#path2_stroke" transform="translate(1352 -419)" fill="#947B21"/>
</g>
<g id="Stroke 5" mask="url(#mask0_outline)">
<use xlink:href="#path2_stroke" transform="translate(872 -419)" fill="#947B21"/>
</g>
<g id="Stroke 6" mask="url(#mask0_outline)">
<use xlink:href="#path3_stroke" transform="translate(1042 -249)" fill="#947B21"/>
</g>
<g id="Stroke 7" mask="url(#mask0_outline)">
<use xlink:href="#path4_stroke" transform="translate(872 -334)" fill="#947B21"/>
</g>
<g id="Stroke 8" mask="url(#mask0_outline)">
<use xlink:href="#path5_stroke" transform="translate(1352 -334)" fill="#947B21"/>
</g>
<g id="Stroke 9" mask="url(#mask0_outline)">
<use xlink:href="#path6_stroke" transform="translate(1194 -383)" fill="#947B21"/>
</g>
<g id="Stroke 10" mask="url(#mask0_outline)">
<use xlink:href="#path7_stroke" transform="translate(1194 -419)" fill="#947B21"/>
</g>
<g id="Stroke 11" mask="url(#mask0_outline)">
<use xlink:href="#path8_stroke" transform="translate(549 -418)" fill="#947B21"/>
</g>
<g id="Stroke 12" mask="url(#mask0_outline)">
<use xlink:href="#path9_stroke" transform="translate(872 -419)" fill="#947B21"/>
</g>
<g id="Stroke 13" mask="url(#mask0_outline)">
<use xlink:href="#path10_stroke" transform="translate(1352 -419)" fill="#947B21"/>
</g>
<g id="Stroke 14" mask="url(#mask0_outline)">
<use xlink:href="#path11_stroke" transform="translate(1724 -338)" fill="#947B21"/>
</g>
<g id="Stroke 15" mask="url(#mask0_outline)">
<use xlink:href="#path12_stroke" transform="translate(1820 -423)" fill="#947B21"/>
</g>
<g id="Stroke 16" mask="url(#mask0_outline)">
<use xlink:href="#path13_stroke" transform="translate(1521 -419)" fill="#947B21"/>
</g>
<g id="Stroke 17" mask="url(#mask0_outline)">
<use xlink:href="#path14_stroke" transform="translate(1521 -423)" fill="#947B21"/>
</g>
<g id="Stroke 18" mask="url(#mask0_outline)">
<use xlink:href="#path11_stroke" transform="translate(574 -338)" fill="#947B21"/>
</g>
<g id="Stroke 19" mask="url(#mask0_outline)">
<use xlink:href="#path15_stroke" transform="translate(478 -423)" fill="#947B21"/>
</g>
<g id="Stroke 20" mask="url(#mask0_outline)">
<use xlink:href="#path16_stroke" transform="translate(669 -419)" fill="#947B21"/>
</g>
<g id="Stroke 21" mask="url(#mask0_outline)">
<use xlink:href="#path17_stroke" transform="translate(478 -423)" fill="#947B21"/>
</g>
<g id="Stroke 22" mask="url(#mask0_outline)">
<use xlink:href="#path18_stroke" transform="translate(612 -397)" fill="#947B21"/>
</g>
<g id="Stroke 23" mask="url(#mask0_outline)">
<use xlink:href="#path18_stroke" transform="translate(1666 -397)" fill="#947B21"/>
</g>
<g id="Stroke 24" mask="url(#mask0_outline)">
<use xlink:href="#path19_stroke" transform="translate(1521 -419)" fill="#947B21"/>
</g>
<g id="Stroke 25" mask="url(#mask0_outline)">
<use xlink:href="#path20_stroke" transform="translate(669 -419)" fill="#947B21"/>
</g>
<g id="Stroke 26" mask="url(#mask0_outline)">
<use xlink:href="#path21_stroke" transform="translate(670 -397)" fill="#947B21"/>
</g>
<g id="Stroke 27" mask="url(#mask0_outline)">
<use xlink:href="#path21_stroke" transform="translate(1724 -397)" fill="#947B21"/>
</g>
<g id="Stroke 28" mask="url(#mask0_outline)">
<use xlink:href="#path22_stroke" transform="translate(1820 -423)" fill="#947B21"/>
</g>
<g id="Stroke 29" mask="url(#mask0_outline)">
<use xlink:href="#path23_stroke" transform="translate(478 -423)" fill="#947B21"/>
</g>
<g id="Stroke 30" mask="url(#mask0_outline)">
<use xlink:href="#path24_stroke" transform="translate(669 -419)" fill="#947B21"/>
</g>
<g id="Stroke 31" mask="url(#mask0_outline)">
<use xlink:href="#path25_stroke" transform="translate(1352 -419)" fill="#947B21"/>
</g>
<g id="Stroke 32" mask="url(#mask0_outline)">
<use xlink:href="#path26_stroke" transform="translate(872 -383)" fill="#947B21"/>
</g>
<g id="Stroke 33" mask="url(#mask0_outline)">
<use xlink:href="#path27_stroke" transform="translate(1194 -249)" fill="#947B21"/>
</g>
<g id="Stroke 34" mask="url(#mask0_outline)">
<use xlink:href="#path28_stroke" transform="translate(1194 -383)" fill="#947B21"/>
</g>
<g id="Stroke 35" mask="url(#mask0_outline)">
<use xlink:href="#path29_stroke" transform="translate(1042 -383)" fill="#947B21"/>
</g>
<g id="Stroke 36" mask="url(#mask0_outline)">
<use xlink:href="#path30_stroke" transform="translate(1194 -383)" fill="#947B21"/>
</g>
<g id="Stroke 37" mask="url(#mask0_outline)">
<use xlink:href="#path31_stroke" transform="translate(1118 -383)" fill="#947B21"/>
</g>
<g id="Stroke 38" mask="url(#mask0_outline)">
<use xlink:href="#path32_stroke" transform="translate(1194 -383)" fill="#947B21"/>
</g>
<g id="Stroke 39" mask="url(#mask0_outline)">
<use xlink:href="#path33_stroke" transform="translate(1276 -419)" fill="#947B21"/>
</g>
<g id="Stroke 40" mask="url(#mask0_outline)">
<use xlink:href="#path34_stroke" transform="translate(872 -419)" fill="#947B21"/>
</g>
<g id="Stroke 41" mask="url(#mask0_outline)">
<use xlink:href="#path35_stroke" transform="translate(778 -419)" fill="#947B21"/>
</g>
<g id="Stroke 42" mask="url(#mask0_outline)">
<use xlink:href="#path35_stroke" transform="translate(1623 -419)" fill="#947B21"/>
</g>
<g id="Stroke 43" mask="url(#mask0_outline)">
<use xlink:href="#path36_stroke" transform="translate(1352 -419)" fill="#947B21"/>
</g>
<g id="Stroke 44" mask="url(#mask0_outline)">
<use xlink:href="#path37_stroke" transform="translate(778 -419)" fill="#947B21"/>
</g>
<g id="Stroke 45" mask="url(#mask0_outline)">
<use xlink:href="#path38_stroke" transform="translate(754 -277)" fill="#947B21"/>
</g>
<g id="Stroke 46" mask="url(#mask0_outline)">
<use xlink:href="#path38_stroke" transform="translate(1599 -277)" fill="#947B21"/>
</g>
<g id="Stroke 47" mask="url(#mask0_outline)">
<use xlink:href="#path39_stroke" transform="translate(1042 -249)" fill="#947B21"/>
</g>
<g id="Stroke 48" mask="url(#mask0_outline)">
<use xlink:href="#path40_stroke" transform="translate(1197 -249)" fill="#947B21"/>
</g>
</g>
</g>
<defs>
<path id="path0_stroke" d="M 0.7825 158C 0.7825 71.1684 70.9492 0.7825 157.5 0.7825L 157.5 -0.7825C 70.0802 -0.7825 -0.7825 70.3087 -0.7825 158L 0.7825 158ZM 157.5 0.7825C 244.05 0.7825 314.217 71.1684 314.217 158L 315.783 158C 315.783 70.3087 244.919 -0.7825 157.5 -0.7825L 157.5 0.7825Z"/>
<path id="path1_fill" fill-rule="evenodd" d="M 0 200L 1440 200L 1440 0L 0 0L 0 200Z"/>
<path id="path2_stroke" d="M 0 170L -0.7825 170L -0.7825 170.783L 0 170.783L 0 170ZM 170 170L 170 170.783L 170.783 170.783L 170.783 170L 170 170ZM 170 0L 170.783 0L 170.783 -0.7825L 170 -0.7825L 170 0ZM 0 0L 0 -0.7825L -0.7825 -0.7825L -0.7825 0L 0 0ZM 0 170.783L 170 170.783L 170 169.217L 0 169.217L 0 170.783ZM 170.783 170L 170.783 0L 169.217 0L 169.217 170L 170.783 170ZM 170 -0.7825L 0 -0.7825L 0 0.7825L 170 0.7825L 170 -0.7825ZM -0.7825 0L -0.7825 170L 0.7825 170L 0.7825 0L -0.7825 0Z"/>
<path id="path3_stroke" d="M 318 -0.7825L 0 -0.7825L 0 0.7825L 318 0.7825L 318 -0.7825Z"/>
<path id="path4_stroke" d="M 170.35 84.3001L 0.349945 -0.699889L -0.349945 0.699889L 169.65 85.6999L 170.35 84.3001Z"/>
<path id="path5_stroke" d="M 0.349945 85.6999L 170.35 0.699889L 169.65 -0.699889L -0.349945 84.3001L 0.349945 85.6999Z"/>
<path id="path6_stroke" d="M 0.7825 134L 0.7825 0L -0.7825 0L -0.7825 134L 0.7825 134Z"/>
<path id="path7_stroke" d="M 0.573171 170.533L 158.573 0.532712L 157.427 -0.532712L -0.573171 169.467L 0.573171 170.533Z"/>
<path id="path8_stroke" d="M 152.583 169.478L 0.583331 -0.521566L -0.583331 0.521566L 151.417 170.522L 152.583 169.478Z"/>
<path id="path9_stroke" d="M 0.7825 170C 0.7825 76.4675 76.4675 0.7825 170 0.7825L 170 -0.7825C 75.6032 -0.7825 -0.7825 75.6032 -0.7825 170L 0.7825 170Z"/>
<path id="path10_stroke" d="M 170.783 170C 170.783 75.6032 94.3968 -0.7825 0 -0.7825L 0 0.7825C 93.5325 0.7825 169.217 76.4675 169.217 170L 170.783 170Z"/>
<path id="path11_stroke" d="M 0 96L -0.7825 96L -0.7825 96.7825L 0 96.7825L 0 96ZM 96 96L 96 96.7825L 96.7825 96.7825L 96.7825 96L 96 96ZM 96 0L 96.7825 0L 96.7825 -0.7825L 96 -0.7825L 96 0ZM 0 0L 0 -0.7825L -0.7825 -0.7825L -0.7825 0L 0 0ZM 0 96.7825L 96 96.7825L 96 95.2175L 0 95.2175L 0 96.7825ZM 96.7825 96L 96.7825 0L 95.2175 0L 95.2175 96L 96.7825 96ZM 96 -0.7825L 0 -0.7825L 0 0.7825L 96 0.7825L 96 -0.7825ZM -0.7825 0L -0.7825 96L 0.7825 96L 0.7825 0L -0.7825 0Z"/>
<path id="path12_stroke" d="M 96 96.1048L 96.5184 96.691L 96.7825 96.4574L 96.7825 96.1048L 96 96.1048ZM 0 181L -0.7825 181L -0.7825 182.737L 0.518369 181.586L 0 181ZM 0 84.8952L -0.518369 84.309L -0.7825 84.5426L -0.7825 84.8952L 0 84.8952ZM 96 0L 96.7825 0L 96.7825 -1.73656L 95.4816 -0.586174L 96 0ZM 95.4816 95.5186L -0.518369 180.414L 0.518369 181.586L 96.5184 96.691L 95.4816 95.5186ZM 0.7825 181L 0.7825 84.8952L -0.7825 84.8952L -0.7825 181L 0.7825 181ZM 0.518369 85.4814L 96.5184 0.586174L 95.4816 -0.586174L -0.518369 84.309L 0.518369 85.4814ZM 95.2175 0L 95.2175 96.1048L 96.7825 96.1048L 96.7825 0L 95.2175 0Z"/>
<path id="path13_stroke" d="M 203.29 80.2732L 0.289996 -0.72678L -0.289996 0.72678L 202.71 81.7268L 203.29 80.2732Z"/>
<path id="path14_stroke" d="M 0.315447 174.716L 395.315 0.7161L 394.685 -0.7161L -0.315447 173.284L 0.315447 174.716Z"/>
<path id="path15_stroke" d="M 0 96.1048L -0.7825 96.1048L -0.7825 96.4574L -0.518369 96.691L 0 96.1048ZM 96 181L 95.4816 181.586L 96.7825 182.737L 96.7825 181L 96 181ZM 96 84.8952L 96.7825 84.8952L 96.7825 84.5426L 96.5184 84.309L 96 84.8952ZM 0 0L 0.518369 -0.586174L -0.7825 -1.73656L -0.7825 0L 0 0ZM -0.518369 96.691L 95.4816 181.586L 96.5184 180.414L 0.518369 95.5186L -0.518369 96.691ZM 96.7825 181L 96.7825 84.8952L 95.2175 84.8952L 95.2175 181L 96.7825 181ZM 96.5184 84.309L 0.518369 -0.586174L -0.518369 0.586174L 95.4816 85.4814L 96.5184 84.309ZM -0.7825 0L -0.7825 96.1048L 0.7825 96.1048L 0.7825 0L -0.7825 0Z"/>
<path id="path16_stroke" d="M 0.289996 81.7268L 203.29 0.72678L 202.71 -0.72678L -0.289996 80.2732L 0.289996 81.7268Z"/>
<path id="path17_stroke" d="M 395.315 173.284L 0.315447 -0.7161L -0.315447 0.7161L 394.685 174.716L 395.315 173.284Z"/>
<path id="path18_stroke" d="M 0.7825 58.5C 0.7825 26.6236 26.6236 0.7825 58.5 0.7825L 58.5 -0.7825C 25.7593 -0.7825 -0.7825 25.7593 -0.7825 58.5L 0.7825 58.5ZM 58.5 0.7825C 90.3764 0.7825 116.217 26.6236 116.217 58.5L 117.783 58.5C 117.783 25.7593 91.2407 -0.7825 58.5 -0.7825L 58.5 0.7825ZM 116.217 58.5C 116.217 90.3764 90.3764 116.217 58.5 116.217L 58.5 117.783C 91.2407 117.783 117.783 91.2407 117.783 58.5L 116.217 58.5ZM 58.5 116.217C 26.6236 116.217 0.7825 90.3764 0.7825 58.5L -0.7825 58.5C -0.7825 91.2407 25.7593 117.783 58.5 117.783L 58.5 116.217Z"/>
<path id="path19_stroke" d="M -0.514251 0.58979L 202.486 177.59L 203.514 176.41L 0.514251 -0.58979L -0.514251 0.58979Z"/>
<path id="path20_stroke" d="M 202.486 -0.58979L -0.514251 176.41L 0.514251 177.59L 203.514 0.58979L 202.486 -0.58979Z"/>
<path id="path21_stroke" d="M 0.7825 58L 0.7825 0L -0.7825 0L -0.7825 58L 0.7825 58Z"/>
<path id="path22_stroke" d="M 0.691285 181.367L 96.6913 0.366648L 95.3087 -0.366648L -0.691285 180.633L 0.691285 181.367Z"/>
<path id="path23_stroke" d="M 96.6913 180.633L 0.691285 -0.366648L -0.691285 0.366648L 95.3087 181.367L 96.6913 180.633Z"/>
<path id="path24_stroke" d="M 0.335466 177.707L 373.335 0.706943L 372.665 -0.706943L -0.335466 176.293L 0.335466 177.707Z"/>
<path id="path25_stroke" d="M 373.335 176.293L 0.335466 -0.706943L -0.335466 0.706943L 372.665 177.707L 373.335 176.293Z"/>
<path id="path26_stroke" d="M 0.300643 134.722L 322.301 0.72244L 321.699 -0.72244L -0.300643 133.278L 0.300643 134.722Z"/>
<path id="path27_stroke" d="M 327 -0.7825L 0 -0.7825L 0 0.7825L 327 0.7825L 327 -0.7825Z"/>
<path id="path28_stroke" d="M 327.297 133.276L 0.296711 -0.724064L -0.296711 0.724064L 326.703 134.724L 327.297 133.276Z"/>
<path id="path29_stroke" d="M 151.483 -0.586973L -0.517463 133.413L 0.517463 134.587L 152.517 0.586973L 151.483 -0.586973Z"/>
<path id="path30_stroke" d="M -0.506127 0.596776L 157.494 134.597L 158.506 133.403L 0.506127 -0.596776L -0.506127 0.596776Z"/>
<path id="path31_stroke" d="M 75.3194 -0.386039L -0.680647 133.614L 0.680647 134.386L 76.6806 0.386039L 75.3194 -0.386039Z"/>
<path id="path32_stroke" d="M -0.667447 0.408438L 81.3326 134.408L 82.6674 133.592L 0.667447 -0.408438L -0.667447 0.408438Z"/>
<path id="path33_stroke" d="M 0.446089 170.643L 245.446 0.642893L 244.554 -0.642893L -0.446089 169.357L 0.446089 170.643Z"/>
<path id="path34_stroke" d="M 246.445 169.356L 0.444862 -0.643742L -0.444862 0.643742L 245.555 170.644L 246.445 169.356Z"/>
<path id="path35_stroke" d="M 0.7825 184L 0.7825 0L -0.7825 0L -0.7825 184L 0.7825 184Z"/>
<path id="path36_stroke" d="M 0.455485 194.636L 271.455 0.63627L 270.545 -0.63627L -0.455485 193.364L 0.455485 194.636Z"/>
<path id="path37_stroke" d="M 259.469 193.374L 0.469113 -0.62629L -0.469113 0.62629L 258.531 194.626L 259.469 193.374Z"/>
<path id="path38_stroke" d="M 24 0L 24.6794 -0.388229L 24 -1.57718L 23.3206 -0.388229L 24 0ZM 0 42L -0.6794 41.6118L -1.34839 42.7825L 0 42.7825L 0 42ZM 48 42L 48 42.7825L 49.3484 42.7825L 48.6794 41.6118L 48 42ZM 23.3206 -0.388229L -0.6794 41.6118L 0.6794 42.3882L 24.6794 0.388229L 23.3206 -0.388229ZM 0 42.7825L 48 42.7825L 48 41.2175L 0 41.2175L 0 42.7825ZM 48.6794 41.6118L 24.6794 -0.388229L 23.3206 0.388229L 47.3206 42.3882L 48.6794 41.6118Z"/>
<path id="path39_stroke" d="M -0.119734 0.773285L 154.88 24.7733L 155.12 23.2267L 0.119734 -0.773285L -0.119734 0.773285Z"/>
<path id="path40_stroke" d="M 0.119734 24.7733L 155.12 0.773285L 154.88 -0.773285L -0.119734 23.2267L 0.119734 24.7733Z"/>
</defs>
</svg>
