Engine/Binaries/Win64/UnrealGame.pdb	2022-04-26T11:22:00.456Z
Engine/Binaries/ThirdParty/PhysX3/Win64/VS2015/PhysX3CommonPROFILE_x64.pdb	2022-04-11T02:41:33.701Z
Engine/Binaries/ThirdParty/PhysX3/Win64/VS2015/PhysX3CookingPROFILE_x64.pdb	2022-04-11T02:41:33.826Z
Engine/Binaries/ThirdParty/PhysX3/Win64/VS2015/PhysX3PROFILE_x64.pdb	2022-04-11T02:41:34.286Z
Engine/Binaries/ThirdParty/PhysX3/Win64/VS2015/PxFoundationPROFILE_x64.pdb	2022-04-11T02:41:34.292Z
Engine/Binaries/ThirdParty/PhysX3/Win64/VS2015/PxPvdSDKPROFILE_x64.pdb	2022-04-11T02:41:34.371Z
Engine/Content/SlateDebug/Fonts/LastResort.tps	2022-04-11T02:43:58.055Z
Engine/Content/SlateDebug/Fonts/LastResort.ttf	2022-04-11T02:43:58.627Z
Engine/Extras/GPUDumpViewer/GPUDumpViewer.html	2022-04-11T02:46:06.121Z
Engine/Extras/GPUDumpViewer/OpenGPUDumpViewer.bat	2022-04-11T02:46:06.121Z
Engine/Extras/GPUDumpViewer/OpenGPUDumpViewer.sh	2022-04-11T02:46:06.121Z
