{
    "id": "t01",
    "name": "Decenter availability template",
    "state": "started",
    "details":{
        "id": "{{.id}}",
        "type": "template",
        "name": "Agreement for reservation {{.id}}",
        "provider": { "id": "{{.provider_id}}", "name": "{{.provider_name}}" },
        "client": { "id": "{{.client_id}}", "name": "{{.client_name}}" },
        "creation": "2020-11-04T17:09:45.0Z",
        "guarantees": [
            {
                "name": "Availability",
                "constraint": "availability < {{.avail}}"
            }
        ]
    }
}
