{
    "id": "a01",
    "name": "an-agreement-name",
    "state": "started",
    "location": "location",
    "details": {
      "id": "a01",
      "type": "agreement",
      "name": "an-agreement-name",
      "creation": "2021-01-16T17:09:45Z",
      "provider": {
        "id": "id",
        "name": "name"
      },
      "client": {
        "id": "id",
        "name": "name",
        "warning": "warning"
      },
      "guarantees": [
        {
          "name": "TestGuarantee",
          "constraint": "execution_time < 100",
          "importance": [
            {
              "name": "Warning",
              "constraint": "> 100"
            },
            {
                "name": "Mild",
                "constraint": "> 150"
            },
            {
                "name": "Severe",
                "constraint": "> 200"
            },
            {
                "name": "Critical",
                "constraint": "> 400"
            }
          ],
          "penalties": [
            {
              "type": "type",
              "value": "value",
              "unit": "unit"
            }
          ],
          "actions": [
            {
              "type": "type",
              "value": "value",
              "unit": "unit"
            }
          ]
        }
      ]
    }
  }