{
  "name": "CISReportInfra",
  "fields": [
    {
      "fieldName": "infrastructure",
      "fieldType": "String"
    },
    {
      "fieldName": "totalPass",
      "fieldType": "Integer"
    },
    {
      "fieldName": "totalFail",
      "fieldType": "Integer"
    },
    {
      "fieldName": "totalWarn",
      "fieldType": "Integer"
    },
    {
      "fieldName": "totalInfo",
      "fieldType": "Integer"
    }
  ],
  "relationships": [
    {
      "relationshipType": "one-to-many",
      "otherEntityName": "cISReport",
      "otherEntityRelationshipName": "reportInfra",
      "relationshipName": "reportSet"
    }
  ],
  "changelogDate": "20211116081252",
  "entityTableName": "cis_report_infra",
  "dto": "no",
  "pagination": "pagination",
  "service": "serviceImpl",
  "jpaMetamodelFiltering": false,
  "fluentMethods": true,
  "readOnly": false,
  "embedded": false,
  "clientRootFolder": "",
  "applications": "*"
}
