{
  "annotations": {
    "list": [
      {
        "builtIn": 1,
        "datasource": "-- Grafana --",
        "enable": true,
        "hide": true,
        "iconColor": "rgba(0, 211, 255, 1)",
        "name": "Annotations & Alerts",
        "target": {
          "limit": 100,
          "matchAny": false,
          "tags": [],
          "type": "dashboard"
        },
        "type": "dashboard"
      }
    ]
  },
  "editable": true,
  "fiscalYearStartMonth": 0,
  "gnetId": null,
  "graphTooltip": 0,
  "links": [],
  "liveNow": false,
  "panels": [
    {
      "activePatternIndex": 0,
      "datasource": null,
      "debug_mode": false,
      "defaultPattern": {
        "bgColors": "green|orange|red",
        "bgColors_overrides": "0->green|2->red|1->yellow",
        "clickable_cells_link": "",
        "col_name": "_2_ > _3_",
        "decimals": 2,
        "defaultBGColor": "transparent",
        "defaultTextColor": "",
        "delimiter": "#",
        "displayTemplate": "_value_",
        "enable_bgColor": false,
        "enable_bgColor_overrides": false,
        "enable_clickable_cells": false,
        "enable_textColor": false,
        "enable_textColor_overrides": false,
        "enable_time_based_thresholds": false,
        "enable_transform": false,
        "enable_transform_overrides": false,
        "filter": {
          "value_above": "",
          "value_below": ""
        },
        "format": "none",
        "name": "Default Pattern",
        "null_color": "darkred",
        "null_textcolor": "black",
        "null_value": "No data",
        "pattern": "*",
        "row_col_wrapper": "_",
        "row_name": "_0_ > _1_",
        "textColors": "red|orange|green",
        "textColors_overrides": "0->red|2->green|1->yellow",
        "thresholds": "10,90",
        "time_based_thresholds": [
          {
            "enabledDays": "Sun,Mon,Tue,Wed,Thu,Fri,Sat",
            "from": "0000",
            "name": "Early morning of everyday",
            "threshold": "70,90",
            "to": "0530"
          }
        ],
        "tooltipTemplate": "Series : _series_ <br/>Row Name : _row_name_ <br/>Col Name : _col_name_ <br/>Value : _value_",
        "transform_values": "_value_|_value_|_value_",
        "transform_values_overrides": "0->down|1->up",
        "valueName": "current"
      },
      "default_title_for_rows": "Metric",
      "gridPos": {
        "h": 32,
        "w": 24,
        "x": 0,
        "y": 0
      },
      "id": 2,
      "non_matching_cells_color_bg": "rgb(80, 60, 0)",
      "non_matching_cells_text": "",
      "patterns": [],
      "pluginVersion": "8.2.5",
      "row_col_wrapper": "_",
      "sorting_props": {
        "col_index": 4,
        "direction": "desc"
      },
      "targets": [
        {
          "alias": "[[tag_workload.tool]]#[[tag_workload.name]]#[[tag_provider.default]]#[[tag_execenv.default]]",
          "groupBy": [
            {
              "params": [
                "$__interval"
              ],
              "type": "time"
            },
            {
              "params": [
                "node"
              ],
              "type": "tag"
            },
            {
              "params": [
                "provider"
              ],
              "type": "tag"
            },
            {
              "params": [
                "null"
              ],
              "type": "fill"
            }
          ],
          "measurement": "Sysbench CPU",
          "orderByTime": "ASC",
          "policy": "autogen",
          "query": "SELECT last(mean) FROM /Analytics/ WHERE $timeFilter AND  \"metric\" = 'performance_index' GROUP BY \"workload.tool\", \"provider.default\", \"workload.name\", \"execenv.default\" fill(none)",
          "rawQuery": true,
          "refId": "A",
          "resultFormat": "time_series",
          "select": [
            [
              {
                "params": [
                  "performance_index"
                ],
                "type": "field"
              },
              {
                "params": [],
                "type": "mean"
              }
            ]
          ],
          "tags": []
        }
      ],
      "text_alignment_header": "center",
      "text_alignment_values": "right",
      "title": "Monthly Performance of Workloads by Infrastructure Nodes",
      "type": "yesoreyeram-boomtable-panel"
    },
    {
      "activePatternIndex": 0,
      "datasource": null,
      "debug_mode": false,
      "defaultPattern": {
        "bgColors": "green|orange|red",
        "bgColors_overrides": "0->green|2->red|1->yellow",
        "clickable_cells_link": "",
        "col_name": "_2_ > _3_",
        "decimals": 2,
        "defaultBGColor": "transparent",
        "defaultTextColor": "",
        "delimiter": "#",
        "displayTemplate": "_value_",
        "enable_bgColor": false,
        "enable_bgColor_overrides": false,
        "enable_clickable_cells": false,
        "enable_textColor": false,
        "enable_textColor_overrides": false,
        "enable_time_based_thresholds": false,
        "enable_transform": false,
        "enable_transform_overrides": false,
        "filter": {
          "value_above": "",
          "value_below": ""
        },
        "format": "none",
        "name": "Default Pattern",
        "null_color": "darkred",
        "null_textcolor": "black",
        "null_value": "No data",
        "pattern": "*",
        "row_col_wrapper": "_",
        "row_name": "_0_ > _1_",
        "textColors": "red|orange|green",
        "textColors_overrides": "0->red|2->green|1->yellow",
        "thresholds": "10,90",
        "time_based_thresholds": [
          {
            "enabledDays": "Sun,Mon,Tue,Wed,Thu,Fri,Sat",
            "from": "0000",
            "name": "Early morning of everyday",
            "threshold": "70,90",
            "to": "0530"
          }
        ],
        "tooltipTemplate": "Series : _series_ <br/>Row Name : _row_name_ <br/>Col Name : _col_name_ <br/>Value : _value_",
        "transform_values": "_value_|_value_|_value_",
        "transform_values_overrides": "0->down|1->up",
        "valueName": "current"
      },
      "default_title_for_rows": "Metric",
      "gridPos": {
        "h": 39,
        "w": 24,
        "x": 0,
        "y": 32
      },
      "id": 5,
      "non_matching_cells_color_bg": "rgb(80, 60, 0)",
      "non_matching_cells_text": "",
      "patterns": [],
      "pluginVersion": "8.2.5",
      "row_col_wrapper": "_",
      "sorting_props": {
        "col_index": 4,
        "direction": "desc"
      },
      "targets": [
        {
          "alias": "[[tag_workload.tool]]#[[tag_workload.name]]#[[tag_provider.default]]#[[tag_execenv.default]]",
          "groupBy": [
            {
              "params": [
                "$__interval"
              ],
              "type": "time"
            },
            {
              "params": [
                "node"
              ],
              "type": "tag"
            },
            {
              "params": [
                "provider"
              ],
              "type": "tag"
            },
            {
              "params": [
                "null"
              ],
              "type": "fill"
            }
          ],
          "measurement": "Sysbench CPU",
          "orderByTime": "ASC",
          "policy": "autogen",
          "query": "SELECT last(performance_index) FROM /^.*$/ WHERE $timeFilter GROUP BY \"workload.tool\", \"provider.default\", \"workload.name\", \"execenv.default\" fill(none)",
          "rawQuery": true,
          "refId": "A",
          "resultFormat": "time_series",
          "select": [
            [
              {
                "params": [
                  "performance_index"
                ],
                "type": "field"
              },
              {
                "params": [],
                "type": "mean"
              }
            ]
          ],
          "tags": []
        }
      ],
      "text_alignment_header": "center",
      "text_alignment_values": "right",
      "title": "Current Performance of Workloads by Infrastructure Nodes",
      "type": "yesoreyeram-boomtable-panel"
    },
    {
      "activePatternIndex": 0,
      "datasource": null,
      "debug_mode": false,
      "defaultPattern": {
        "bgColors": "green|orange|red",
        "bgColors_overrides": "0->green|2->red|1->yellow",
        "clickable_cells_link": "",
        "col_name": "_2_ > _3_",
        "decimals": 2,
        "defaultBGColor": "transparent",
        "defaultTextColor": "",
        "delimiter": "#",
        "displayTemplate": "_value_",
        "enable_bgColor": false,
        "enable_bgColor_overrides": false,
        "enable_clickable_cells": false,
        "enable_textColor": false,
        "enable_textColor_overrides": false,
        "enable_time_based_thresholds": false,
        "enable_transform": false,
        "enable_transform_overrides": false,
        "filter": {
          "value_above": "",
          "value_below": ""
        },
        "format": "dateTimeFromNow",
        "name": "Default Pattern",
        "null_color": "darkred",
        "null_textcolor": "black",
        "null_value": "No data",
        "pattern": "*",
        "row_col_wrapper": "_",
        "row_name": "_0_ > _1_",
        "textColors": "red|orange|green",
        "textColors_overrides": "0->red|2->green|1->yellow",
        "thresholds": "7, 14",
        "time_based_thresholds": [
          {
            "enabledDays": "Sun,Mon,Tue,Wed,Thu,Fri,Sat",
            "from": "0000",
            "name": "Early morning of everyday",
            "threshold": "70,90",
            "to": "0530"
          }
        ],
        "tooltipTemplate": "Series : _series_ <br/>Row Name : _row_name_ <br/>Col Name : _col_name_ <br/>Value : _value_",
        "transform_values": "_value_|_value_|_value_",
        "transform_values_overrides": "0->down|1->up",
        "valueName": "last_time"
      },
      "default_title_for_rows": "Metric",
      "gridPos": {
        "h": 39,
        "w": 24,
        "x": 0,
        "y": 71
      },
      "id": 6,
      "non_matching_cells_color_bg": "rgb(80, 60, 0)",
      "non_matching_cells_text": "",
      "patterns": [],
      "pluginVersion": "8.2.5",
      "row_col_wrapper": "_",
      "sorting_props": {
        "col_index": 4,
        "direction": "desc"
      },
      "targets": [
        {
          "alias": "[[tag_workload.tool]]#[[tag_workload.name]]#[[tag_provider.default]]#[[tag_execenv.default]]",
          "groupBy": [
            {
              "params": [
                "$__interval"
              ],
              "type": "time"
            },
            {
              "params": [
                "node"
              ],
              "type": "tag"
            },
            {
              "params": [
                "provider"
              ],
              "type": "tag"
            },
            {
              "params": [
                "null"
              ],
              "type": "fill"
            }
          ],
          "measurement": "Sysbench CPU",
          "orderByTime": "ASC",
          "policy": "autogen",
          "query": "SELECT last(performance_index) FROM /^.*$/ WHERE $timeFilter GROUP BY \"workload.tool\", \"provider.default\", \"workload.name\", \"execenv.default\" fill(none)",
          "rawQuery": true,
          "refId": "A",
          "resultFormat": "time_series",
          "select": [
            [
              {
                "params": [
                  "performance_index"
                ],
                "type": "field"
              },
              {
                "params": [],
                "type": "mean"
              }
            ]
          ],
          "tags": []
        }
      ],
      "text_alignment_header": "center",
      "text_alignment_values": "right",
      "title": "Age of the latest Execution of a Workload by Infrastructure Nodes",
      "type": "yesoreyeram-boomtable-panel"
    },
    {
      "activePatternIndex": 0,
      "datasource": null,
      "debug_mode": false,
      "defaultPattern": {
        "bgColors": "green|orange|red",
        "bgColors_overrides": "0->green|2->red|1->yellow",
        "clickable_cells_link": "",
        "col_name": "_0_ > _1_",
        "decimals": 2,
        "defaultBGColor": "transparent",
        "defaultTextColor": "",
        "delimiter": "#",
        "displayTemplate": "_value_",
        "enable_bgColor": false,
        "enable_bgColor_overrides": false,
        "enable_clickable_cells": false,
        "enable_textColor": false,
        "enable_textColor_overrides": false,
        "enable_time_based_thresholds": false,
        "enable_transform": false,
        "enable_transform_overrides": false,
        "filter": {
          "value_above": "",
          "value_below": ""
        },
        "format": "none",
        "name": "Default Pattern",
        "null_color": "darkred",
        "null_textcolor": "black",
        "null_value": "No data",
        "pattern": "*",
        "row_col_wrapper": "_",
        "row_name": "_2_ > _3_",
        "textColors": "red|orange|green",
        "textColors_overrides": "0->red|2->green|1->yellow",
        "thresholds": "10,90",
        "time_based_thresholds": [
          {
            "enabledDays": "Sun,Mon,Tue,Wed,Thu,Fri,Sat",
            "from": "0000",
            "name": "Early morning of everyday",
            "threshold": "70,90",
            "to": "0530"
          }
        ],
        "tooltipTemplate": "Series : _series_ <br/>Row Name : _row_name_ <br/>Col Name : _col_name_ <br/>Value : _value_",
        "transform_values": "_value_|_value_|_value_",
        "transform_values_overrides": "0->down|1->up",
        "valueName": "current"
      },
      "default_title_for_rows": "Metric",
      "gridPos": {
        "h": 28,
        "w": 24,
        "x": 0,
        "y": 110
      },
      "id": 4,
      "non_matching_cells_color_bg": "rgb(80, 60, 0)",
      "non_matching_cells_text": "",
      "patterns": [],
      "pluginVersion": "8.2.5",
      "row_col_wrapper": "_",
      "sorting_props": {
        "col_index": 10,
        "direction": "asc"
      },
      "targets": [
        {
          "alias": "[[tag_workload.tool]]#[[tag_workload.name]]#[[tag_provider.default]]#[[tag_execenv.default]]",
          "groupBy": [
            {
              "params": [
                "$__interval"
              ],
              "type": "time"
            },
            {
              "params": [
                "node"
              ],
              "type": "tag"
            },
            {
              "params": [
                "provider"
              ],
              "type": "tag"
            },
            {
              "params": [
                "null"
              ],
              "type": "fill"
            }
          ],
          "measurement": "Sysbench CPU",
          "orderByTime": "ASC",
          "policy": "autogen",
          "query": "SELECT last(mean) FROM /Analytics/ WHERE $timeFilter AND  \"metric\" = 'performance_index' GROUP BY \"workload.tool\", \"provider.default\", \"workload.name\", \"execenv.default\" fill(none)",
          "rawQuery": true,
          "refId": "A",
          "resultFormat": "time_series",
          "select": [
            [
              {
                "params": [
                  "performance_index"
                ],
                "type": "field"
              },
              {
                "params": [],
                "type": "mean"
              }
            ]
          ],
          "tags": []
        }
      ],
      "text_alignment_header": "center",
      "text_alignment_values": "right",
      "title": "Monthly Performance of Workloads on Infrastructure Nodes",
      "type": "yesoreyeram-boomtable-panel"
    }
  ],
  "schemaVersion": 32,
  "style": "dark",
  "tags": [],
  "templating": {
    "list": []
  },
  "time": {
    "from": "now-7d",
    "to": "now"
  },
  "timepicker": {},
  "timezone": "",
  "title": "Summaries",
  "uid": "_SCAurL7z",
  "version": 15
}
