{
    "chrome": {
        "default": "87.0",
        "versions": {
            "87.0": {
                "image": "selenoid/vnc_chrome:87.0",
                "port": "4444",
                "path": "/"
            }
        }
    },
    "firefox": {
        "default": "84.0",
        "versions": {
            "84.0": {
                "image": "selenoid/vnc_firefox:84.0",
                "port": "4444",
                "path": "/wd/hub"
            }
        }
    },
    "opera": {
        "default": "73.0",
        "versions": {
            "73.0": {
                "image": "selenoid/vnc_opera:73.0",
                "port": "4444",
                "path": "/"
            }
        }
    }
}