{
  "annotations": {
    "changelogDate": "20240216141141"
  },
  "applications": ["PdsPrescriptionCoreService"],
  "clientRootFolder": "PdsPrescriptionCoreService",
  "databaseType": "mongodb",
  "dto": "mapstruct",
  "entityTableName": "patient",
  "fields": [
    {
      "fieldName": "firstName",
      "fieldType": "String",
      "fieldValidateRules": ["required", "minlength", "maxlength"],
      "fieldValidateRulesMaxlength": "100",
      "fieldValidateRulesMinlength": "1"
    },
    {
      "fieldName": "lastName",
      "fieldType": "String",
      "fieldValidateRules": ["required", "minlength", "maxlength"],
      "fieldValidateRulesMaxlength": "100",
      "fieldValidateRulesMinlength": "1"
    },
    {
      "fieldName": "birthday",
      "fieldType": "LocalDate"
    },
    {
      "fieldName": "gender",
      "fieldType": "String",
      "fieldValidateRules": ["required"]
    },
    {
      "fieldName": "contactNumber",
      "fieldType": "String",
      "fieldValidateRules": ["required", "minlength", "maxlength"],
      "fieldValidateRulesMaxlength": "15",
      "fieldValidateRulesMinlength": "10"
    },
    {
      "fieldName": "address",
      "fieldType": "String",
      "fieldValidateRules": ["minlength", "maxlength"],
      "fieldValidateRulesMaxlength": "200",
      "fieldValidateRulesMinlength": "1"
    }
  ],
  "microserviceName": "PdsPrescriptionCoreService",
  "name": "Patient",
  "relationships": [],
  "searchEngine": "no",
  "service": "serviceImpl"
}
