<svg width="72" height="73" viewBox="0 0 72 73" fill="none" xmlns="http://www.w3.org/2000/svg">
<g opacity="0.8">
<path fill-rule="evenodd" clip-rule="evenodd" d="M6.85771 62.3988C6.33593 60.935 6.1451 59.3737 6.29898 57.8274C6.22813 51.1144 8.46004 44.58 12.6228 39.3131C16.2545 34.4369 20.0387 29.6623 23.7212 24.8623C26.0315 21.8978 27.8102 18.5552 28.9783 14.9829C30.1523 11.8745 32.0708 9.10142 34.5656 6.90674C34.5656 8.58293 34.7434 9.72578 34.7942 10.6909L39.2132 13.9417L43.6577 14.6528C44.699 16.9385 44.4704 17.6242 42.0831 19.148C41.5177 19.0845 40.9469 19.0845 40.3815 19.148C39.6784 19.2096 38.9982 19.4288 38.3915 19.7893C37.7847 20.1499 37.267 20.6425 36.8767 21.2305C36.1565 22.1667 35.6323 23.2384 35.3355 24.3816C35.0388 25.5249 34.9757 26.7163 35.1498 27.8845C35.7885 30.8814 35.5684 33.9976 34.5148 36.875C33.2136 41.5949 32.9194 46.5356 33.6513 51.3766C33.8545 53.9163 34.1085 56.2274 34.2609 58.0051C35.4291 60.8242 37.5117 60.3163 38.6799 62.1194C38.045 62.1194 32.4831 62.1194 32.4831 62.1194C32.4831 62.1194 31.5942 57.7766 30.9085 55.6179C30.2228 53.4591 29.9688 51.7829 29.4101 49.9036C29.0545 48.7607 28.4958 47.694 27.9878 46.4496L25.8799 47.5924C29.2577 51.148 29.1815 54.2718 25.6513 57.5988C24.4323 58.7417 23.3656 59.3258 22.045 60.3671C24.1521 60.0436 26.3026 60.1473 28.3688 60.6718C28.9471 60.9842 29.4099 61.4738 29.6894 62.0687C23.6332 62.4212 17.5615 62.4212 11.5053 62.0687C10.1339 61.8655 10.0577 62.602 10.7688 62.8051C16.243 64.4675 22.0039 64.9692 27.6831 64.2782C30.9847 64.075 29.9942 65.0909 28.1656 65.4972C23.899 66.4623 9.67676 68.2909 6.85771 62.3988ZM38.2736 62.1448C38.4401 61.6031 38.7168 61.1016 39.0862 60.6718C39.6704 60.1385 40.3561 60.3925 41.2958 60.1131C41.4482 59.1734 41.6514 58.2845 41.7783 57.3702C42.0577 54.8305 42.3117 52.2909 42.591 49.7512C42.8608 47.5309 42.349 45.2859 41.1434 43.402C39.8824 40.9526 39.54 38.1327 40.1783 35.4528C40.4959 33.7373 40.9114 32.0414 41.4228 30.3734C40.4323 28.6972 37.9434 27.8337 38.045 24.9131L42.1593 21.8909C42.858 21.4925 43.5885 21.1527 44.3434 20.875C45.2831 19.3004 44.699 17.2179 46.2482 15.7956C47.6958 16.2528 47.8482 17.5734 48.3815 18.5893C48.6886 19.447 49.1538 20.2395 49.7529 20.9258C50.9791 21.8678 51.9315 23.12 52.5119 24.5532C53.0923 25.9863 53.2796 27.5484 53.0545 29.0782C53.0545 29.4083 53.0545 29.7385 53.0545 30.1194C54.2097 32.877 56.0551 35.291 58.4132 37.129C60.841 39.0601 62.5639 41.7382 63.3148 44.748C65.0418 50.4877 66.4386 56.4559 64.6609 62.094C63.9751 64.2528 60.9275 67.3512 43.1244 65.2686C40.1783 64.9131 40.1021 63.0337 42.1593 63.2623C45.1561 63.6178 56.0514 64.6083 58.9974 63.4401C61.9434 62.2718 59.7085 62.0178 58.9974 62.0178C54.5783 62.0178 49.9307 64.1258 47.7974 62.0178C45.664 59.9099 47.2894 53.0782 47.0101 52.2401C46.4006 53.1798 44.4704 61.0274 43.7593 62.0178L38.2736 62.1448Z" fill="white"/>
<path d="M58.4127 72.4814H13.6127C10.0044 72.4747 6.54591 71.0384 3.99449 68.487C1.44307 65.9355 0.00671304 62.477 0 58.8687V14.0687C0.00672745 10.4628 1.44389 7.00691 3.99604 4.45952C6.54818 1.91214 10.0068 0.481439 13.6127 0.481445H58.4127C62.0142 0.488158 65.4663 1.92182 68.0129 4.46848C70.5596 7.01513 71.9933 10.4672 72 14.0687V58.8687C72 62.4747 70.5693 65.9333 68.0219 68.4854C65.4745 71.0376 62.0186 72.4747 58.4127 72.4814ZM13.6127 3.70683C10.8622 3.70683 8.22401 4.79772 6.27674 6.74022C4.32947 8.68273 3.23213 11.3183 3.22541 14.0687V58.8687C3.23213 61.6192 4.32947 64.2548 6.27674 66.1973C8.22401 68.1398 10.8622 69.2307 13.6127 69.2307H58.4127C61.1608 69.2307 63.7964 68.1389 65.7397 66.1957C67.6829 64.2525 68.7746 61.6169 68.7746 58.8687V14.0687C68.7746 11.3206 67.6829 8.68501 65.7397 6.74177C63.7964 4.79854 61.1608 3.70683 58.4127 3.70683H13.6127Z" fill="white"/>
</g>
</svg>
