<svg width="90" height="156" viewBox="0 0 90 156" fill="none" xmlns="http://www.w3.org/2000/svg">
<g opacity="0.05" clip-path="url(#clip0)">
<path d="M58.7993 108.301C49.5527 108.301 44.7801 111.657 40.5704 114.617C36.8725 117.217 33.9518 119.27 27.5974 119.27C21.2442 119.27 18.3235 117.217 14.6267 114.617C10.4171 111.656 5.64441 108.301 -3.60214 108.301C-12.8475 108.301 -17.6201 111.657 -21.8298 114.617C-25.5266 117.217 -28.4473 119.27 -34.8005 119.27C-41.1537 119.27 -44.0744 117.217 -47.7711 114.617C-51.982 111.657 -56.7546 108.301 -66 108.301V117.442C-59.6456 117.442 -56.7261 119.495 -53.0294 122.095C-48.8185 125.055 -44.047 128.41 -34.8005 128.41C-25.5551 128.41 -20.7825 125.055 -16.5728 122.095C-12.8761 119.495 -9.95535 117.442 -3.60214 117.442C2.75226 117.442 5.67178 119.495 9.36969 122.095C13.5794 125.055 18.352 128.41 27.5974 128.41C36.8439 128.41 41.6166 125.055 45.8275 122.095C49.5242 119.496 52.4449 117.442 58.7993 117.442C65.1537 117.442 68.0732 119.495 71.7711 122.095C75.9808 125.055 80.7534 128.41 90 128.41V119.27C83.6456 119.27 80.7249 117.217 77.0282 114.617C72.8173 111.657 68.0446 108.301 58.7993 108.301Z" fill="white"/>
<path d="M58.7993 54.382C49.5527 54.382 44.7801 57.7371 40.5704 60.6971C36.8725 63.2964 33.9518 65.3507 27.5974 65.3507C21.2442 65.3507 18.3235 63.2964 14.6267 60.6971C10.4171 57.7371 5.64441 54.382 -3.60214 54.382C-12.8475 54.382 -17.6201 57.7371 -21.8298 60.6971C-25.5266 63.2964 -28.4473 65.3507 -34.8005 65.3507C-41.1537 65.3507 -44.0744 63.2964 -47.7711 60.6971C-51.982 57.7371 -56.7546 54.382 -66 54.382V63.5226C-59.6456 63.5226 -56.7261 65.5757 -53.0294 68.175C-48.8185 71.1362 -44.047 74.4913 -34.8005 74.4913C-25.5551 74.4913 -20.7825 71.135 -16.5728 68.175C-12.8761 65.5757 -9.95535 63.5226 -3.60214 63.5226C2.75226 63.5226 5.67178 65.5757 9.36969 68.175C13.5794 71.1362 18.352 74.4913 27.5974 74.4913C36.8439 74.4913 41.6166 71.135 45.8275 68.175C49.5242 65.5757 52.4449 63.5226 58.7993 63.5226C65.1537 63.5226 68.0732 65.5757 71.7711 68.175C75.9808 71.1362 80.7534 74.4913 90 74.4913V65.3507C83.6456 65.3507 80.7249 63.2964 77.0282 60.6971C72.8173 57.7371 68.0446 54.382 58.7993 54.382Z" fill="white"/>
<path d="M58.7993 81.342C49.5527 81.342 44.7801 84.6972 40.5704 87.6572C36.8725 90.2565 33.9518 92.3108 27.5974 92.3108C21.2442 92.3108 18.3235 90.2565 14.6267 87.6572C10.4171 84.6972 5.64441 81.342 -3.60214 81.342C-12.8475 81.342 -17.6201 84.6972 -21.8298 87.6572C-25.5266 90.2565 -28.4473 92.3108 -34.8005 92.3108C-41.1537 92.3108 -44.0744 90.2565 -47.7711 87.6572C-51.982 84.6972 -56.7546 81.342 -66 81.342V90.4827C-59.6456 90.4827 -56.7261 92.5357 -53.0294 95.1351C-48.8185 98.0951 -44.047 101.451 -34.8005 101.451C-25.5551 101.451 -20.7825 98.0951 -16.5728 95.1351C-12.8761 92.5357 -9.95535 90.4827 -3.60214 90.4827C2.75226 90.4827 5.67178 92.5357 9.36969 95.1351C13.5794 98.0951 18.352 101.451 27.5974 101.451C36.8439 101.451 41.6166 98.0951 45.8275 95.1351C49.5242 92.5357 52.4449 90.4827 58.7993 90.4827C65.1537 90.4827 68.0732 92.5357 71.7711 95.1351C75.9808 98.0951 80.7534 101.451 90 101.451V92.3108C83.6456 92.3108 80.7249 90.2565 77.0282 87.6572C72.8173 84.6972 68.0446 81.342 58.7993 81.342Z" fill="white"/>
<path d="M77.0282 33.7382C72.8173 30.777 68.0446 27.4219 58.7993 27.4219C49.5527 27.4219 44.7801 30.777 40.5704 33.7382C36.8725 36.3376 33.9518 38.3906 27.5974 38.3906C21.2442 38.3906 18.3235 36.3376 14.6267 33.7382C10.4171 30.777 5.64441 27.4219 -3.60214 27.4219C-12.8475 27.4219 -17.6201 30.777 -21.8298 33.7382C-25.5266 36.3376 -28.4473 38.3906 -34.8005 38.3906C-41.1537 38.3906 -44.0744 36.3376 -47.7711 33.7382C-51.982 30.777 -56.7546 27.4219 -66 27.4219V36.5625C-59.6456 36.5625 -56.7261 38.6156 -53.0294 41.2149C-48.8185 44.1761 -44.047 47.5312 -34.8005 47.5312C-25.5551 47.5312 -20.7825 44.1761 -16.5728 41.2149C-12.8761 38.6156 -9.95535 36.5625 -3.60214 36.5625C2.75226 36.5625 5.67178 38.6156 9.36969 41.2149C13.5794 44.1761 18.352 47.5312 27.5974 47.5312C36.8439 47.5312 41.6166 44.1761 45.8275 41.2149C49.5242 38.6156 52.4449 36.5625 58.7993 36.5625C65.1537 36.5625 68.0732 38.6156 71.7711 41.2149C75.9808 44.1761 80.7534 47.5312 90 47.5312V38.3906C83.6456 38.3906 80.7249 36.3376 77.0282 33.7382Z" fill="white"/>
</g>
<defs>
<clipPath id="clip0">
<rect width="156" height="156" fill="white" transform="translate(-66)"/>
</clipPath>
</defs>
</svg>
