<svg role="img" version="1.1" viewBox="-5.23 -5.23 261.897 39.908" xmlns="http://www.w3.org/2000/svg">
 <title>VMware logo</title>
 <g transform="translate(-5.2328289,-5.222)" >
  <path d="m112.5 37-11.5-32c-0.1-0.4-0.4-1-0.4-1.5 0-1.4 1.2-2.7 2.8-2.7 1.5 0 2.4 0.9 2.9 2.3l9.5 27.5 9.6-27.6c0.4-1.3 1.3-2.3 2.8-2.3h0.3c1.5 0 2.5 0.9 2.9 2.3l9.5 27.6 9.6-27.6c0.4-1.2 1.2-2.2 2.7-2.2 1.6 0 2.8 1.2 2.8 2.6 0 0.5-0.2 1.1-0.4 1.5l-11.5 32c-0.6 1.7-1.8 2.5-3.1 2.5h-0.2c-1.5 0-2.6-0.9-3.1-2.5l-9.4-27.1-9.5 27.2c-0.5 1.7-1.6 2.5-3.1 2.5h-0.2c-1.3 0-2.5-0.9-3-2.5m83.5-33.4c0-1.5 1.2-2.9 2.8-2.9s2.9 1.2 2.9 2.9v6.5c2.8-6.3 8.9-9.3 13-9.3 1.7 0 2.8 1.2 2.8 2.8 0 1.5-1 2.6-2.5 2.9-7.3 0.9-13.3 6.4-13.3 17.3v12.8c0 1.5-1.2 2.8-2.8 2.8s-2.9-1.2-2.9-2.8v-33m39.5 36.2c-10.2 0-18.5-7.9-18.5-19.5v-0.2c0-10.8 7.5-19.5 17.8-19.5 11 0 17.2 9 17.2 19 0 1.5-1.2 2.6-2.6 2.6h-26.8c0.8 8.1 6.4 12.7 13 12.7 4.6 0 7.9-1.8 10.7-4.3 0.4-0.4 0.9-0.6 1.6-0.6 1.4 0 2.4 1.1 2.4 2.4 0 0.6-0.3 1.3-0.9 1.8-3.4 3.4-7.6 5.6-13.9 5.6m11-21.6c-0.6-6.8-4.4-12.7-11.8-12.7-6.5 0-11.3 5.4-12 12.7zm-90.4 9.9v-0.1c0-7.9 6.6-12.2 16.1-12.2 4.8 0 8.2 0.7 11.6 1.6v-1.4c0-6.8-4.2-10.3-11.2-10.3-3.8 0-6 0.5-8.8 1.7-0.4 0.1-0.7 0.2-1 0.2-1.3 0-2.5-1.1-2.5-2.4 0-1.2 0.5-1.9 1.5-2.3 3.7-1.6 6.5-2.1 11.3-2.1 5.3 0 9.4 1.4 12.2 4.2 2.6 2.6 3.9 6.2 3.9 11v20.8c0 1.6-1.2 2.8-2.7 2.8-1.6 0-2.7-1.2-2.7-2.6v-3.6c-2.6 3.4-7 6.5-13.6 6.5-7-0.1-14.1-4.1-14.1-11.8m27.8-2.9v-3.6c-2.8-0.8-6.5-1.6-11.1-1.6-7.1 0-11 3.1-11 7.8v0.1c0 4.7 4.4 7.5 9.5 7.5 6.9 0 12.6-4.3 12.6-10.2m-173.6-22c-1.2-2.7-4.3-4-7.1-2.7-2.9 1.3-3.9 4.4-2.7 7.1l12 26c1.9 4.1 3.9 6.2 7.6 6.2 4 0 5.7-2.3 7.6-6.2 0 0 10.4-22.7 10.5-23 0.1-0.2 0.4-1 1.5-1 0.9 0 1.7 0.7 1.7 1.7v22.2c0 3.4 1.9 6.2 5.6 6.2s5.6-2.8 5.6-6.2v-18.1c0-3.5 2.5-5.8 5.9-5.8s5.7 2.4 5.7 5.8v18.2c0 3.4 1.9 6.2 5.6 6.2s5.6-2.8 5.6-6.2v-18.2c0-3.5 2.5-5.8 5.9-5.8s5.7 2.4 5.7 5.8v18.2c0 3.4 1.9 6.2 5.6 6.2 3.6 0 5.6-2.8 5.6-6.2v-20.7c0-7.6-6.1-12.9-13.4-12.9-7.4 0-12 5.1-12 5.1-2.4-3.2-5.8-5.1-11.5-5.1-6 0-11.3 5.1-11.3 5.1-2.5-3.2-6.6-5.1-10.1-5.1-5.3 0-9.6 2.3-12.2 8.3l-7.6 18-9.8-23.1m242.2 2.2c0-2.6 2.1-4.7 4.7-4.7s4.7 2.1 4.7 4.7-2.1 4.7-4.7 4.7c-2.7 0-4.7-2.1-4.7-4.7m8.4 0c0-2.1-1.6-3.8-3.8-3.8-2.1 0-3.8 1.7-3.8 3.8s1.6 3.8 3.8 3.8c2.1 0 3.8-1.7 3.8-3.8"/>
  <path d="m255.3 3.5c0-0.3 0.2-0.5 0.5-0.5h1.6c0.6 0 1 0.2 1.3 0.5 0.3 0.2 0.4 0.6 0.4 1 0 0.7-0.4 1.1-0.9 1.4l0.7 0.8c0.1 0.1 0.2 0.2 0.2 0.4 0 0.3-0.2 0.5-0.5 0.5-0.2 0-0.4-0.1-0.5-0.3l-1-1.2h-0.8v1c0 0.3-0.2 0.5-0.5 0.5s-0.5-0.2-0.5-0.5zm2 1.7c0.5 0 0.8-0.3 0.8-0.6 0-0.4-0.3-0.6-0.8-0.6h-1v1.3h1z"/>
 </g>
</svg>
