{
  "name": "Bootstrap",
  "alias": "bootstrap",
  "providers": ["\\Themes\\Bootstrap\\Providers\\BootstrapThemeServiceProvider"],
  "files": [],
  "plugins": {},
  "require": {},
  "required-dev": {}
}
