{
    "name": "Banking",
    "alias": "banking",
    "description": "",
    "keywords": [],
    "order": 0,
    "providers": [
        "Plugins\\Banking\\Providers\\BankingServiceProvider"
    ],
    "aliases": {},
    "files": [],
    "requires": []
}
