Archivo_518.csv
lista_t,0.0,0.55,1.1,1.6500000000000001,2.2
lista_vf,-1.04229,-1.042293,-1.04229,-1.042293,-1.042293
lista_vp_sd,44.79103,44.791042,17.291044,17.291048,67.691983
lista_vp_rectas,15.455084446904191,14.821437640158699,14.829131951972915,14.685622908165543,15.278161575939823
lista_vp_teorico,53.304072717825626,54.50532174451292,22.738908921897483,22.435577009600507,83.22669099258056
lista_Iis,-1.3575940191552272e-05,-1.5940068859639585e-05,-1.4351988123323895e-05,-1.3878175707739408e-05
lista_Ies,0.0003611608391608401,0.0003214428904428913,0.00011771095571095602,0.00010628438228438256,0.00031995104895104977
lista_TeV,16.30518886669591,16.665592768486622,7.134919808917022,7.043913990746429,25.282680033946793
lista_ne,326840616122690.8,287734359519629.5,161035127535309.28,146339212803513.62,232525329261516.12
