Archivo_506.csv
lista_t,0.0,0.5,1.05,1.6
lista_vf,-1.048408,-1.048401,-1.048408,-1.048405
lista_vp_sd,53.951605,21.868265,53.951605,26.451604
lista_vp_rectas,16.43381627520251,12.860080873614077,12.003650301613076,15.353817578725113
lista_vp_teorico,49.70995037246354,17.22758575368859,47.365579244325616,27.54410616139729
lista_Iis,-9.379125861772413e-05,-9.469352626703295e-05,-8.211953083504049e-05,-5.906950792864682e-05
lista_Ies,0.00209168531468532,0.0008561282051282073,0.0016268997668997713,0.0007047039627039646
lista_TeV,15.228703052743446,5.483226491004579,14.525336495971471,8.578426804389943
lista_ne,1958678571547283.0,1336038571385874.0,1559897204596775.0,879227316393670.0
