Archivo_509.csv
lista_t,0.0,0.55,1.1,1.6500000000000001,2.2
lista_vf,-1.03872,-1.038713,-1.03872,-1.038724,-1.038724
lista_vp_sd,67.670735,49.377954,67.670683,49.377946,26.461288
lista_vp_rectas,13.284391194371427,13.831727194026211,12.971171462769068,13.216797035292856,13.695439866459152
lista_vp_teorico,57.18032511800611,40.50634670845782,60.29854166375533,42.37030229953887,22.96191654187892
lista_Iis,-7.049841381245487e-05,-7.592732390235534e-05,-8.441067080040737e-05,-8.494561296725641e-05,-8.740282754578826e-05
lista_Ies,0.0027051515151515224,0.002237230769230775,0.0028903682983683057,0.002201179487179493,0.001118237762237765
lista_TeV,17.46708480228095,12.464496447383697,18.4026232111655,13.023730327792391,7.200757463546988
lista_ne,2365264232520811.5,2315643495722989.0,2462133527495313.0,2228876695402210.0,1522801676774433.0
