<?xml version="1.0" encoding="UTF-8"?>
<svg width="64px" height="64px" viewBox="0 0 64 64" version="1.1" xmlns="http://www.w3.org/2000/svg" xmlns:xlink="http://www.w3.org/1999/xlink">
    <title>lIT-Consulting</title>
    <defs>
        <linearGradient x1="10.0620258%" y1="80.4331039%" x2="90.1098867%" y2="-4.55630366%" id="linearGradient-1">
            <stop stop-color="#12EDE3" offset="0%"></stop>
            <stop stop-color="#20D2E0" offset="33%"></stop>
            <stop stop-color="#0073E6" offset="77.2126311%"></stop>
            <stop stop-color="#0073E6" offset="100%"></stop>
        </linearGradient>
    </defs>
    <g id="Icons" stroke="none" stroke-width="1" fill="none" fill-rule="evenodd">
        <g id="Artboard" transform="translate(-791.000000, -560.000000)">
            <g id="lIT-Consulting" transform="translate(791.000000, 560.000000)">
                <path d="M22,0 C22.5522847,0 23,0.44771525 23,1 L23,1 L23,4 L27,4 L27,1 C27,0.487164161 27.3860402,0.0644928393 27.8833789,0.00672773133 L27.8833789,0.00672773133 L28,0 L36,0 C36.5522847,0 37,0.44771525 37,1 L37,1 L37,4 L41,4 L41,1 C41,0.487164161 41.3860402,0.0644928393 41.8833789,0.00672773133 L41.8833789,0.00672773133 L42,0 L49,0 C49.5522847,0 50,0.44771525 50,1 L50,1 L50,7 C50,7.26521649 49.8946432,7.5195704 49.7071068,7.70710678 L49.7071068,7.70710678 L47.7071068,9.70710678 C47.5195704,9.89464316 47.2652165,10 47,10 L47,10 L46.594,10 L46.4963876,10.1814324 L46.2656053,10.6266522 C45.8074239,11.523924 45.3489649,12.4981493 44.9216354,13.513057 C44.3069595,14.9729122 43.8102785,16.3913185 43.4740319,17.7152896 C43.2666031,18.5320405 43.1246449,19.2969175 43.0533352,20.0003736 L44,20 C44.5522847,20 45,20.4477153 45,21 L45,21 L45,25 C45,25.5522847 44.5522847,26 44,26 L44,26 L42,26 L42,36 L44,36 C44.5128358,36 44.9355072,36.3860402 44.9932723,36.8833789 L45,37 L45,41 C45,41.9802291 45.1249577,43.104848 45.3609394,44.3437521 C45.6152468,45.678866 45.9900718,47.1060841 46.4535827,48.5738686 C46.775312,49.5926782 47.1203216,50.5702054 47.4651068,51.4704777 L47.4651068,51.4704777 L47.5537309,51.7001466 L47.671,52 L49,52 C49.5128358,52 49.9355072,52.3860402 49.9932723,52.8833789 L50,53 L50,56 L51,56 C51.5128358,56 51.9355072,56.3860402 51.9932723,56.8833789 L52,57 L52,63 C52,63.5522847 51.5522847,64 51,64 L51,64 L13,64 C12.4477153,64 12,63.5522847 12,63 L12,63 L12,57 C12,56.4477153 12.4477153,56 13,56 L13,56 L14,56 L14,53 C14,52.4871642 14.3860402,52.0644928 14.8833789,52.0067277 L15,52 L16.328,52 L16.4462691,51.7001466 L16.7416032,50.9213315 C17.016751,50.1775432 17.2890339,49.3889163 17.5464173,48.5738686 C18.0099282,47.1060841 18.3847532,45.678866 18.6390606,44.3437521 C18.8750423,43.104848 19,41.9802291 19,41 L19,41 L19,37 C19,36.4477153 19.4477153,36 20,36 L20,36 L22,36 L22,26 L20,26 C19.4871642,26 19.0644928,25.6139598 19.0067277,25.1166211 L19,25 L19,21 C19,20.4477153 19.4477153,20 20,20 L20,20 L20.9466648,20.0003736 C20.8753551,19.2969175 20.7333969,18.5320405 20.5259681,17.7152896 C20.1897215,16.3913185 19.6930405,14.9729122 19.0783646,13.513057 C18.6510351,12.4981493 18.1925761,11.523924 17.7343947,10.6266522 C17.6943863,10.5483023 17.6551094,10.4719792 17.6166252,10.3977527 L17.6166252,10.3977527 L17.405,10 L17,10 C16.7789863,10 16.565516,9.92683553 16.3919705,9.79391937 L16.2928932,9.70710678 L14.2928932,7.70710678 C14.1053568,7.5195704 14,7.26521649 14,7 L14,7 L14,1 C14,0.44771525 14.4477153,0 15,0 L15,0 Z M50,58 L14,58 L14,62 L50,62 L50,58 Z M12,8 L12,10 L2,10 L2,56 L10,56 L10,58 L1,58 C0.487164161,58 0.0644928393,57.6139598 0.00672773133,57.1166211 L0,57 L0,9 C0,8.48716416 0.38604019,8.06449284 0.883378875,8.00672773 L1,8 L12,8 Z M63,8 C63.5128358,8 63.9355072,8.38604019 63.9932723,8.88337887 L64,9 L64,57 C64,57.5128358 63.6139598,57.9355072 63.1166211,57.9932723 L63,58 L54,58 L54,56 L62,56 L62,10 L52,10 L52,8 L63,8 Z M48,54 L16,54 L16,56 L48,56 L48,54 Z M43.035,42 L20.964,42 L20.9426067,42.3110057 C20.8920355,42.916624 20.8086403,43.5522388 20.6947945,44.2154403 L20.6947945,44.2154403 L20.6037377,44.7179763 C20.3333538,46.1374921 19.9391458,47.6385147 19.4535827,49.1761314 C19.119062,50.2354468 18.7609466,51.2501071 18.4026068,52.1857723 L18.472,52 L45.527,52 L45.3826032,51.6151685 C45.1682141,51.0356347 44.9555884,50.4301352 44.7497741,49.8060873 L44.7497741,49.8060873 L44.5464173,49.1761314 C44.0608542,47.6385147 43.6666462,46.1374921 43.3962623,44.7179763 C43.2351089,43.871921 43.1206073,43.0680286 43.0573933,42.3110057 L43.0573933,42.3110057 L43.035,42 Z M43,38 L21,38 L21,40 L43,40 L43,38 Z M40,26 L24,26 L24,36 L40,36 L40,26 Z M14.7071068,26.2928932 L18.7071068,30.2928932 C19.0675907,30.6533772 19.0953203,31.2206082 18.7902954,31.6128994 L18.7071068,31.7071068 L14.7071068,35.7071068 L13.2928932,34.2928932 L15.585,32 L4,32 L4,30 L15.585,30 L13.2928932,27.7071068 L14.7071068,26.2928932 Z M49.2928932,26.2928932 L50.7071068,27.7071068 L48.415,30 L60,30 L60,32 L48.415,32 L50.7071068,34.2928932 L49.2928932,35.7071068 L45.2928932,31.7071068 C44.9324093,31.3466228 44.9046797,30.7793918 45.2097046,30.3871006 L45.2928932,30.2928932 L49.2928932,26.2928932 Z M33,30 L33,32 L31,32 L31,30 L33,30 Z M29,30 L29,32 L27,32 L27,30 L29,30 Z M37,30 L37,32 L35,32 L35,30 L37,30 Z M43,22 L21,22 L21,24 L43,24 L43,22 Z M44.342,10 L19.657,10 L19.8029144,10.2895405 C20.0896927,10.8709541 20.3741324,11.4784634 20.6495174,12.1047156 L20.6495174,12.1047156 L20.9216354,12.736943 C21.5723916,14.2824891 22.1010878,15.7923235 22.4644297,17.222982 C22.6965561,18.1369799 22.8572119,19.0037878 22.9385239,19.8182383 L22.9385239,19.8182383 L22.953,20 L41.046,20 L41.0614761,19.8182383 C41.1292361,19.1395295 41.2520959,18.4244615 41.4254994,17.6760245 L41.4254994,17.6760245 L41.5355703,17.222982 C41.8989122,15.7923235 42.4276084,14.2824891 43.0783646,12.736943 C43.5260351,11.6737257 44.0050761,10.6557635 44.4843947,9.71709784 L44.342,10 Z M21,2 L16,2 L16,6.585 L17.415,8 L46.584,8 L48,6.584 L48,2 L43,2 L43,5 C43,5.51283584 42.6139598,5.93550716 42.1166211,5.99327227 L42.1166211,5.99327227 L42,6 L36,6 C35.4477153,6 35,5.55228475 35,5 L35,5 L35,2 L29,2 L29,5 C29,5.51283584 28.6139598,5.93550716 28.1166211,5.99327227 L28.1166211,5.99327227 L28,6 L22,6 C21.4477153,6 21,5.55228475 21,5 L21,5 L21,2 Z" id="Combined-Shape" fill="url(#linearGradient-1)" fill-rule="nonzero"></path>
                <g id="Group-19"></g>
            </g>
        </g>
    </g>
</svg>