{
  "circuit_name": "group-users-managment-circuit",
  "eventmapping": {
    "initialCircuitAction": [
      "initModuleDashboard"
    ],
    "initModuleDashboard": ["group-users-manager-init"],
    "group-users-manager-init": [
      "group-users-manager-initialised"
    ],
    "logoutButtonClicked": []
  }
}