{
    "en": {
        "feature_name": "Permissions - Role Management",
        "step_description": "The new role will shown alphabetically in the list of roles",
        "step_image": "2.2.2_new_role_added_to_role_table.png",
        "step_name": "2.2.2 New role added to role table",
        "step_next": "2.3.1 Access role details",
        "step_previous": "2.2.1 Create a new role"
    }
}