{
  "circuit_name": "questionaire-circuit",
  "eventmapping": {
    "initialCircuitAction": [
      "initModuleQuestionaire"
    ],
    "initModuleQuestionaire": ["questionaireModuleInitialised"]
  }
}