{
  "language_id": "de",
  "Loading...": "Lade Daten...",
  "CS:Aufgaben": "Aufgaben",
  "CS:Kontakte": "Kontakte",
  "CS:Kalender": "Kalender",
  "CS:Dokumentation": "Dokumentation",
  "CS:Onlinemeeting": "Onlinemeeting",
  "CS:Onlinemeeting Apps Menu Subtitle": "Video Onlinemeetings übersichtlich und mit Mehrwert",
  "CS:Kalender Apps Menu Subtitle": "Der Kalender - dein Allesplan",
  "CS:Kontakte Apps Menu Subtitle": "Kontakte immer und überall",
  "CS:Aufgaben Apps Menu Subtitle": "ToDos übersichtlich und zugeordnet",
  "CS:Dokumentation Apps Menu Subtitle": "Dokumentation übersichtlich und zugeordnet",
  "CS:Veranstaltungen": "Veranstaltungen",
  "CS:Veranstaltungen Subtitle": "Verwalte und teile deine Veranstaltungen online",
  "CS:Veranstaltungen Apps Menu Subtitle": "Einfaches Verwalten von Veranstaltungen.",
  "CS:Kalender Subtitle": "Online Kalender für die einfache Termin-/Arbeits-Organisation.",
  "CS:Aufgaben Subtitle": "Zuweisen, Verwalten und Überwachen von Aufgaben für dich und dein Team.",
  "CS:Kontakte Subtitle": "Einfaches Erfassen und Verwalten von Adressen und Kontaktdaten.",
  "CS:Dokumentation Subtitle": "Einfaches Erfassen und Verwalten von Dokumentationen.",
  "CS:Dokumentation Link": "Deine Dokumentation",
  "CS:Callcenter Link": "Dein Callcenter",
  "CS:Questionare Administration": "Fragebogen Verwaltung",
  "serviceBLICK": "serviceBLICK",
  "My Apps": "Meine Apps",
  "My Account": "Mein Benuterkonto",
  "News and information": "News und Info",
  "Full screen": "Vollbild",
  "Help": "Hilfe",
  "My User Account": "Mein Benuterkonto",
  "Edit": "bearbeiten",
  "edit": "bearbeiten",
  "Edit Alt": "bearbeiten  >",
  "Save": "Speichern",
  "save": "Speichern",
  "Saved": "Erfolgreich gespeichert",
  "Save Changes": "speichern",
  "Cancel": "Abbrechen",
  "cancel": "Abbrechen",
  "delete": "Löschen",
  "visible-for": "Sichtbar für",
  "visible for": "Sichtbar für",
  "advanced options": "Erweiterte Details",
  "close": "schließen",
  "Data has been updated": "Daten wurden aktualisiert",
  "Save changes": "Änderungen übernehmen",
  "Group": "Gruppe",
  "User": "Nutzer",
  "Tasklist": "Aufgabenliste",
  "send": "Absenden",
  "Settings": "Einstellungen",
  "resource": "Ressource",
  "status": "Status",
  "comment button": "Kommentare",
  "Documentation": "Dokumentation",
  "History": "Revisionsverlauf",
  "history button": "Revisionsverlauf",
  "Show Revision History": "Revisionsverlauf anzeigen",
  "Hide Revision History": "Revisionsverlauf ausblenden",
  "Revision History": "Revisionsverlauf",
  "Filter Button": "<i class=\"typcn typcn-filter tx-20\"></i> Filter Optionen",
  "Taskmanager": "Aufgabenmanager",
  "Your changes are not saved yet": "Du hast nicht gespeichert.",
  "Do you want to leave the detail view? All changes will be lost.": "Möchtest du wirklich die Detailansicht verlassen? Alle Änderungen gehen verloren.",
  "Yes, leave": "Ja, verlassen",
  "first": "Anfang",
  "last": "Ende",
  "next": "Nächste",
  "previous": "Vorherige",
  "Search...": "Suchen...",
  "_PAGE_ of _PAGES_": "_PAGE_ von _PAGES_",
  "Showing 0 to 0 of 0 entries": "Seite 0 von 0",
  "Ok": "Okay",
  "Confirm": "Auswahl bestätigen",
  "Close": "Schließen",
  "Alert": "Wichtiger Hinweis",
  "Example": "Beispiel",
  "Setting": "Einstellungen",
  "Permissions": "Berechtigungen",
  "User management": "Benutzerverwaltung",
  "Role Management": "Rollenverwaltung",
  "Account settings": "Kontoverwaltung",
  "pw error length": "Das Passwort muss mindestens 8 Zeichen lang sein",
  "pw error letter": "1 Kleinbuchstabe enthalten",
  "pw error capital": "1 Großbuchstabe enthalten",
  "pw error number": "1 Ziffer enthalten",
  "pw error special": "1 Sonderzeichen !@#$%&*()-__+. enthalten",
  "E-Mail Signature": "E-Mail Signatur",
  "Billing": "Abrechnung",
  "Billing Address": "Rechnungsadresse",
  "Actual Plan": "Aktueller Plan",
  "Something went wrong, please try again": "Etwas ist schief gelaufen, bitte versuche es erneut.",
  "Ooops...": "Hoppla...",
  "PERMISSIONS": "BERECHTIGUNGEN",
  "Abort": "Abbrechen",
  "details": "Details",
  "legal": "legal",
  "imprint": "Impressum",
  "privacy": "Datenschutz",
  "CROWDSOFT FOUNDATION": "CROWDSOFT FOUNDATION",
  "Quick links": "Quick links",
  "Rollenverwaltung": "Rollenverwaltung",
  "Benutzerverwaltung": "Benutzerverwaltung",
  "Gruppenverwaltung": "Gruppenverwaltung",
  "Verwaltung": "Verwaltung",
  "Anwendungen": "Anwendungen",
  "LogIn Form": "Anmeldung",
  "Back to Page": "Zurück zur Seite",
  "Overview": "Übersicht",
  "Tags": "Tags",
  "E-Mail": "E-Mail",
  "news": "Neuigkeiten",
  "News": "Neuigkeiten",
  "search for something...": "Suche nach irgendetwas...",
  "Backup": "Sicherung",
  "Logo": "Logo",
  "Downloads": "Downloads",
  "csv": "CSV",
  "json": "JSON",
  "Insert your text here": "Geben sie bitte hier ihren Text ein",
  "New global tag": "Neues globales Tag",
  "Next >": "Weiter >",
  "< Back": "< Zurück",
  "Order now": "Jetzt kostenpflichtig bestellen",
  "Disabled to prevent data-loss due to an error while page load. Please reload the page and try again.": "Deaktiviert um Datenverlust zu verhindern der durch einen Fehler beim laden der Seite entstehen könnte. Bitte lade die Seite neu und versuch es noch einmal.",
  "Not available": "Nicht verfügbar",
  "Reload": "Aktualisieren",
  "Wait 60s": "60s warten",
  "Lost live-connection. You should reload this page to prevent data-loss. Shall we reload the page now?": "Live-Verbindung zum System wurde verloren. Um Datenverlust zu vermeiden aktualisiere bitte diese Seite.",
  "Lost live-connection": "Live-Verbindung verloren",
  "Sorry for the delay, we're still trying to establish a live-connection...": "Sorry für die Wartezeit, wir versuchen immernoch eine Live-Verbindung herzustellen...",
  "This takes way longer than usual. Maybe you lost your Internet-Connection?": "Das dauert viel länger als üblich. Hast Du evtl. keine Internetverbindung mehr?",
  "AppointmentInviteSubjectPersonal": "Wähle deinen Termin für unsere Besprechung aus!",
  "AppointmentInviteSubjectFormal": "Terminauswahl für Besprechung",
  "AppointmentInviteBodyPersonal": "Hallo [Firstname],\n\nIch hoffe, es geht dir gut. Ich möchte gerne einen Termin für unsere Besprechung finden, der für uns beide passt. Um das möglichst reibungslos zu gestalten, habe ich einen Kalender eingerichtet, über den du deinen bevorzugten Termin auswählen kannst.\n\nBitte klicke auf den folgenden Link, um zu unserem Kalender zu gelangen und einen Termin zu wählen, der für dich am besten funktioniert: [Link]\n\nVielen Dank im Voraus! Ich freue mich darauf, mit dir zu sprechen.\n\nBeste Grüße,",
  "AppointmentInviteBodyFormal": "Sehr geehrte/r [Firstname] [Lastname],\n\nIch plane gerade unsere Besprechung und würde gerne Ihren Zeitplan berücksichtigen, um einen Termin zu finden, der für uns beide passend ist. Zu diesem Zweck habe ich einen Kalender eingerichtet, über den Sie bequem einen für Sie geeigneten Zeitpunkt auswählen können.\n\nHier ist der Link zu unserem Kalender, bitte nehmen Sie sich einen Moment Zeit, um Ihren bevorzugten Termin zu wählen: [Link]\n\nVielen Dank im Voraus! Ich freue mich darauf, mit Ihnen zu sprechen.\n\nMit freundlichen Grüßen,",
  "AppointmentInviteOnlineDemonstrationSubjectFormal": "Vielen Dank für Ihr Interesse an der planB Suite - wie geht es weiter?",
  "AppointmentInviteOnlineDemonstration": "Sehr geehrte/r [Firstname] [Lastname],\n\nvielen Dank für das angenehme Telefongespräch (heute/letzte Woche). Es hat mich sehr gefreut, dass Sie Interesse an unserer planB Suite gezeigt haben. Diese Software wird bereits seit Jahren erfolgreich u.a. vom Frauennotruf München im Beratungsalltag genutzt.\nUm Ihre konkreten Bedürfnisse noch besser zu verstehen und Ihnen gleichzeitig einen umfassenden Einblick in unsere Software zu geben, laden wir Sie herzlich zu einer unverbindlichen Online-Demo ein. Während dieser Demonstration erfahren Sie, wie die planB Suite funktioniert, wie sie aussieht und welche Funktionen sie bietet. Wir zeigen Ihnen, wie die planB Suite Ihre Arbeitsabläufe vereinfachen und effizienter gestalten kann, sodass Sie mehr Zeit für Ihr Kerngeschäft haben.\nBitte buchen Sie selbst einen passenden Termin für die Online-Demo. Klicken Sie hierzu auf den folgenden Link und akzeptieren Sie die Datenschutzeinstellungen, um den Kalender zu sehen.\n\n[Link]\n\nUnser Geschäftsführer Martin Wallmeier freut sich auf ein ungezwungenes und informatives Online-Video-Gespräch mit Ihnen.\nSollten Sie weitere Fragen haben oder zusätzliche Informationen zu unserer Software benötigen, zögern Sie bitte nicht, uns zu kontaktieren. Sie können uns direkt per E-Mail unter folgender Adresse erreichen:\n\ninfo@planblick.com \n\noder telefonisch unter: +49 89 55268992.\n\nIch bin fest davon überzeugt, dass unsere Software eine wertvolle Unterstützung für Ihre Beratungsstelle sein kann und wir freuen uns darauf, gemeinsam mit Ihnen Lösungen zu erarbeiten.\nMit freundlichen Grüßen,\n\n",
  "The filename is too long. Please rename the file and try again.": "Der Dateiname ist zu lang. Bitte benenne die Datei um und versuche es erneut.",
  "Giving up in 5 Seconds and performing automatic reload...": "Wir geben in 5 Sekunden auf und versuchen die Seite komplett neu zu laden...",
  "Notifications": "Benachrichtigungen",
  "Observers": "Beobachter",
  "Archive": "Archivieren",
  "Archived": "Erfolgreich archiviert",
  "Restore": "Wiederherstellen",
  "changed": "geändert",
  "Tasks": "Aufgaben",
  "select": "Auswahl",
  "Format for new field": "Format für neues Feld",
  "New Field": "Neues Feld",
  "ID": "ID",
  "Name": "Name",
  "An error has occurred. Please contact the support.": "Ein Fehler ist aufgetreten. Bitte wende dich an den Support",
  "Share invitation" : "Einladung Teilen",
  "Share with link" : "Mit Link teilen",
  "copy link" : "Link kopieren",
  "Successfully copied": "Erfolgreich kopiert",
  "Copy failed": "Kopieren fehlgeschlagen",
      "open": "Zu Bearbeiten",
  "planned": "Geplant",
  "onhold": "Wartend",
  "pending": "In Bearbeitung",
  "closed": "Erledigt",
  "canceled": "Verworfen",
  "finished": "Abgeschlossen"
}