{
    "en": {
        "feature_name": "Easy2Schedule",
        "step_description": "After a short moment, your event should appear in the calendar.",
        "step_image": "easy2schedule_create_new_event_step_4.png",
        "step_name": "Easy2Schedule Create new event step 4",
        "step_next": "Easy2Schedule Delete an event step 1",
        "step_previous": "Easy2Schedule Create new event step 3"
    }
}