{
  "circuit_name": "sysadmin-dashboard-circuit",
  "eventmapping": {
    "initialCircuitAction": [
      "initModuleSysAdmin"
    ],
    "initModuleSysAdmin": ["sysadminModuleInitialised"]
  }
}