{
  "circuit_name": "dashboard-circuit",
  "eventmapping": {
    "initialCircuitAction": [
      "initModuleDashboard"
    ],
    "initModuleDashboard": ["dashboardModuleInitialised"],
    "notifyAnotherCustomerAboutAButtonClick": [],
    "getMeAnApiKey": [],
    "easy2scheduleDataExportRequested": []

  },
  "intentions": {
    "greetUnknownPerson": {
      "invocations": [
        "nein",
        "ja",
        "habe termin",
        "brauche termin",
        "hätte termin",
        "personal",
        "persönlich"
      ],
      "triggeredEvents": [
        "sayGoodbye",
        "greetUnknownPersonHelp",
        "customerWithAppointmentWaiting",
        "customerWhoWantsAppointmentWaiting",
        "customerWhoWantsAppointmentWaiting",
        "customerWantsPersonalWaiting",
        "customerWantsPersonalWaiting"
      ]
    }
  }
}