{
  "circuit_name": "customer-shop-circuit",
  "eventmapping": {
    "initialCircuitAction": [
      "init"
    ],
    "init": [],
    "removeFromBasket": [],
    "addToBasket": [],
    "getMeAnApiKey": [],
    "shopSessionQuit": [],
    "newChatMessage": [],
    "orderNoticeUpdate": [],
    "orderSubmitted": [],
    "shopSessionAcceptedBy": [],
    "merchantIsOnline": [],
    "merchantStatus": []
  }
}