[
    {
        "title": "Einfach </br> Durchstarten!",
        "intro": "Lernen wir die <strong>Hauptansicht des Aufgabenmanagers kennen</strong>. Klicken Sie einfach auf die Pfeilschaltflächen, um durch die Tour zu gelangen. Klicken Sie auf <strong> x</strong>, um die Tour abzubrechen."
    },
    {
        "element": "#listSelect",
        "intro": "Ihre Aufgaben werden in <strong>Listen kategorisiert</strong> . Sie können zwischen Ihren Listen wechseln, indem Sie das Menü Aufgabenliste verwenden."
    },
    {
        "element": "#task-search",
        "intro": "Durch Eingabe von Suchbegriffen in das <strong>Suchfeld (mit oder ohne Filterkriterien)</strong> können Sie innerhalb der aktuell ausgewählten Liste nach bestimmten Aufgaben suchen."
    },
    {
        "element": "#button-toggle-filter",
        "intro": "Wenn Sie auf die Filterschaltfläche klicken, werden die <strong>Filtereinstellungen ein- und ausgeblendet</strong>. Wählen Sie aus einer Reihe von voreingestellten Filtern aus, um schnell die für Sie relevanten Aufgaben zu finden."
    },
    {
        "element": "#open-tickets",
        "intro": "In der Standardaufgabenansicht werden alle Arten von <strong>offenen Aufgaben angezeigt</strong>. Verwenden Sie Filter, um schon geschlossene Aufgaben oder nur einen einzelnen bestimmten Status anzuzeigen."
    },
    {
        "element": ".task-element",
        "intro": "Die Listenansicht gibt Ihnen einen schnellen Überblick über Ihre Aufgaben. Um vollständige Details anzuzeigen oder eine Aufgabe zu bearbeiten, <strong>klicken Sie einfach darauf und Sie gelangen in die Detailansicht</strong>."
    },
    {
        "element": ".action-dropdown ",
        "intro": "Im <strong>Aktionsmenü</strong>, rechts neben jeder Aufgabenübersicht, finden Sie eine Auswahl an Schnellaktionen."
    },
    {
        "element": ".handle",
        "intro": "<strong>Priorisieren</strong> Sie Ihre Aufgaben per <strong>Drag & Drop</strong>, indem Sie den Greiferbereich links neben jeder Aufgabenübersicht verwenden. Diese Funktion ist bei Verwendung von Filtern nicht verfügbar."
    },
    {
        "element": "#button-new-task",
        "intro": "Eine Möglichkeit, eine neue Aufgabe zu erstellen, besteht darin, auf </strong>Neue Aufgabe zu klicken</strong>. Dadurch wird eine <strong>leere neue Aufgabe</strong> erstellt."
    },
    {
        "element": "#button-new-task-template",
        "intro": "Sie können eine <strong>Aufgabe auch aus einer Vorlage erstellen</strong>, die Sie beim Speichern einer vorherigen Aufgabe erstellt haben.  Klicken Sie auf den Pfeil und wählen Sie aus der Liste der verfügbaren Vorlagen aus."
    },
    {
        "element": ".az-header-left",
        "intro": "Sie können jederzeit <strong>zur Listenansicht zurückkehren</strong>, indem Sie auf diesen Bereich mit dem Logo und dem Namen der App klicken."
    },
    {
        "element": "#header_settings_menu",
        "intro": "Über das <strong>Einstellungsmenü</strong> können Sie basierend auf Ihren Benutzerberechtigungen auf alle Anpassungsfunktionen für diese Anwendung zugreifen."
    },
    {
        "element": "#help",
        "intro": "Starten Sie jederzeit eine Tour über das <strong>Hilfemenü</strong>."
    },
    {
        "element": "#header_apps_menu",
        "intro": "Wechseln Sie schnell zwischen all Ihren Apps und dem Dashboard über das <strong>App-Menü</strong>."
    },
    {
        "element": "#header_profile_menu",
        "intro": "Alle Funktionen und Einstellungen für Ihr Kontoprofil erreichen Sie hier über das <strong>Profilmenü</strong>"
    },
    {
        "title": "Großartig!",
        "intro": "Jetzt kennen Sie sich in der Listenansicht aus. <strong>Fertig</strong> bringt Sie zum Help Center, wo Sie weitere Touren finden"
    }
]