{
  "circuit_name": "cruises",
  "eventmapping": {
    "initialCircuitAction": [
      "initModuleCruises"
    ],
    "initModuleCruises": ["cruisesModuleInitialised"],
    "cruisesModuleInitialised": ["CruisesListContractView"],
    "logoutButtonClicked": []
  }
}