{
  "circuit_name": "easy2schedule-user-settings-circuit",
  "eventmapping": {
    "initialCircuitAction": [
      "initModuleEasy2Schedule"
    ],
    "initModuleEasy2Schedule": ["initEasy2ScheduleUserSettings"],
    "initEasy2ScheduleUserSettings": ["easy2ScheduleUserSettingsInitialized"],
    "logoutButtonClicked": []
  }
}
