{
  "circuit_name": "system-account-settings-circuit",
  "eventmapping": {
    "initialCircuitAction": [
      "initModuleDashboard"
    ],
    "initModuleDashboard": ["initSystemAccountProfileSettings"],
    "initSystemAccountProfileSettings": ["systemAccountProfileSettingsInitialized"],
    "logoutButtonClicked": []
  }
}
