<?xml version="1.0" encoding="utf-8"?>
<!-- Generator: Adobe Illustrator 15.0.0, SVG Export Plug-In . SVG Version: 6.00 Build 0)  -->
<!DOCTYPE svg PUBLIC "-//W3C//DTD SVG 1.1//EN" "http://www.w3.org/Graphics/SVG/1.1/DTD/svg11.dtd">
<svg version="1.1" id="Layer_1" xmlns="http://www.w3.org/2000/svg" xmlns:xlink="http://www.w3.org/1999/xlink" x="0px" y="0px"
	 width="200px" height="200px" viewBox="0 0 200 200" enable-background="new 0 0 200 200" xml:space="preserve">
<title>header-illustration</title>
<g>
	<g id="Layer_1_1_">
		<path fill="#FFEBC8" d="M23.257,156.159L0.583,173.588l118.48,2.684H200v-3.297l-19.604-17.303L23.257,156.159z"/>
		<path fill="#FDE1AB" d="M147.789,173.385H7.144v6.008H147.76v-6.008H147.789z"/>
		<path fill="#FDDE9E" d="M200,173.355h-99.905v6.182H200V173.355z"/>
		<path fill="#FFFFFF" d="M199.417,173.734H0.583c-0.32,0-0.583-0.146-0.583-0.379c0-0.176,0.262-0.379,0.583-0.379h198.834
			c0.321,0,0.583,0.146,0.583,0.379C200,173.588,199.738,173.734,199.417,173.734z"/>
		<path fill="#F47E14" d="M83.375,26.132c0,0-0.2-0.229-0.458-0.516c-0.287-0.315-0.63-0.745-1.002-1.174
			c-0.201-0.229-0.373-0.43-0.544-0.602c-0.143-0.188-0.267-0.39-0.373-0.601c-0.135-0.2-0.232-0.423-0.286-0.659l0.029-0.029
			c0.199,0.142,0.381,0.305,0.544,0.487c0.176,0.168,0.339,0.35,0.487,0.544c0.172,0.229,0.286,0.458,0.458,0.688
			c0.315,0.487,0.601,0.945,0.831,1.289c0.229,0.344,0.372,0.573,0.372,0.573H83.375L83.375,26.132z"/>
		<path fill="#F47E14" d="M90.391,24.299c0,0,0.029-0.258,0.057-0.601c0.029-0.344,0.086-0.859,0.172-1.347
			c0.029-0.258,0.029-0.487,0.057-0.716c0.023-0.209,0.081-0.412,0.172-0.602c0.144-0.342,0.258-0.571,0.258-0.571h0.029
			c0.039,0.217,0.048,0.438,0.029,0.658c-0.007,0.221-0.026,0.44-0.057,0.659c-0.029,0.229-0.144,0.458-0.201,0.716
			c-0.143,0.487-0.229,0.974-0.315,1.317c-0.047,0.194-0.105,0.385-0.172,0.573L90.391,24.299z"/>
		<path fill="#F47E14" d="M80.224,32.003h-0.601c-0.372,0-0.859-0.029-1.347-0.029c-0.239,0.005-0.478-0.004-0.716-0.029
			c-0.208-0.01-0.411-0.059-0.601-0.143c-0.209-0.053-0.411-0.129-0.602-0.229v-0.028c0.199-0.041,0.399-0.07,0.602-0.086h0.632
			c0.241,0.034,0.479,0.082,0.715,0.143c0.487,0.086,0.974,0.172,1.347,0.229c0.204,0.034,0.404,0.082,0.602,0.143L80.224,32.003z"
			/>
		<path fill="#F47E14" d="M80.568,28.595c0,0-0.63-0.258-1.26-0.573c-0.161-0.059-0.314-0.136-0.458-0.229
			c-0.114-0.086-0.258-0.201-0.343-0.258c-0.108-0.104-0.204-0.219-0.287-0.344l0.029-0.029c0.156,0.006,0.311,0.035,0.458,0.086
			c0.154,0.042,0.299,0.11,0.43,0.201c0.143,0.086,0.258,0.201,0.429,0.286c0.544,0.401,1.088,0.831,1.088,0.831L80.568,28.595z"/>
		<path fill="#F47E14" d="M86.811,23.841c0,0-0.257-0.659-0.516-1.289c-0.055-0.167-0.122-0.33-0.201-0.487
			c-0.031-0.151-0.05-0.304-0.057-0.458c0-0.153,0.009-0.306,0.029-0.458h0.029c0.107,0.118,0.195,0.254,0.258,0.401
			c0.074,0.136,0.132,0.28,0.171,0.43c0.029,0.171,0.058,0.315,0.086,0.516c0.143,0.687,0.229,1.375,0.229,1.375L86.811,23.841z"/>
		<g>
			<g>
				<g>
					<path fill="#FBE7CE" d="M157.602,85.841c0.752,1.091,2.23,1.395,3.351,0.687l0.945-0.658c0.676-0.43,1.573-0.231,2.003,0.445
						c0.197,0.31,0.27,0.683,0.202,1.044l-0.258,1.117c-0.233,1.306,0.599,2.565,1.892,2.864l3.551,0.687
						c1.306,0.233,2.564-0.599,2.863-1.891l0.258-1.117c0.148-0.777,0.896-1.288,1.674-1.14c0.383,0.073,0.72,0.298,0.933,0.625
						l0.658,0.945c0.739,1.106,2.235,1.404,3.343,0.665c0.002-0.002,0.005-0.004,0.008-0.006l3.064-2.004
						c1.092-0.751,1.395-2.23,0.688-3.351l-0.658-0.945c-0.43-0.676-0.229-1.573,0.447-2.002c0.309-0.196,0.68-0.268,1.04-0.202
						l1.088,0.258c1.306,0.233,2.565-0.599,2.864-1.891l0.688-3.551c0.232-1.306-0.6-2.565-1.892-2.864l-1.089-0.258
						c-0.771-0.145-1.279-0.888-1.135-1.659c0.074-0.393,0.309-0.736,0.648-0.947l0.945-0.658c1.097-0.75,1.39-2.241,0.658-3.351
						l-2.002-3.063c-0.751-1.097-2.242-1.39-3.352-0.659l-0.945,0.659c-0.676,0.43-1.572,0.231-2.002-0.445
						c-0.197-0.31-0.27-0.683-0.203-1.044l0.258-1.088c0.233-1.306-0.598-2.565-1.891-2.864l-3.55-0.688
						c-1.306-0.233-2.565,0.599-2.864,1.892l-0.258,1.088c-0.145,0.771-0.888,1.28-1.659,1.135c-0.394-0.074-0.736-0.31-0.946-0.649
						l-0.659-0.945c-0.751-1.091-2.23-1.395-3.351-0.687l-3.064,2.005c-1.092,0.751-1.395,2.23-0.688,3.35l0.658,0.945
						c0.431,0.676,0.231,1.573-0.444,2.003c-0.31,0.197-0.683,0.27-1.044,0.202l-1.088-0.258c-1.307-0.233-2.565,0.599-2.864,1.891
						l-0.687,3.551c-0.233,1.306,0.598,2.565,1.891,2.864l1.088,0.258c0.771,0.145,1.28,0.888,1.135,1.659
						c-0.072,0.393-0.309,0.736-0.648,0.947l-0.944,0.658c-1.097,0.75-1.39,2.241-0.659,3.351L157.602,85.841z M165.82,72.582
						c2.807-5.355,10.252-3.866,10.711,2.148c0.064,0.782-0.094,1.567-0.459,2.262c-2.807,5.355-10.252,3.866-10.71-2.147
						C165.32,74.063,165.478,73.284,165.82,72.582z"/>
					<path fill="#FBE7CE" d="M140.647,90.365c-0.073,0.674,0.351,1.303,1.003,1.489l1.402,0.458c0.582,0.176,1,0.685,1.061,1.289
						c-0.006,0.174,0.014,0.348,0.057,0.516c0.072,0.593-0.223,1.17-0.744,1.461l-1.348,0.687c-0.619,0.299-0.933,1-0.744,1.661
						c0.232,0.689,0.98,1.06,1.67,0.827c0.065-0.022,0.129-0.05,0.191-0.082l1.46-0.745c0.537-0.25,1.173-0.148,1.604,0.258
						c0.086,0.086,0.258,0.2,0.343,0.286c0.488,0.376,0.675,1.026,0.458,1.604l-0.458,1.403c-0.221,0.648,0.058,1.361,0.659,1.689
						c0.691,0.312,1.504,0.004,1.814-0.688c0.018-0.038,0.033-0.076,0.047-0.115l0.458-1.489c0.175-0.582,0.685-1,1.288-1.06
						c0.164,0.006,0.328-0.013,0.487-0.058c0.593-0.071,1.17,0.223,1.46,0.745l0.688,1.347c0.299,0.618,1,0.933,1.66,0.745
						c0.689-0.233,1.061-0.98,0.828-1.67c-0.023-0.066-0.051-0.131-0.083-0.191l-0.745-1.461c-0.249-0.537-0.146-1.172,0.258-1.604
						c0.087-0.086,0.201-0.258,0.287-0.343c0.376-0.488,1.026-0.674,1.604-0.458l1.402,0.458c0.648,0.221,1.362-0.057,1.69-0.659
						c0.312-0.691,0.003-1.504-0.688-1.816c-0.037-0.017-0.076-0.032-0.115-0.045l-1.488-0.458c-0.582-0.175-1-0.684-1.061-1.289
						c0.006-0.173-0.014-0.347-0.057-0.516c-0.071-0.593,0.223-1.17,0.744-1.46l1.348-0.687c0.619-0.3,0.933-1,0.744-1.661
						c-0.232-0.689-0.98-1.06-1.669-0.827c-0.066,0.022-0.13,0.05-0.192,0.082l-1.46,0.745c-0.537,0.25-1.172,0.148-1.604-0.258
						c-0.087-0.114-0.258-0.201-0.344-0.315c-0.488-0.376-0.674-1.026-0.458-1.604l0.458-1.403c0.222-0.648-0.058-1.362-0.659-1.689
						c-0.691-0.312-1.504-0.003-1.814,0.688c-0.018,0.038-0.033,0.076-0.047,0.115l-0.457,1.489c-0.176,0.582-0.686,1-1.289,1.06
						c-0.164-0.006-0.328,0.013-0.486,0.057c-0.594,0.072-1.17-0.223-1.461-0.744l-0.688-1.347c-0.299-0.619-1-0.933-1.66-0.745
						c-0.689,0.232-1.061,0.98-0.828,1.669c0.023,0.066,0.051,0.13,0.083,0.192l0.745,1.46c0.25,0.537,0.146,1.172-0.258,1.604
						c-0.086,0.086-0.201,0.258-0.287,0.343c-0.376,0.488-1.026,0.674-1.604,0.458l-1.488-0.458
						c-0.703-0.221-1.451,0.168-1.673,0.871C140.673,90.238,140.658,90.301,140.647,90.365z M147.406,91.568
						c2.205-3.351,6.959-1.804,6.815,2.205c0.007,0.488-0.155,0.964-0.458,1.347c-2.205,3.351-6.959,1.804-6.816-2.205
						C146.941,92.427,147.104,91.951,147.406,91.568L147.406,91.568z"/>
					<path fill="#FBE7CE" d="M121.52,73.727c0.322,0.257,0.744,0.352,1.145,0.258l3.953-0.859c0.61-0.142,1.242,0.139,1.546,0.688
						c0.348,0.617,0.751,1.202,1.202,1.747c0.413,0.488,0.448,1.192,0.086,1.718l-2.205,3.351c-0.203,0.345-0.274,0.752-0.2,1.146
						c0.745,2.406,3.294,2.463,4.296,0.888l1.891-2.95c0.352-0.523,0.996-0.765,1.604-0.601c0.684,0.184,1.385,0.299,2.091,0.344
						c0.642,0.04,1.173,0.513,1.288,1.146l0.859,3.952c0.088,0.397,0.336,0.74,0.688,0.945c2.205,1.146,4.067-0.602,3.694-2.406
						l-0.745-3.465c-0.141-0.611,0.139-1.242,0.688-1.546c0.617-0.348,1.202-0.75,1.748-1.203c0.477-0.412,1.172-0.448,1.689-0.086
						l3.35,2.205c0.346,0.204,0.752,0.275,1.146,0.201c2.404-0.745,2.463-3.293,0.887-4.295l-2.949-1.891
						c-0.523-0.351-0.766-0.996-0.602-1.604c0.185-0.684,0.299-1.384,0.344-2.09c0.041-0.642,0.514-1.173,1.146-1.289l3.951-0.859
						c0.396-0.087,0.74-0.336,0.945-0.688c1.146-2.205-0.602-4.067-2.406-3.694l-3.465,0.745c-0.611,0.142-1.242-0.139-1.546-0.687
						c-0.349-0.617-0.751-1.202-1.203-1.747c-0.412-0.477-0.448-1.173-0.086-1.689l2.205-3.351c0.204-0.345,0.275-0.752,0.2-1.146
						c-0.744-2.405-3.293-2.462-4.295-0.888l-1.891,2.95c-0.352,0.523-0.996,0.765-1.604,0.602
						c-0.684-0.184-1.384-0.299-2.091-0.344c-0.641-0.04-1.173-0.513-1.288-1.146l-0.858-3.952c-0.088-0.397-0.337-0.74-0.688-0.945
						c-2.205-1.146-4.068,0.602-3.695,2.406l0.745,3.465c0.142,0.611-0.139,1.242-0.688,1.546c-0.616,0.348-1.202,0.75-1.747,1.203
						c-0.477,0.407-1.162,0.453-1.689,0.115l-3.35-2.205c-0.346-0.204-0.753-0.275-1.146-0.201
						c-2.405,0.745-2.463,3.293-0.888,4.295l2.95,1.892c0.523,0.35,0.765,0.995,0.602,1.604c-0.185,0.684-0.3,1.384-0.344,2.09
						c-0.041,0.642-0.514,1.173-1.146,1.289l-3.465,0.745C120.373,69.775,119.515,72.238,121.52,73.727z M129.166,67.569
						c1.202-8.677,11.912-10.968,16.58-3.551c0.952,1.518,1.338,3.323,1.088,5.097c-1.203,8.677-11.913,10.968-16.58,3.551
						C129.327,71.139,128.943,69.343,129.166,67.569L129.166,67.569z"/>
				</g>
			</g>
		</g>
		<path fill="#465291" d="M170.46,165.768H23.38c-3.923,0-5.7-4.896-2.692-7.446l20.074-16.896h112.373l20.074,16.896
			C176.188,160.87,174.383,165.768,170.46,165.768z"/>
		<path fill="#7177B5" d="M170.46,162.76H23.38c-3.923,0-5.7-4.896-2.692-7.445l20.074-16.896h112.373l20.074,16.896
			C176.188,157.863,174.383,162.76,170.46,162.76z"/>
		<path fill="#272556" d="M39.331,136.213V72.267c0.006-1.489,1.203-2.698,2.692-2.72h109.793c1.494,0.012,2.697,1.227,2.693,2.72
			v63.946c-0.007,1.489-1.204,2.699-2.693,2.721H42.022c-1.479,0.008-2.684-1.184-2.692-2.662
			C39.331,136.252,39.331,136.232,39.331,136.213z"/>
		<path fill="#FFFFFF" d="M151.502,74.128v61.799H42.309V74.128H151.502z"/>
		<path fill="#FFF9EE" d="M151.502,135.927v-8.819c-32.76,3.063-78.551-38.604-109.193-41.438v50.259h109.193V135.927z"/>
		<path fill="#465291" d="M143.255,142.828h8.362l-1.775-1.574c-0.029-0.021-0.049-0.053-0.059-0.086h-8.074L143.255,142.828z"/>
		<path fill="#465291" d="M124.841,142.828h8.505l-1.23-1.604c-0.002-0.021-0.013-0.042-0.029-0.057h-8.219L124.841,142.828z"/>
		<path fill="#465291" d="M136.525,147.094l-1.146-1.574h-9.021l0.859,1.574H136.525L136.525,147.094z"/>
		<path fill="#465291" d="M146.463,147.094l-1.461-1.574h-8.964l1.146,1.574H146.463z"/>
		<path fill="#465291" d="M156.428,147.094l-1.775-1.574h-8.85l1.461,1.574H156.428L156.428,147.094z"/>
		<path fill="#465291" d="M134.033,142.828h8.448l-1.489-1.574c-0.02-0.012-0.031-0.035-0.028-0.058h-8.161L134.033,142.828z"/>
		<path fill="#465291" d="M58.947,144.947h8.906l0.888-1.574h-8.62L58.947,144.947z"/>
		<path fill="#465291" d="M78.077,143.373H69.4l-0.888,1.574h8.964L78.077,143.373z"/>
		<path fill="#465291" d="M115.62,142.828h8.563l-0.945-1.632v-0.028h-8.247L115.62,142.828z"/>
		<path fill="#465291" d="M97.235,142.828h8.621l-0.315-1.689h-8.276L97.235,142.828z"/>
		<path fill="#465291" d="M97.178,147.094h9.479l-0.286-1.574h-9.135L97.178,147.094z"/>
		<path fill="#465291" d="M49.411,144.947h8.82l1.203-1.574H50.9L49.411,144.947z"/>
		<path fill="#465291" d="M97.235,143.373l-0.029,1.574h9.05l-0.287-1.574H97.235z"/>
		<path fill="#465291" d="M126.559,147.094l-0.858-1.574h-9.078l0.544,1.574H126.559z"/>
		<path fill="#465291" d="M116.594,147.094l-0.573-1.574h-9.077l0.286,1.574H116.594z"/>
		<path fill="#465291" d="M106.428,142.828h8.563l-0.602-1.689h-8.276L106.428,142.828z"/>
		<path fill="#465291" d="M87.47,142.828l0.315-1.689h-8.277l-0.63,1.689H87.47L87.47,142.828z"/>
		<path fill="#465291" d="M125.155,143.373l0.859,1.574h8.935l-1.203-1.574H125.155z"/>
		<path fill="#465291" d="M154.051,144.947l-1.775-1.574h-8.477l1.461,1.574H154.051z"/>
		<path fill="#465291" d="M124.498,143.373h-8.705l0.572,1.574h8.992L124.498,143.373z"/>
		<path fill="#465291" d="M134.463,143.373l1.203,1.574h8.82l-1.461-1.574H134.463z"/>
		<path fill="#465291" d="M115.791,144.947l-0.543-1.574h-8.705l0.286,1.574h8.964H115.791z"/>
		<path fill="#465291" d="M54.967,149.215l1.203-1.547h-9.336l-1.546,1.604h9.651C54.938,149.243,54.938,149.215,54.967,149.215z"/>
		<path fill="#465291" d="M61.811,141.225l-1.231,1.604h8.505l0.974-1.689h-8.219C61.848,141.171,61.837,141.205,61.811,141.225z"/>
		<path fill="#465291" d="M44.571,149.186l1.489-1.546h-9.278l-1.833,1.604h9.593C44.514,149.215,44.543,149.215,44.571,149.186z"/>
		<path fill="#465291" d="M44.084,141.254l-1.804,1.574h8.391l1.575-1.689h-8.075C44.14,141.176,44.111,141.213,44.084,141.254z"/>
		<path fill="#465291" d="M52.934,141.225l-1.518,1.575h8.448l1.289-1.689h-8.19C52.991,141.196,52.991,141.225,52.934,141.225z"/>
		<path fill="#465291" d="M65.391,149.243l0.945-1.575h-9.393l-1.231,1.604L65.391,149.243z"/>
		<path fill="#465291" d="M126.902,147.639H66.937l-0.945,1.604h61.77L126.902,147.639z"/>
		<path fill="#465291" d="M147.006,147.639h-9.363l1.146,1.574c0.002,0.022,0.013,0.043,0.028,0.058h9.651L147.006,147.639z"/>
		<path fill="#465291" d="M157.058,147.639h-9.278l1.461,1.546c0.02,0.012,0.031,0.034,0.028,0.058h9.593L157.058,147.639z"/>
		<path fill="#465291" d="M136.926,147.639h-9.45l0.888,1.574v0.029h9.736L136.926,147.639z"/>
		<path fill="#465291" d="M37.383,147.094h9.192l1.489-1.574h-8.849L37.383,147.094z"/>
		<path fill="#465291" d="M67.51,145.492h-8.992l-1.231,1.574h9.307L67.51,145.492z"/>
		<path fill="#465291" d="M77.218,145.492h-9.049l-0.888,1.574h9.335L77.218,145.492z"/>
		<path fill="#465291" d="M70.66,141.196l-0.945,1.632h8.563l0.63-1.689L70.66,141.196C70.688,141.139,70.688,141.196,70.66,141.196
			z"/>
		<path fill="#465291" d="M57.802,145.492h-8.964l-1.518,1.574h9.249L57.802,145.492z"/>
		<path fill="#465291" d="M39.846,144.947h8.763l1.518-1.574H41.65L39.846,144.947z"/>
		<path fill="#465291" d="M86.926,145.492h-9.078l-0.601,1.574h9.393L86.926,145.492z"/>
		<path fill="#465291" d="M96.662,143.373h-8.705l-0.315,1.574h9.021L96.662,143.373L96.662,143.373z"/>
		<path fill="#465291" d="M96.691,141.139h-8.305l-0.315,1.689h8.591L96.691,141.139z"/>
		<path fill="#465291" d="M96.605,145.492h-9.107l-0.286,1.574h9.393V145.492z"/>
		<path fill="#465291" d="M87.383,143.373h-8.705l-0.601,1.574h8.963L87.383,143.373z"/>
		<path fill="#263568" d="M122.063,159.582c-0.091,0.22-0.266,0.395-0.486,0.486c0.065-0.32-0.008-0.652-0.2-0.916l-4.983-6.644
			c-0.209-0.281-0.537-0.45-0.887-0.458H77.189c-0.352,0.002-0.682,0.172-0.888,0.458l0.573-0.773
			c0.206-0.286,0.536-0.456,0.888-0.458h38.259c0.353,0.002,0.683,0.172,0.888,0.458l4.982,6.644
			C122.183,158.709,122.25,159.182,122.063,159.582z"/>
		<path fill="#465291" d="M121.576,160.068c-0.156,0.09-0.334,0.139-0.516,0.143H72.779c-0.42,0.003-0.807-0.229-1.002-0.602
			c-0.183-0.346-0.161-0.764,0.057-1.088l4.468-5.956c0.209-0.281,0.537-0.45,0.888-0.458h38.231
			c0.352,0.002,0.682,0.172,0.887,0.458l4.983,6.673C121.517,159.45,121.623,159.761,121.576,160.068z"/>
		<path d="M98.466,72.009c0,0.854-0.692,1.546-1.546,1.546c-0.854,0-1.546-0.693-1.546-1.547s0.692-1.546,1.546-1.546
			c0.841-0.014,1.533,0.657,1.546,1.498C98.467,71.976,98.467,71.993,98.466,72.009z"/>
		<path d="M96.92,72.811c0.443,0,0.803-0.36,0.803-0.803s-0.36-0.803-0.803-0.803s-0.803,0.36-0.803,0.803
			c-0.011,0.432,0.33,0.792,0.762,0.803C96.892,72.811,96.906,72.811,96.92,72.811z"/>
		<path d="M100.471,72.009c0,0.174-0.141,0.315-0.315,0.315c-0.174,0-0.315-0.141-0.315-0.315c0.012-0.169,0.146-0.304,0.315-0.315
			c0.143-0.031,0.284,0.059,0.315,0.202C100.479,71.933,100.479,71.972,100.471,72.009z"/>
		<path fill="#E8CBAC" d="M129.021,75.016c0.072,0.064,0.148,0.121,0.229,0.172c0.229,0.125,0.44,0.279,0.63,0.458
			c0.821,0.602,1.605,1.252,2.349,1.947c0.487,0.458,0.974,1.002,1.518,1.575c0.556,0.656,1.073,1.344,1.546,2.062
			c0.555,0.83,1.061,1.69,1.519,2.577c0.493,0.99,0.915,2.014,1.26,3.064c0.39,1.153,0.706,2.33,0.945,3.523
			c0.465,2.636,0.58,5.323,0.343,7.989c-0.122,1.441-0.371,2.869-0.744,4.268c-0.727,2.924-1.844,5.736-3.322,8.361
			c-0.769,1.34-1.619,2.631-2.549,3.866c-0.915,1.255-1.92,2.44-3.006,3.551c-2.207,2.218-4.713,4.117-7.446,5.642
			c-2.61,1.452-5.391,2.577-8.276,3.35c-2.691,0.727-5.461,1.129-8.248,1.203c-2.527,0.084-5.052-0.246-7.474-0.975
			c-1.099-0.324-2.156-0.776-3.15-1.347c-0.906-0.532-1.727-1.198-2.435-1.976c-1.188-1.236-1.916-2.844-2.061-4.553
			c-0.063-0.6-0.054-1.206,0.029-1.804c0.029-0.258,0.058-0.487,0.086-0.716c0.024-0.196,0.072-0.389,0.144-0.572
			c0.052-0.266,0.129-0.523,0.229-0.773l0.086-0.258l0.258,0.057c-0.025,0.084-0.044,0.171-0.057,0.258
			c-0.029,0.172-0.086,0.43-0.144,0.773c-0.136,0.961-0.117,1.938,0.058,2.893c0.125,0.689,0.357,1.356,0.687,1.976
			c0.379,0.731,0.883,1.39,1.489,1.947c1.26,1.231,3.093,2.119,5.212,2.635c2.288,0.539,4.644,0.723,6.987,0.544
			c2.612-0.195,5.195-0.676,7.703-1.432c2.684-0.817,5.268-1.932,7.703-3.322c2.512-1.434,4.807-3.217,6.816-5.298
			c2.02-2.069,3.779-4.377,5.24-6.872c1.417-2.42,2.523-5.008,3.293-7.704c0.707-2.527,1.072-5.137,1.088-7.761
			c0.014-2.349-0.285-4.688-0.887-6.958c-0.519-1.908-1.269-3.745-2.234-5.47c-1.213-2.215-2.791-4.209-4.667-5.899
			c-0.257-0.229-0.458-0.401-0.573-0.516c-0.059-0.065-0.126-0.124-0.199-0.171L129.021,75.016z"/>
		<path fill="#F25C05" d="M112.643,49.93l15.836,0.573l1.403,2.635l-11.054,6.244"/>
		<path fill="#F25C05" d="M103.42,58.149l-1.26,15.808l2.49,1.689l7.475-10.223"/>
		<path fill="#E8CBAC" d="M95.087,32.719l-3.436,3.036l-3.437,3.036c0,0-0.544,5.212,7.302,14.146
			c7.847,8.906,17.897,15.521,17.897,15.521l3.953-3.465l3.951-3.465c0,0-5.298-10.796-13.145-19.731
			C100.328,32.833,95.087,32.719,95.087,32.719z"/>
		<path fill="#FFF8EE" d="M101.273,46.608c1.447-1.273,1.588-3.479,0.314-4.926c-1.273-1.447-3.479-1.588-4.926-0.315
			c-1.447,1.273-1.588,3.479-0.315,4.926c0,0,0,0,0,0C97.62,47.74,99.825,47.881,101.273,46.608L101.273,46.608z"/>
		<path fill="#F25C05" d="M101.76,47.181c1.756-1.55,1.923-4.229,0.373-5.985s-4.229-1.923-5.985-0.373s-1.923,4.229-0.373,5.985
			l0,0c1.541,1.755,4.211,1.929,5.966,0.389C101.747,47.191,101.754,47.186,101.76,47.181z M97.006,41.797
			c1.218-1.075,3.077-0.96,4.152,0.258c1.075,1.218,0.959,3.077-0.258,4.152c-1.218,1.075-3.077,0.96-4.152-0.258
			C95.688,44.727,95.802,42.879,97.006,41.797z"/>
		<path fill="#FFF8EE" d="M107.058,53.079c0.702-0.609,0.778-1.672,0.17-2.375c-0.608-0.703-1.673-0.779-2.376-0.17
			c-0.701,0.608-0.778,1.67-0.171,2.374c0.55,0.699,1.563,0.82,2.263,0.27C106.983,53.146,107.021,53.113,107.058,53.079z"/>
		<path fill="#F25C05" d="M107.315,53.366c0.853-0.745,0.94-2.041,0.196-2.894c-0.009-0.009-0.017-0.018-0.025-0.027
			c-0.76-0.823-2.044-0.873-2.867-0.111c-0.822,0.761-0.871,2.045-0.111,2.867C105.248,54,106.486,54.074,107.315,53.366z
			 M105.024,50.789c0.585-0.522,1.482-0.471,2.005,0.115c0.521,0.585,0.471,1.482-0.115,2.004c-0.585,0.521-1.482,0.47-2.004-0.115
			c-0.525-0.538-0.514-1.399,0.023-1.924C104.963,50.841,104.993,50.814,105.024,50.789L105.024,50.789z"/>
		<path fill="#FFF8EE" d="M112.154,58.836c0.703-0.609,0.779-1.673,0.17-2.375c-0.608-0.703-1.672-0.779-2.375-0.17
			c-0.701,0.608-0.779,1.67-0.172,2.374c0.587,0.702,1.632,0.796,2.334,0.209C112.126,58.861,112.141,58.849,112.154,58.836z"/>
		<path fill="#F25C05" d="M112.412,59.122c0.854-0.759,0.932-2.067,0.172-2.921c-0.759-0.854-2.066-0.931-2.921-0.171
			c-0.836,0.71-0.938,1.963-0.229,2.799c0.019,0.022,0.038,0.043,0.057,0.064c0.731,0.869,2.028,0.981,2.896,0.25
			C112.396,59.136,112.404,59.129,112.412,59.122z M110.093,56.488c0.585-0.522,1.482-0.471,2.005,0.114
			c0.521,0.585,0.471,1.483-0.115,2.005c-0.585,0.521-1.482,0.47-2.004-0.115c-0.522-0.579-0.477-1.471,0.102-1.993
			C110.084,56.495,110.089,56.491,110.093,56.488L110.093,56.488z"/>
		<path fill="#F7AC3B" d="M114.99,67.914l6.186-5.097c2.688,1.986,4.737,4.713,5.898,7.847c0,0-0.973-0.315-2.291-0.63
			c0,0,1.261,1.718,1.348,4.612C126.158,74.672,120.66,76.648,114.99,67.914z"/>
		<path fill="#F2D970" d="M115.592,67.427l4.896-4.038c2.149,1.335,3.777,3.366,4.611,5.756c-0.646-0.126-1.278-0.308-1.892-0.544
			c0.702,1.258,1.113,2.657,1.202,4.095C124.383,72.696,120.03,74.243,115.592,67.427z"/>
		<path fill="#BF4000" d="M122.207,61.07c0.207,0.253,0.195,0.621-0.029,0.859l-8.534,7.589c-0.245,0.229-0.63,0.217-0.858-0.029
			c-0.23-0.245-0.217-0.629,0.027-0.859l0,0l8.535-7.589c0.217-0.23,0.58-0.241,0.811-0.023
			C122.176,61.034,122.191,61.052,122.207,61.07z"/>
		<path fill="#F25C05" d="M87.881,39.361L84.76,27.477l11.397,4.611L87.881,39.361z"/>
		<path fill="#BF4000" d="M96.748,32.519c0.174,0.184,0.166,0.475-0.019,0.649c-0.003,0.003-0.007,0.006-0.01,0.009l-8.248,7.274
			c-0.166,0.167-0.435,0.168-0.602,0.003c-0.01-0.01-0.02-0.021-0.029-0.032c-0.174-0.184-0.166-0.475,0.019-0.649
			c0.003-0.003,0.006-0.006,0.01-0.009l8.248-7.274c0.164-0.167,0.432-0.169,0.599-0.005C96.728,32.495,96.738,32.506,96.748,32.519
			z"/>
		<path fill="#BFC3E2" d="M50.958,84.924h66.723c2.053-0.004,3.719,1.656,3.723,3.708c0,0.005,0,0.01,0,0.015l0,0
			c0.004,2.052-1.655,3.719-3.707,3.723c-0.006,0-0.01,0-0.016,0H50.958c-2.052,0.004-3.719-1.656-3.723-3.708
			c0-0.005,0-0.01,0-0.015l0,0c-0.004-2.052,1.656-3.718,3.708-3.723C50.949,84.924,50.954,84.924,50.958,84.924z"/>
		<path fill="#BFC3E2" d="M49.096,99.814h56.416c1.025-0.002,1.859,0.828,1.861,1.854c0,0.003,0,0.006,0,0.008l0,0
			c0.002,1.026-0.828,1.859-1.854,1.861c-0.003,0-0.005,0-0.007,0H49.096c-1.026,0.002-1.859-0.828-1.861-1.854
			c0-0.003,0-0.006,0-0.008l0,0c-0.002-1.025,0.828-1.859,1.854-1.861C49.091,99.814,49.093,99.814,49.096,99.814z"/>
		<path fill="#BFC3E2" d="M49.096,108.979h43.815c1.026-0.002,1.859,0.828,1.861,1.854c0,0.002,0,0.004,0,0.007l0,0
			c0.002,1.026-0.828,1.859-1.854,1.861c-0.002,0-0.005,0-0.007,0H49.096c-1.026,0.003-1.859-0.828-1.861-1.854
			c0-0.002,0-0.004,0-0.007l0,0c-0.002-1.026,0.828-1.859,1.854-1.861C49.091,108.979,49.093,108.979,49.096,108.979z"/>
		
			<image display="none" overflow="visible" width="119" height="119" xlink:href="A8A45B16.png"  transform="matrix(0.2591 0 0 0.2591 16.5806 106.0459)">
		</image>
		<g>
			
				<image overflow="visible" opacity="0.43" width="30" height="30" xlink:href="A8A45B1A.png"  transform="matrix(1 0 0 1 18.5 105.5)">
			</image>
			<g>
				<path fill="#FFFFFF" d="M22.893,108.12h18.328c1.264,0.004,2.287,1.027,2.291,2.291v18.327
					c-0.004,1.264-1.027,2.287-2.291,2.291H22.893c-1.264-0.004-2.287-1.027-2.291-2.291V110.41
					C20.606,109.146,21.629,108.124,22.893,108.12z"/>
			</g>
		</g>
		
			<image overflow="visible" enable-background="new    " width="151" height="181" xlink:href="A8A45B1D.png"  transform="matrix(0.2591 0 0 0.2591 141.1914 35.8394)">
		</image>
		<path fill="#FFFFFF" d="M174.898,76.906h-28.236c-0.852-0.029-1.518-0.743-1.489-1.595c0.001-0.003,0.001-0.006,0.001-0.009
			V39.735c-0.035-0.852,0.629-1.569,1.48-1.603c0.002,0,0.006,0,0.008,0h28.236c0.852,0.029,1.519,0.743,1.49,1.595
			c0,0.003-0.001,0.006-0.001,0.009v35.567c0.044,0.841-0.603,1.559-1.443,1.602C174.93,76.905,174.914,76.906,174.898,76.906z"/>
		<path d="M148.953,40.995c0-0.364,0.295-0.659,0.659-0.658c0.364,0,0.658,0.295,0.658,0.659s-0.295,0.658-0.659,0.658l0,0
			c-0.357,0.006-0.652-0.279-0.658-0.637C148.953,41.01,148.953,41.002,148.953,40.995z"/>
		<path d="M151.158,40.995c0-0.364,0.295-0.659,0.658-0.659c0.364,0,0.659,0.295,0.659,0.659s-0.295,0.659-0.659,0.659l0,0
			c-0.357,0.006-0.652-0.279-0.658-0.637C151.158,41.01,151.158,41.002,151.158,40.995z"/>
		<path d="M146.748,40.995c0-0.364,0.295-0.659,0.659-0.659c0.363,0,0.658,0.295,0.658,0.659s-0.295,0.659-0.658,0.659l0,0
			c-0.358,0.006-0.653-0.279-0.659-0.637C146.748,41.01,146.748,41.002,146.748,40.995z"/>
		<g>
			<path fill="#EE8266" d="M167.939,63.647v1.833c0.007,0.199-0.149,0.366-0.349,0.372c-0.008,0-0.016,0-0.023,0h-13.575
				c-0.199,0.006-0.365-0.15-0.372-0.349c0-0.008,0-0.016,0-0.023v-1.833c-0.003-1.366,0.792-2.608,2.033-3.179
				c-0.487-0.401-1.261-0.917-1.775-2.062c-0.752-1.58-0.622-3.438,0.344-4.896c0.534-0.784,0.815-1.714,0.803-2.663v-2.033
				c0.009-2.579,2.089-4.672,4.668-4.696h2.233c2.578,0.016,4.654,2.119,4.64,4.696c0,2.147-0.058,2.578,0.2,3.437
				c0.344,1.203,0.859,1.375,1.203,2.578c0.575,1.942-0.068,4.04-1.633,5.326l-0.43,0.344
				C167.15,61.049,167.949,62.286,167.939,63.647z"/>
			<path fill="#54578C" d="M167.939,63.647v1.833c0.007,0.199-0.149,0.366-0.349,0.372c-0.008,0-0.016,0-0.023,0h-13.575
				c-0.199,0.006-0.365-0.15-0.372-0.349c0-0.008,0-0.016,0-0.023v-1.833c-0.006-1.921,1.544-3.484,3.466-3.494
				c0.276,0.001,0.551-0.058,0.803-0.172l0.028,0.029l2.635,2.09c0.132,0.115,0.327,0.115,0.458,0l2.635-2.062l0.029-0.029
				c0.252,0.115,0.525,0.173,0.803,0.172c1.91-0.002,3.461,1.544,3.463,3.455C167.939,63.64,167.939,63.643,167.939,63.647z"/>
			<path fill="#EE9983" d="M165.02,50.96c0.193,0.016,0.343,0.178,0.343,0.373v2.233c-0.005,1.869-1.119,3.556-2.835,4.296
				c-2.348,0.97-5.039-0.147-6.009-2.495c-0.235-0.571-0.354-1.183-0.349-1.801v-2.233c-0.012-0.195,0.137-0.363,0.332-0.375
				c0.023-0.001,0.047,0,0.068,0.002c2.213,0.202,4.428-0.365,6.271-1.604c0.15-0.115,0.366-0.086,0.481,0.063
				c0.031,0.041,0.053,0.087,0.063,0.137C163.645,50.445,164.274,50.932,165.02,50.96z"/>
			<path fill="#272556" d="M166.308,60.153l-0.43,0.343c-0.45-0.206-0.938-0.313-1.432-0.315c-1.062-0.008-1.924-0.858-1.948-1.918
				v-0.344c1.725-0.746,2.839-2.446,2.836-4.324v-2.233c0.01-0.196-0.143-0.363-0.338-0.372c-0.002,0-0.004,0-0.006,0
				c-0.782-0.047-1.438-0.609-1.604-1.375c-0.029-0.181-0.199-0.305-0.381-0.276c-0.061,0.01-0.117,0.036-0.164,0.075
				c-1.832,1.265-4.057,1.833-6.271,1.604c-0.193-0.026-0.371,0.109-0.398,0.303c-0.002,0.023-0.004,0.046-0.002,0.069v2.232
				c0.006,1.869,1.119,3.556,2.835,4.296v0.343c0.007,1.054-0.842,1.913-1.896,1.919c-0.018,0-0.035,0-0.052,0
				c-0.495-0.001-0.983,0.106-1.433,0.315l-0.429-0.344c-1.995-1.611-2.441-4.473-1.03-6.615c0.533-0.784,0.814-1.714,0.803-2.663
				V48.84c-0.048-2.562,1.99-4.677,4.553-4.724c0.028,0,0.057-0.001,0.086-0.001h2.232c2.577,0.017,4.654,2.119,4.639,4.696v2.033
				c0.002,0.947,0.281,1.873,0.803,2.664C168.756,55.634,168.33,58.539,166.308,60.153z"/>
			<path fill="#E3735B" d="M162.613,58.664c-1.16,0.501-2.477,0.501-3.637,0c0.051-0.254,0.07-0.514,0.057-0.773v-0.029
				c1.131,0.458,2.395,0.458,3.523,0v0.029C162.516,58.149,162.535,58.414,162.613,58.664z"/>
			<path fill="#1A1A47" d="M164.016,44.604c0.237,0.126,0.328,0.421,0.201,0.659c-0.089,0.168-0.269,0.269-0.459,0.257
				c-0.151-0.024-0.305-0.034-0.459-0.029h-2.232c-2.578,0.017-4.654,2.119-4.64,4.697v0.573c0,0.343-0.229,0.343-0.229,0.601
				c0,2.463,0,2.32-0.028,2.435c-0.372,1.088-0.831,1.26-1.175,2.436c-0.197,0.629-0.257,1.293-0.171,1.947
				c0.022,0.271-0.18,0.509-0.45,0.531c-0.213,0.017-0.413-0.104-0.495-0.302c-0.752-1.58-0.622-3.438,0.344-4.896
				c0.534-0.784,0.815-1.714,0.803-2.663v-2.004c-0.028-2.582,2.041-4.699,4.623-4.728c0.005,0,0.011,0,0.016,0h2.233
				C162.631,44.118,163.355,44.284,164.016,44.604z"/>
			<path fill="#EE8266" d="M159.893,56.717c0.33,0.228,0.412,0.68,0.184,1.009c-0.18,0.261-0.51,0.375-0.813,0.279
				c-1.871-0.637-3.119-2.406-3.093-4.383v-2.233c-0.012-0.195,0.137-0.363,0.332-0.375c0.023-0.001,0.047,0,0.068,0.003
				c0.172,0.028,0.373,0.028,0.573,0.057c0.378,0.028,0.675,0.336,0.688,0.716v1.06C157.86,54.394,158.627,55.832,159.893,56.717z"
				/>
			<path fill="#42477A" d="M158.662,60.611c0.133,0.099,0.162,0.288,0.063,0.422c-0.055,0.075-0.143,0.12-0.234,0.122
				c-1.922,0.01-3.472,1.573-3.466,3.494v1.231h-1.03c-0.199,0.007-0.366-0.15-0.373-0.349c0-0.008,0-0.016,0-0.023v-1.861
				c-0.006-1.921,1.545-3.484,3.465-3.494c0.277,0.001,0.551-0.058,0.804-0.172l0.028,0.029L158.662,60.611z"/>
			<path fill="#42477A" d="M162.9,60.611c-0.135,0.099-0.163,0.288-0.064,0.422c0.056,0.075,0.143,0.12,0.235,0.122
				c1.921,0.01,3.472,1.573,3.466,3.494v1.231h1.03c0.199,0.007,0.366-0.15,0.372-0.349c0-0.008,0-0.016,0-0.023v-1.861
				c0.006-1.921-1.544-3.484-3.465-3.494c-0.277,0.001-0.551-0.058-0.803-0.172l-0.029,0.029L162.9,60.611z"/>
		</g>
		<path fill="#E8CBAC" d="M150.213,69.031h20.82c0.346,0.003,0.627,0.283,0.629,0.63l0,0c-0.002,0.347-0.283,0.627-0.629,0.63
			h-20.82c-0.346-0.003-0.627-0.283-0.629-0.63l0,0C149.586,69.314,149.867,69.034,150.213,69.031z"/>
		<path fill="#E8CBAC" d="M153.049,72.181h15.12c0.347,0.003,0.628,0.284,0.63,0.63l0,0c-0.002,0.347-0.283,0.627-0.63,0.63h-15.12
			c-0.347-0.003-0.627-0.283-0.631-0.63l0,0C152.422,72.464,152.702,72.184,153.049,72.181z"/>
		<path fill="#8763EE" d="M28.878,118.83c-0.008-0.266-0.221-0.479-0.487-0.486h-2.635c-0.266,0.008-0.479,0.221-0.487,0.486v7.102
			h3.637v-7.102H28.878z"/>
		<path fill="#8763EE" d="M38.787,115.853c0.004-0.276-0.211-0.505-0.487-0.516h-2.635c-0.275,0.011-0.492,0.239-0.487,0.516v10.08
			h3.637v-10.08H38.787L38.787,115.853z"/>
		<path fill="#8763EE" d="M33.833,119.805c-0.008-0.266-0.221-0.48-0.487-0.487h-2.635c-0.266,0.007-0.479,0.222-0.487,0.487v6.1
			h3.636v-6.1H33.833L33.833,119.805z"/>
		<path fill="#8763EE" d="M39.274,126.906h-14.52c-0.269-0.016-0.499,0.19-0.514,0.459c-0.015,0.27,0.19,0.5,0.459,0.515
			c0.019,0.001,0.037,0.001,0.055,0h14.52c0.269,0.015,0.5-0.19,0.515-0.46c0.015-0.268-0.19-0.498-0.459-0.514
			C39.312,126.905,39.293,126.905,39.274,126.906z"/>
		<path fill="#8763EE" d="M27.704,116.684L27.704,116.684c0.959-0.087,1.903-0.299,2.807-0.631c2.072-0.692,3.975-1.814,5.584-3.293
			l0.057-0.058v0.773c0.011,0.275,0.24,0.491,0.516,0.487c0.271,0.014,0.501-0.193,0.515-0.464c0-0.008,0-0.016,0-0.023v-1.947
			c-0.011-0.275-0.24-0.491-0.516-0.487h-2.033c-0.27-0.014-0.5,0.193-0.515,0.464c0,0.008,0,0.016,0,0.023
			c0.011,0.275,0.24,0.491,0.515,0.487h0.803c-1.487,1.375-3.256,2.41-5.183,3.035c-0.826,0.283-1.681,0.476-2.549,0.572
			c-0.315,0.058-0.516,0.229-0.458,0.545c-0.042,0.238,0.119,0.467,0.358,0.509C27.638,116.683,27.671,116.685,27.704,116.684z"/>
		<path fill="#BFC3E2" d="M48.667,117.914H82.63c0.803,0,1.432,0.83,1.432,1.861l0,0c0,1.031-0.659,1.861-1.432,1.861H48.667
			c-0.803,0-1.432-0.83-1.432-1.861l0,0C47.234,118.744,47.893,117.914,48.667,117.914z"/>
	</g>
</g>
<image overflow="visible" width="761" height="717" xlink:href="A8A45B1E.jpg"  transform="matrix(0.3877 0 0 0.3877 -320.3052 -45.5996)">
</image>
</svg>
