{
  "rules": {
    "dashboard": {
      "action": "allow",
      "source": "default",
      "weight": 10
    },
    "dashboard.management": {
      "action": "allow",
      "source": "default",
      "weight": 10
    },
    "dashboard.management.change_own_password": {
      "action": "allow",
      "source": "default",
      "weight": 10
    },
    "dashboard.management.usermanagement": {
      "action": "deny",
      "source": "default",
      "weight": 10
    },
    "dashboard.management.usermanagement.invite": {
      "action": "inherit",
      "source": "default",
      "weight": 10
    },
    "dashboard.management.usermanagement.create_login": {
      "action": "inherit",
      "source": "default",
      "weight": 10
    },
    "dashboard.management.usermanagement.show_logins": {
      "action": "inherit",
      "source": "default",
      "weight": 10
    },
    "dashboard.management.rolemanagement": {
      "action": "deny",
      "source": "default",
      "weight": 10
    },
    "dashboard.management.usermanagement.giveallrights": {
      "action": "deny",
      "source": "default",
      "weight": 10
    },
    "dashboard.management.rolemanagement.role.add": {
      "action": "inherit",
      "source": "default",
      "weight": 10
    },
    "dashboard.management.rolemanagement.role.update": {
      "action": "inherit",
      "source": "default",
      "weight": 10
    },
    "dashboard.management.rolemanagement.role.delete": {
      "action": "inherit",
      "source": "default",
      "weight": 10
    },
    "dashboard.management.rolemanagement.giveallrights": {
      "action": "deny",
      "source": "default",
      "weight": 10
    },
    "dashboard.management.usermanagement.giveownrights": {
      "action": "inherit",
      "source": "default",
      "weight": 10
    },
    "dashboard.management.rolemanagement.giveownrights": {
      "action": "inherit",
      "source": "default",
      "weight": 10
    },
    "easy2schedule": {
      "action": "deny",
      "source": "default",
      "weight": 10
    },
    "easy2schedule.ressources": {
      "action": "deny",
      "source": "default",
      "weight": 10
    },
    "easy2schedule.columns": {
      "action": "deny",
      "source": "default",
      "weight": 10
    },
    "easy2schedule.user": {
      "action": "inherit",
      "source": "default",
      "weight": 10
    },
    "easy2schedule.user.settings": {
      "action": "inherit",
      "source": "default",
      "weight": 10
    },
    "easy2schedule.user.settings.read": {
      "action": "inherit",
      "source": "default",
      "weight": 10
    },
    "easy2schedule.user.settings.update": {
      "action": "inherit",
      "source": "default",
      "weight": 10
    },
    "easy2schedule.export": {
      "action": "inherit",
      "source": "default",
      "weight": 10
    },
    "easy2schedule.views.timeline": {
      "action": "deny",
      "source": "default",
      "weight": 10
    },
    "easy2schedule.bookings": {
      "action": "deny",
      "source": "default",
      "weight": 10
    },
    "easy2schedule.events": {
      "action": "inherit",
      "source": "default",
      "weight": 10
    },
    "easy2schedule.events.read": {
      "action": "inherit",
      "source": "default",
      "weight": 10
    },
    "easy2schedule.events.read.own": {
      "action": "inherit",
      "source": "default",
      "weight": 10
    },
    "easy2schedule.events.add": {
      "action": "inherit",
      "source": "default",
      "weight": 10
    },
    "easy2schedule.events.add.own": {
      "action": "inherit",
      "source": "default",
      "weight": 10
    },
    "easy2schedule.events.update": {
      "action": "inherit",
      "source": "default",
      "weight": 10
    },
    "easy2schedule.events.update.own": {
      "action": "inherit",
      "source": "default",
      "weight": 10
    },
    "easy2schedule.events.delete": {
      "action": "inherit",
      "source": "default",
      "weight": 10
    },
    "easy2schedule.events.delete.own": {
      "action": "inherit",
      "source": "default",
      "weight": 10
    },
    "easy2schedule.events.read.all": {
      "action": "inherit",
      "source": "default",
      "weight": 10
    },
    "easy2schedule.events.add.all": {
      "action": "inherit",
      "source": "default",
      "weight": 10
    },
    "easy2schedule.events.update.all": {
      "action": "inherit",
      "source": "default",
      "weight": 10
    },
    "easy2schedule.events.delete.all": {
      "action": "inherit",
      "source": "default",
      "weight": 10
    },
    "easy2track": {
      "action": "deny",
      "source": "default",
      "weight": 10
    },
    "easy2track.qrcode": {
      "action": "inherit",
      "source": "default",
      "weight": 10
    },
    "easy2track.form": {
      "action": "inherit",
      "source": "default",
      "weight": 10
    },
    "easy2track.scanner": {
      "action": "inherit",
      "source": "default",
      "weight": 10
    },
    "easy2track.statistics": {
      "action": "inherit",
      "source": "default",
      "weight": 10
    },
    "easy2order": {
      "action": "deny",
      "source": "default",
      "weight": 10
    },
    "easy2order.qrgenerator": {
      "action": "deny",
      "source": "default",
      "weight": 10
    },
    "easy2order.orderentry": {
      "action": "deny",
      "source": "default",
      "weight": 10
    },
    "simplycollect": {
      "action": "deny",
      "source": "default",
      "weight": 10
    },
    "simplycollect.merchant_view": {
      "action": "deny",
      "source": "default",
      "weight": 10
    },
    "simplycollect.customer_view": {
      "action": "deny",
      "source": "default",
      "weight": 10
    },
    "system": {
      "action": "allow",
      "source": "default",
      "weight": 10
    },
    "system.groups": {
      "action": "deny",
      "source": "default",
      "weight": 10
    },
    "system.groups.management": {
      "action": "inherit",
      "source": "default",
      "weight": 10
    },
    "system.groups.management.read": {
      "action": "inherit",
      "source": "default",
      "weight": 10
    },
    "system.groups.management.update": {
      "action": "inherit",
      "source": "default",
      "weight": 10
    },
    "system.groups.management.delete": {
      "action": "inherit",
      "source": "default",
      "weight": 10
    },
    "system.groups.use": {
      "action": "inherit",
      "source": "default",
      "weight": 10
    },
    "system.groups.use.all": {
        "action": "inherit",
        "source": "default",
        "weight": 10
    },
    "system.groups.use.own": {
        "action": "inherit",
        "source": "default",
        "weight": 10
    },
    "system.groups.use.users": {
      "action": "inherit",
      "source": "default",
      "weight": 10
    },
    "system.account": {
      "action": "deny",
      "source": "default",
      "weight": 10
    },
    "system.account.profile": {
      "action": "inherit",
      "source": "default",
      "weight": 10
    },
    "system.account.profile.management": {
      "action": "deny",
      "source": "default",
      "weight": 10
    },
    "system.user.own": {
      "action": "allow",
      "source": "default",
      "weight": 10
    },
    "system.user.own.profile": {
      "action": "inherit",
      "source": "default",
      "weight": 10
    },
    "system.user.own.profile.management": {
      "action": "inherit",
      "source": "default",
      "weight": 10
    },
    "contacts": {
      "action": "deny",
      "source": "default",
      "weight": 10
    },
    "contacts.management": {
      "action": "deny",
      "source": "default",
      "weight": 10
    },
    "frontend": {
      "action": "deny",
      "source": "default",
      "weight": 10
    },
    "frontend.contactmanager": {
      "action": "deny",
      "source": "default",
      "weight": 10
    },
    "frontend.contactmanager.views": {
      "action": "deny",
      "source": "default",
      "weight": 10
    },
    "frontend.contactmanager.views.settings": {
      "action": "deny",
      "source": "default",
      "weight": 10
    },
    "frontend.contactmanager.entries": {
      "action": "inherit",
      "source": "default",
      "weight": 10
    },
    "frontend.contactmanager.entries.read": {
      "action": "inherit",
      "source": "default",
      "weight": 10
    },
    "frontend.contactmanager.entries.add": {
      "action": "deny",
      "source": "default",
      "weight": 10
    },
    "frontend.contactmanager.entries.edit": {
      "action": "deny",
      "source": "default",
      "weight": 10
    },
    "frontend.contactmanager.entries.delete": {
      "action": "deny",
      "source": "default",
      "weight": 10
    },
    "frontend.contactmanager.settings": {
      "action": "deny",
      "source": "default",
      "weight": 10
    },
    "frontend.contactmanager.settings.list_order": {
      "action": "deny",
      "source": "default",
      "weight": 10
    },
    "frontend.contactmanager.settings.list_order.edit": {
      "action": "inherit",
      "source": "default",
      "weight": 10
    },
    "frontend.contactmanager.settings.entries": {
      "action": "deny",
      "source": "default",
      "weight": 10
    },
    "frontend.contactmanager.settings.entries.add": {
      "action": "inherit",
      "source": "default",
      "weight": 10
    },
    "frontend.contactmanager.settings.entries.edit": {
      "action": "inherit",
      "source": "default",
      "weight": 10
    },
    "frontend.contactmanager.settings.entries.delete": {
      "action": "inherit",
      "source": "default",
      "weight": 10
    },
    "taskmanager": {
      "action": "deny",
      "source": "default",
      "weight": 10
    },
    "taskmanager.management": {
      "action": "deny",
      "source": "default",
      "weight": 10
    },
    "frontend.taskmanager": {
      "action": "deny",
      "source": "default",
      "weight": 10
    },
    "frontend.taskmanager.views": {
      "action": "deny",
      "source": "default",
      "weight": 10
    },
    "frontend.taskmanager.views.settings": {
      "action": "deny",
      "source": "default",
      "weight": 10
    },
    "frontend.taskmanager.views.history": {
      "action": "deny",
      "source": "default",
      "weight": 10
    },
    "frontend.taskmanager.views.guestform": {
      "action": "allow",
      "source": "default",
      "weight": 10
    },
    "frontend.taskmanager.entries": {
      "action": "inherit",
      "source": "default",
      "weight": 10
    },
    "frontend.taskmanager.entries.read": {
      "action": "inherit",
      "source": "default",
      "weight": 10
    },
    "frontend.taskmanager.entries.add": {
      "action": "deny",
      "source": "default",
      "weight": 10
    },
    "frontend.taskmanager.entries.edit": {
      "action": "deny",
      "source": "default",
      "weight": 10
    },
    "frontend.taskmanager.settings": {
      "action": "deny",
      "source": "default",
      "weight": 10
    }
  }
}
