{
	"info": {
		"_postman_id": "81d0840b-c405-4b4f-a21a-270d4a196c60",
		"name": "catsSharing",
		"schema": "https://schema.getpostman.com/json/collection/v2.1.0/collection.json"
	},
	"item": [
		{
			"name": "1. Rejestracja",
			"request": {
				"method": "POST",
				"header": [],
				"body": {
					"mode": "raw",
					"raw": "{ \n    \"login\":\"{{login}}\",\n    \"haslo\":\"{{haslo}}\"\n}\n",
					"options": {
						"raw": {
							"language": "json"
						}
					}
				},
				"url": {
					"raw": "{{URL}}/registration",
					"host": [
						"{{URL}}"
					],
					"path": [
						"registration"
					]
				}
			},
			"response": []
		},
		{
			"name": "2. Dodawanie Kotka",
			"request": {
				"method": "POST",
				"header": [
					{
						"key": "Authorization",
						"value": "Basic {{login}}:{{haslo}}",
						"type": "default"
					}
				],
				"body": {
					"mode": "raw",
					"raw": "{\n    \"imieKotka\": \"Kotek\"\n}",
					"options": {
						"raw": {
							"language": "json"
						}
					}
				},
				"url": {
					"raw": "{{URL}}/dodawanieKotka",
					"host": [
						"{{URL}}"
					],
					"path": [
						"dodawanieKotka"
					]
				}
			},
			"response": []
		},
		{
			"name": "3. Aktualna Lista Kotków",
			"protocolProfileBehavior": {
				"disableBodyPruning": true
			},
			"request": {
				"method": "GET",
				"header": [
					{
						"key": "Authorization",
						"value": "Basic {{login}}:{{haslo}}",
						"type": "default"
					}
				],
				"body": {
					"mode": "raw",
					"raw": "\n",
					"options": {
						"raw": {
							"language": "json"
						}
					}
				},
				"url": {
					"raw": "{{URL}}/pozyskiwanieKotkowzListy",
					"host": [
						"{{URL}}"
					],
					"path": [
						"pozyskiwanieKotkowzListy"
					]
				}
			},
			"response": []
		},
		{
			"name": "4. Usuwanie Konta",
			"request": {
				"method": "DELETE",
				"header": [
					{
						"key": "Authorization",
						"value": "Basic {{login}}:{{haslo}}",
						"type": "default"
					}
				],
				"url": {
					"raw": "{{URL}}/usuwanieUzytkownikazJegoKotkami",
					"host": [
						"{{URL}}"
					],
					"path": [
						"usuwanieUzytkownikazJegoKotkami"
					]
				}
			},
			"response": []
		}
	]
}