Laravel development server started: http://127.0.0.1:8000
[Tue Jun 21 20:48:03 2022] Failed to listen on 127.0.0.1:8000 (reason: Address already in use)
Laravel development server started: http://127.0.0.1:8001
Laravel development server started: http://127.0.0.1:8002

   Illuminate\Database\QueryException  : SQLSTATE[HY000] [1045] Access denied for user 'root'@'apps-ess' (using password: YES) (SQL: select * from `permissions`)

  at /var/www/html/ess/vendor/laravel/framework/src/Illuminate/Database/Connection.php:669
    665|         // If an exception occurs when attempting to run a query, we'll format the error
    666|         // message to include the bindings with SQL, which will make this exception a
    667|         // lot more helpful to the developer instead of just the database's errors.
    668|         catch (Exception $e) {
  > 669|             throw new QueryException(
    670|                 $query, $this->prepareBindings($bindings), $e
    671|             );
    672|         }
    673|

  Exception trace:

  1   Illuminate\Foundation\Application::Illuminate\Foundation\{closure}(Object(App\Providers\AuthServiceProvider))
      [internal]:0

  2   PDOException::("SQLSTATE[HY000] [1045] Access denied for user 'root'@'apps-ess' (using password: YES)")
      /var/www/html/ess/vendor/laravel/framework/src/Illuminate/Database/Connectors/Connector.php:70

  Please use the argument -v to see more details.
Laravel development server started: http://127.0.0.1:8000
Laravel development server started: http://127.0.0.1:8000
[Mon Oct 10 21:44:09 2022] Failed to listen on 127.0.0.1:8000 (reason: Address already in use)
Laravel development server started: http://127.0.0.1:8001
Laravel development server started: http://127.0.0.1:8002
Laravel development server started: http://127.0.0.1:8001
Laravel development server started: http://127.0.0.1:8000
Laravel development server started: http://127.0.0.1:8000
[Wed Oct 12 00:09:49 2022] Failed to listen on 127.0.0.1:8000 (reason: Address already in use)
Laravel development server started: http://127.0.0.1:8001
[Wed Oct 12 00:09:49 2022] Failed to listen on 127.0.0.1:8001 (reason: Address already in use)
Laravel development server started: http://127.0.0.1:8002
[Wed Oct 12 00:09:49 2022] Failed to listen on 127.0.0.1:8002 (reason: Address already in use)
Laravel development server started: http://127.0.0.1:8003
Laravel development server started: http://127.0.0.1:8000
[Wed Oct 12 00:21:12 2022] Failed to listen on 127.0.0.1:8000 (reason: Address already in use)
Laravel development server started: http://127.0.0.1:8001
[Wed Oct 12 00:21:12 2022] Failed to listen on 127.0.0.1:8001 (reason: Address already in use)
Laravel development server started: http://127.0.0.1:8002
[Wed Oct 12 00:21:13 2022] Failed to listen on 127.0.0.1:8002 (reason: Address already in use)
Laravel development server started: http://127.0.0.1:8003
[Wed Oct 12 00:21:13 2022] Failed to listen on 127.0.0.1:8003 (reason: Address already in use)
Laravel development server started: http://127.0.0.1:8004
