[
    {
        "id": 1,
        "areaId": 5,
        "musicId": 1,
        "assetbundleName": "leoneed_untitled",
        "bgmName": "bgm_area_leoneed_untitled",
        "releaseConditionId": 999999
    },
    {
        "id": 2,
        "areaId": 7,
        "musicId": 2,
        "assetbundleName": "moremore_untitled",
        "bgmName": "bgm_area_moremore_untitled",
        "releaseConditionId": 999999
    },
    {
        "id": 3,
        "areaId": 8,
        "musicId": 3,
        "assetbundleName": "vividbad_untitled",
        "bgmName": "bgm_area_vividbad_untitled",
        "releaseConditionId": 999999
    },
    {
        "id": 4,
        "areaId": 9,
        "musicId": 8,
        "assetbundleName": "wonderlands_untitled",
        "bgmName": "bgm_area_wonderlands_untitled",
        "releaseConditionId": 999999
    },
    {
        "id": 5,
        "areaId": 10,
        "musicId": 10,
        "assetbundleName": "nightcode_untitled",
        "bgmName": "bgm_area_nightcode_untitled",
        "releaseConditionId": 999999
    }
]