[
    {
        "id": 1,
        "stampType": "illustration",
        "seq": 10,
        "name": "[스탬프] 미쿠: 잘 부탁해",
        "assetbundleName": "stamp0001",
        "balloonAssetbundleName": "balloon_stamp_01",
        "characterId1": 21
    },
    {
        "id": 2,
        "stampType": "illustration",
        "seq": 20,
        "name": "[스탬프] 린: 파이팅~!",
        "assetbundleName": "stamp0002",
        "balloonAssetbundleName": "balloon_stamp_01",
        "characterId1": 22
    },
    {
        "id": 3,
        "stampType": "illustration",
        "seq": 100,
        "name": "[스탬프] 츠카사: 당연히 풀 콤보라고!",
        "assetbundleName": "stamp0003",
        "balloonAssetbundleName": "balloon_stamp_01",
        "characterId1": 13
    },
    {
        "id": 4,
        "stampType": "illustration",
        "seq": 40,
        "name": "[스탬프] 루카: 기뻐",
        "assetbundleName": "stamp0004",
        "balloonAssetbundleName": "balloon_stamp_01",
        "characterId1": 24
    },
    {
        "id": 5,
        "stampType": "illustration",
        "seq": 60,
        "name": "[스탬프] KAITO: 으으…",
        "assetbundleName": "stamp0005",
        "balloonAssetbundleName": "balloon_stamp_01",
        "characterId1": 26
    },
    {
        "id": 6,
        "stampType": "illustration",
        "seq": 30,
        "name": "[스탬프] 렌: 어?!",
        "assetbundleName": "stamp0006",
        "balloonAssetbundleName": "balloon_stamp_01",
        "characterId1": 23
    },
    {
        "id": 7,
        "stampType": "illustration",
        "seq": 50,
        "name": "[스탬프] MEIKO: 대단해",
        "assetbundleName": "stamp0007",
        "balloonAssetbundleName": "balloon_stamp_01",
        "characterId1": 25
    },
    {
        "id": 8,
        "stampType": "illustration",
        "seq": 70,
        "name": "[스탬프] 이치카: 고마워",
        "assetbundleName": "stamp0008",
        "balloonAssetbundleName": "balloon_stamp_01",
        "characterId1": 1
    },
    {
        "id": 9,
        "stampType": "illustration",
        "seq": 90,
        "name": "[스탬프] 코하네: 미안…!",
        "assetbundleName": "stamp0009",
        "balloonAssetbundleName": "balloon_stamp_01",
        "characterId1": 9
    },
    {
        "id": 10,
        "stampType": "illustration",
        "seq": 110,
        "name": "[스탬프] 카나데: 그럼 이만…",
        "assetbundleName": "stamp0010",
        "balloonAssetbundleName": "balloon_stamp_01",
        "characterId1": 17
    },
    {
        "id": 11,
        "stampType": "illustration",
        "seq": 80,
        "name": "[스탬프] 미노리: 한 번 더!",
        "assetbundleName": "stamp0011",
        "balloonAssetbundleName": "balloon_stamp_01",
        "characterId1": 5
    },
    {
        "id": 12,
        "stampType": "illustration",
        "seq": 120,
        "name": "[스탬프] 이치카: 계속 같이 있자",
        "assetbundleName": "stamp0012",
        "balloonAssetbundleName": "balloon_stamp_01",
        "characterId1": 1
    },
    {
        "id": 13,
        "stampType": "illustration",
        "seq": 130,
        "name": "[스탬프] 사키: 청춘을 만끽하자!",
        "assetbundleName": "stamp0013",
        "balloonAssetbundleName": "balloon_stamp_01",
        "characterId1": 2
    },
    {
        "id": 14,
        "stampType": "illustration",
        "seq": 140,
        "name": "[스탬프] 호나미: 미안… 갈게",
        "assetbundleName": "stamp0014",
        "balloonAssetbundleName": "balloon_stamp_01",
        "characterId1": 3
    },
    {
        "id": 15,
        "stampType": "illustration",
        "seq": 150,
        "name": "[스탬프] 시호: 응, 많이 늘었네",
        "assetbundleName": "stamp0015",
        "balloonAssetbundleName": "balloon_stamp_01",
        "characterId1": 4
    },
    {
        "id": 16,
        "stampType": "illustration",
        "seq": 160,
        "name": "[스탬프] 미노리: 더 더 더~!",
        "assetbundleName": "stamp0016",
        "balloonAssetbundleName": "balloon_stamp_01",
        "characterId1": 5
    },
    {
        "id": 17,
        "stampType": "illustration",
        "seq": 170,
        "name": "[스탬프] 하루카: 모두에게 희망을!",
        "assetbundleName": "stamp0017",
        "balloonAssetbundleName": "balloon_stamp_01",
        "characterId1": 6
    },
    {
        "id": 18,
        "stampType": "illustration",
        "seq": 180,
        "name": "[스탬프] 아이리: 최선을 다해야지!",
        "assetbundleName": "stamp0018",
        "balloonAssetbundleName": "balloon_stamp_01",
        "characterId1": 7
    },
    {
        "id": 19,
        "stampType": "illustration",
        "seq": 190,
        "name": "[스탬프] 시즈쿠: 긴장 풀어",
        "assetbundleName": "stamp0019",
        "balloonAssetbundleName": "balloon_stamp_01",
        "characterId1": 8
    },
    {
        "id": 20,
        "stampType": "illustration",
        "seq": 200,
        "name": "[스탬프] 코하네: 노래할게!",
        "assetbundleName": "stamp0020",
        "balloonAssetbundleName": "balloon_stamp_01",
        "characterId1": 9
    },
    {
        "id": 21,
        "stampType": "illustration",
        "seq": 210,
        "name": "[스탬프] 안: 최고의 파트너야!",
        "assetbundleName": "stamp0021",
        "balloonAssetbundleName": "balloon_stamp_01",
        "characterId1": 10
    },
    {
        "id": 22,
        "stampType": "illustration",
        "seq": 220,
        "name": "[스탬프] 아키토: 필요 하다니까!",
        "assetbundleName": "stamp0022",
        "balloonAssetbundleName": "balloon_stamp_01",
        "characterId1": 11
    },
    {
        "id": 23,
        "stampType": "illustration",
        "seq": 230,
        "name": "[스탬프] 토우야: 노래하는 게 좋아",
        "assetbundleName": "stamp0023",
        "balloonAssetbundleName": "balloon_stamp_01",
        "characterId1": 12
    },
    {
        "id": 24,
        "stampType": "illustration",
        "seq": 240,
        "name": "[스탬프] 츠카사: 그 녀석들 덕분이야",
        "assetbundleName": "stamp0024",
        "balloonAssetbundleName": "balloon_stamp_01",
        "characterId1": 13
    },
    {
        "id": 25,
        "stampType": "illustration",
        "seq": 250,
        "name": "[스탬프] 에무: 약속 했잖아",
        "assetbundleName": "stamp0025",
        "balloonAssetbundleName": "balloon_stamp_01",
        "characterId1": 14
    },
    {
        "id": 26,
        "stampType": "illustration",
        "seq": 260,
        "name": "[스탬프] 네네: 무슨 불만 있어?",
        "assetbundleName": "stamp0026",
        "balloonAssetbundleName": "balloon_stamp_01",
        "characterId1": 15
    },
    {
        "id": 27,
        "stampType": "illustration",
        "seq": 270,
        "name": "[스탬프] 루이: 훌륭해",
        "assetbundleName": "stamp0027",
        "balloonAssetbundleName": "balloon_stamp_01",
        "characterId1": 16
    },
    {
        "id": 28,
        "stampType": "illustration",
        "seq": 280,
        "name": "[스탬프] 카나데: 내가 만들어야 해…",
        "assetbundleName": "stamp0028",
        "balloonAssetbundleName": "balloon_stamp_01",
        "characterId1": 17
    },
    {
        "id": 29,
        "stampType": "illustration",
        "seq": 290,
        "name": "[스탬프] 마후유: 착한 아이라…",
        "assetbundleName": "stamp0029",
        "balloonAssetbundleName": "balloon_stamp_01",
        "characterId1": 18
    },
    {
        "id": 30,
        "stampType": "illustration",
        "seq": 300,
        "name": "[스탬프] 에나: 좋아요 받았다♪",
        "assetbundleName": "stamp0030",
        "balloonAssetbundleName": "balloon_stamp_01",
        "characterId1": 19
    },
    {
        "id": 31,
        "stampType": "illustration",
        "seq": 310,
        "name": "[스탬프] 미즈키: 난 언제나 나야",
        "assetbundleName": "stamp0031",
        "balloonAssetbundleName": "balloon_stamp_01",
        "characterId1": 20
    },
    {
        "id": 32,
        "stampType": "illustration",
        "seq": 320,
        "name": "[스탬프] 미쿠: 뮤직 스타트!",
        "assetbundleName": "stamp0032",
        "balloonAssetbundleName": "balloon_stamp_01",
        "characterId1": 21
    },
    {
        "id": 33,
        "stampType": "illustration",
        "seq": 330,
        "name": "[스탬프] 린: 빨리 노래 하고 싶어~!",
        "assetbundleName": "stamp0038",
        "balloonAssetbundleName": "balloon_stamp_01",
        "characterId1": 22
    },
    {
        "id": 34,
        "stampType": "illustration",
        "seq": 340,
        "name": "[스탬프] 렌: 빨리 노래 하고 싶다",
        "assetbundleName": "stamp0040",
        "balloonAssetbundleName": "balloon_stamp_01",
        "characterId1": 23
    },
    {
        "id": 35,
        "stampType": "illustration",
        "seq": 350,
        "name": "[스탬프] 루카: 준비는 됐어?",
        "assetbundleName": "stamp0042",
        "balloonAssetbundleName": "balloon_stamp_01",
        "characterId1": 24
    },
    {
        "id": 36,
        "stampType": "illustration",
        "seq": 360,
        "name": "[스탬프] 메이코: 응원 고마워",
        "assetbundleName": "stamp0046",
        "balloonAssetbundleName": "balloon_stamp_01",
        "characterId1": 25
    },
    {
        "id": 37,
        "stampType": "illustration",
        "seq": 370,
        "name": "[스탬프] 카이토: 즐기고 있니?",
        "assetbundleName": "stamp0044",
        "balloonAssetbundleName": "balloon_stamp_01",
        "characterId1": 26
    },
    {
        "id": 38,
        "stampType": "illustration",
        "seq": 380,
        "name": "[스탬프] 이치카: 잘 부탁해",
        "assetbundleName": "stamp0048",
        "balloonAssetbundleName": "balloon_stamp_01",
        "characterId1": 1
    },
    {
        "id": 39,
        "stampType": "illustration",
        "seq": 390,
        "name": "[스탬프] 이치카: 같이 힘내자",
        "assetbundleName": "stamp0049",
        "balloonAssetbundleName": "balloon_stamp_01",
        "characterId1": 1
    },
    {
        "id": 40,
        "stampType": "illustration",
        "seq": 400,
        "name": "[스탬프] 이치카: 깜짝 놀랐네…",
        "assetbundleName": "stamp0050",
        "balloonAssetbundleName": "balloon_stamp_01",
        "characterId1": 1
    },
    {
        "id": 41,
        "stampType": "illustration",
        "seq": 410,
        "name": "[스탬프] 이치카: 후후",
        "assetbundleName": "stamp0051",
        "balloonAssetbundleName": "balloon_stamp_01",
        "characterId1": 1
    },
    {
        "id": 42,
        "stampType": "illustration",
        "seq": 420,
        "name": "[스탬프] 이치카: 하아…",
        "assetbundleName": "stamp0052",
        "balloonAssetbundleName": "balloon_stamp_01",
        "characterId1": 1
    },
    {
        "id": 43,
        "stampType": "illustration",
        "seq": 430,
        "name": "[스탬프] 이치카: 좋은 노래였어",
        "assetbundleName": "stamp0053",
        "balloonAssetbundleName": "balloon_stamp_01",
        "characterId1": 1
    },
    {
        "id": 44,
        "stampType": "illustration",
        "seq": 440,
        "name": "[스탬프] 이치카: 미안…",
        "assetbundleName": "stamp0054",
        "balloonAssetbundleName": "balloon_stamp_01",
        "characterId1": 1
    },
    {
        "id": 45,
        "stampType": "illustration",
        "seq": 450,
        "name": "[스탬프] 이치카: 다음에 또 봐",
        "assetbundleName": "stamp0055",
        "balloonAssetbundleName": "balloon_stamp_01",
        "characterId1": 1
    },
    {
        "id": 46,
        "stampType": "illustration",
        "seq": 460,
        "name": "[스탬프] 이치카: 다들 대단해",
        "assetbundleName": "stamp0056",
        "balloonAssetbundleName": "balloon_stamp_01",
        "characterId1": 1
    },
    {
        "id": 47,
        "stampType": "illustration",
        "seq": 470,
        "name": "[스탬프] 이치카: 같이해서 좋았어",
        "assetbundleName": "stamp0381",
        "balloonAssetbundleName": "balloon_stamp_01",
        "characterId1": 1
    },
    {
        "id": 48,
        "stampType": "illustration",
        "seq": 480,
        "name": "[스탬프] 이치카: 그럼 갈까",
        "assetbundleName": "stamp0382",
        "balloonAssetbundleName": "balloon_stamp_01",
        "characterId1": 1
    },
    {
        "id": 49,
        "stampType": "illustration",
        "seq": 490,
        "name": "[스탬프] 사키: 잘 부탁해~♪",
        "assetbundleName": "stamp0057",
        "balloonAssetbundleName": "balloon_stamp_01",
        "characterId1": 2
    },
    {
        "id": 50,
        "stampType": "illustration",
        "seq": 500,
        "name": "[스탬프] 사키: 좋은 라이브가 될 거야♪",
        "assetbundleName": "stamp0058",
        "balloonAssetbundleName": "balloon_stamp_01",
        "characterId1": 2
    },
    {
        "id": 51,
        "stampType": "illustration",
        "seq": 510,
        "name": "[스탬프] 사키: 깜짝이야!",
        "assetbundleName": "stamp0059",
        "balloonAssetbundleName": "balloon_stamp_01",
        "characterId1": 2
    },
    {
        "id": 52,
        "stampType": "illustration",
        "seq": 520,
        "name": "[스탬프] 사키: 야호!",
        "assetbundleName": "stamp0060",
        "balloonAssetbundleName": "balloon_stamp_01",
        "characterId1": 2
    },
    {
        "id": 53,
        "stampType": "illustration",
        "seq": 530,
        "name": "[스탬프] 사키: 으음…",
        "assetbundleName": "stamp0061",
        "balloonAssetbundleName": "balloon_stamp_01",
        "characterId1": 2
    },
    {
        "id": 54,
        "stampType": "illustration",
        "seq": 540,
        "name": "[스탬프] 사키: 굉장해~!",
        "assetbundleName": "stamp0062",
        "balloonAssetbundleName": "balloon_stamp_01",
        "characterId1": 2
    },
    {
        "id": 55,
        "stampType": "illustration",
        "seq": 550,
        "name": "[스탬프] 사키: 고마워♪",
        "assetbundleName": "stamp0063",
        "balloonAssetbundleName": "balloon_stamp_01",
        "characterId1": 2
    },
    {
        "id": 56,
        "stampType": "illustration",
        "seq": 560,
        "name": "[스탬프] 사키: 미안!",
        "assetbundleName": "stamp0064",
        "balloonAssetbundleName": "balloon_stamp_01",
        "characterId1": 2
    },
    {
        "id": 57,
        "stampType": "illustration",
        "seq": 570,
        "name": "[스탬프] 사키: 또 봐~",
        "assetbundleName": "stamp0383",
        "balloonAssetbundleName": "balloon_stamp_01",
        "characterId1": 2
    },
    {
        "id": 58,
        "stampType": "illustration",
        "seq": 580,
        "name": "[스탬프] 사키: 에헷☆",
        "assetbundleName": "stamp0384",
        "balloonAssetbundleName": "balloon_stamp_01",
        "characterId1": 2
    },
    {
        "id": 59,
        "stampType": "illustration",
        "seq": 590,
        "name": "[스탬프] 사키: 좋은 라이브였어!",
        "assetbundleName": "stamp0385",
        "balloonAssetbundleName": "balloon_stamp_01",
        "characterId1": 2
    },
    {
        "id": 60,
        "stampType": "illustration",
        "seq": 600,
        "name": "[스탬프] 호나미: 잘 부탁해",
        "assetbundleName": "stamp0065",
        "balloonAssetbundleName": "balloon_stamp_01",
        "characterId1": 3
    },
    {
        "id": 61,
        "stampType": "illustration",
        "seq": 610,
        "name": "[스탬프] 호나미: 파이팅♪",
        "assetbundleName": "stamp0066",
        "balloonAssetbundleName": "balloon_stamp_01",
        "characterId1": 3
    },
    {
        "id": 62,
        "stampType": "illustration",
        "seq": 620,
        "name": "[스탬프] 호나미: 우와!",
        "assetbundleName": "stamp0067",
        "balloonAssetbundleName": "balloon_stamp_01",
        "characterId1": 3
    },
    {
        "id": 63,
        "stampType": "illustration",
        "seq": 630,
        "name": "[스탬프] 호나미: 후후",
        "assetbundleName": "stamp0068",
        "balloonAssetbundleName": "balloon_stamp_01",
        "characterId1": 3
    },
    {
        "id": 64,
        "stampType": "illustration",
        "seq": 640,
        "name": "[스탬프] 호나미: 아…",
        "assetbundleName": "stamp0069",
        "balloonAssetbundleName": "balloon_stamp_01",
        "characterId1": 3
    },
    {
        "id": 65,
        "stampType": "illustration",
        "seq": 650,
        "name": "[스탬프] 호나미: 잘했어 잘했어",
        "assetbundleName": "stamp0070",
        "balloonAssetbundleName": "balloon_stamp_01",
        "characterId1": 3
    },
    {
        "id": 66,
        "stampType": "illustration",
        "seq": 660,
        "name": "[스탬프] 호나미: 고마워!",
        "assetbundleName": "stamp0071",
        "balloonAssetbundleName": "balloon_stamp_01",
        "characterId1": 3
    },
    {
        "id": 67,
        "stampType": "illustration",
        "seq": 670,
        "name": "[스탬프] 호나미: 미안해!",
        "assetbundleName": "stamp0072",
        "balloonAssetbundleName": "balloon_stamp_01",
        "characterId1": 3
    },
    {
        "id": 68,
        "stampType": "illustration",
        "seq": 680,
        "name": "[스탬프] 호나미: 또 보자",
        "assetbundleName": "stamp0073",
        "balloonAssetbundleName": "balloon_stamp_01",
        "characterId1": 3
    },
    {
        "id": 69,
        "stampType": "illustration",
        "seq": 690,
        "name": "[스탬프] 호나미: 수고했어",
        "assetbundleName": "stamp0074",
        "balloonAssetbundleName": "balloon_stamp_01",
        "characterId1": 3
    },
    {
        "id": 70,
        "stampType": "illustration",
        "seq": 700,
        "name": "[스탬프] 호나미: 준비됐어?",
        "assetbundleName": "stamp0075",
        "balloonAssetbundleName": "balloon_stamp_01",
        "characterId1": 3
    },
    {
        "id": 71,
        "stampType": "illustration",
        "seq": 710,
        "name": "[스탬프] 시호: 안녕",
        "assetbundleName": "stamp0076",
        "balloonAssetbundleName": "balloon_stamp_01",
        "characterId1": 4
    },
    {
        "id": 72,
        "stampType": "illustration",
        "seq": 720,
        "name": "[스탬프] 시호: 열심히 하자",
        "assetbundleName": "stamp0077",
        "balloonAssetbundleName": "balloon_stamp_01",
        "characterId1": 4
    },
    {
        "id": 73,
        "stampType": "illustration",
        "seq": 730,
        "name": "[스탬프] 시호: …윽!",
        "assetbundleName": "stamp0078",
        "balloonAssetbundleName": "balloon_stamp_01",
        "characterId1": 4
    },
    {
        "id": 74,
        "stampType": "illustration",
        "seq": 740,
        "name": "[스탬프] 시호: 괜찮네",
        "assetbundleName": "stamp0079",
        "balloonAssetbundleName": "balloon_stamp_01",
        "characterId1": 4
    },
    {
        "id": 75,
        "stampType": "illustration",
        "seq": 750,
        "name": "[스탬프] 시호: 하아…",
        "assetbundleName": "stamp0080",
        "balloonAssetbundleName": "balloon_stamp_01",
        "characterId1": 4
    },
    {
        "id": 76,
        "stampType": "illustration",
        "seq": 760,
        "name": "[스탬프] 시호: 좋은 소리였어",
        "assetbundleName": "stamp0081",
        "balloonAssetbundleName": "balloon_stamp_01",
        "characterId1": 4
    },
    {
        "id": 77,
        "stampType": "illustration",
        "seq": 770,
        "name": "[스탬프] 시호: 고마워",
        "assetbundleName": "stamp0082",
        "balloonAssetbundleName": "balloon_stamp_01",
        "characterId1": 4
    },
    {
        "id": 78,
        "stampType": "illustration",
        "seq": 780,
        "name": "[스탬프] 시호: 미안",
        "assetbundleName": "stamp0083",
        "balloonAssetbundleName": "balloon_stamp_01",
        "characterId1": 4
    },
    {
        "id": 79,
        "stampType": "illustration",
        "seq": 790,
        "name": "[스탬프] 시호: 그럼 이만",
        "assetbundleName": "stamp0084",
        "balloonAssetbundleName": "balloon_stamp_01",
        "characterId1": 4
    },
    {
        "id": 80,
        "stampType": "illustration",
        "seq": 800,
        "name": "[스탬프] 시호: 뭘 하고 싶은 건데",
        "assetbundleName": "stamp0085",
        "balloonAssetbundleName": "balloon_stamp_01",
        "characterId1": 4
    },
    {
        "id": 81,
        "stampType": "illustration",
        "seq": 810,
        "name": "[스탬프] 시호: 여유롭지",
        "assetbundleName": "stamp0086",
        "balloonAssetbundleName": "balloon_stamp_01",
        "characterId1": 4
    },
    {
        "id": 82,
        "stampType": "illustration",
        "seq": 820,
        "name": "[스탬프] 미노리: 잘 부탁해",
        "assetbundleName": "stamp0087",
        "balloonAssetbundleName": "balloon_stamp_01",
        "characterId1": 5
    },
    {
        "id": 83,
        "stampType": "illustration",
        "seq": 830,
        "name": "[스탬프] 미노리: 열심히 하자!",
        "assetbundleName": "stamp0088",
        "balloonAssetbundleName": "balloon_stamp_01",
        "characterId1": 5
    },
    {
        "id": 84,
        "stampType": "illustration",
        "seq": 840,
        "name": "[스탬프] 미노리: 앗!",
        "assetbundleName": "stamp0089",
        "balloonAssetbundleName": "balloon_stamp_01",
        "characterId1": 5
    },
    {
        "id": 85,
        "stampType": "illustration",
        "seq": 850,
        "name": "[스탬프] 미노리: 에헤헤",
        "assetbundleName": "stamp0090",
        "balloonAssetbundleName": "balloon_stamp_01",
        "characterId1": 5
    },
    {
        "id": 86,
        "stampType": "illustration",
        "seq": 860,
        "name": "[스탬프] 미노리: 히잉~",
        "assetbundleName": "stamp0091",
        "balloonAssetbundleName": "balloon_stamp_01",
        "characterId1": 5
    },
    {
        "id": 87,
        "stampType": "illustration",
        "seq": 870,
        "name": "[스탬프] 미노리: 대단해!",
        "assetbundleName": "stamp0092",
        "balloonAssetbundleName": "balloon_stamp_01",
        "characterId1": 5
    },
    {
        "id": 88,
        "stampType": "illustration",
        "seq": 880,
        "name": "[스탬프] 미노리: 고마워!",
        "assetbundleName": "stamp0093",
        "balloonAssetbundleName": "balloon_stamp_01",
        "characterId1": 5
    },
    {
        "id": 89,
        "stampType": "illustration",
        "seq": 890,
        "name": "[스탬프] 미노리: 미안해",
        "assetbundleName": "stamp0094",
        "balloonAssetbundleName": "balloon_stamp_01",
        "characterId1": 5
    },
    {
        "id": 90,
        "stampType": "illustration",
        "seq": 900,
        "name": "[스탬프] 미노리: 또 보자!",
        "assetbundleName": "stamp0095",
        "balloonAssetbundleName": "balloon_stamp_01",
        "characterId1": 5
    },
    {
        "id": 91,
        "stampType": "illustration",
        "seq": 910,
        "name": "[스탬프] 미노리: 더욱더 열심히 할 거야!",
        "assetbundleName": "stamp0096",
        "balloonAssetbundleName": "balloon_stamp_01",
        "characterId1": 5
    },
    {
        "id": 92,
        "stampType": "illustration",
        "seq": 920,
        "name": "[스탬프] 미노리: 전하고 싶어",
        "assetbundleName": "stamp0097",
        "balloonAssetbundleName": "balloon_stamp_01",
        "characterId1": 5
    },
    {
        "id": 93,
        "stampType": "illustration",
        "seq": 930,
        "name": "[스탬프] 하루카: 잘 부탁해",
        "assetbundleName": "stamp0098",
        "balloonAssetbundleName": "balloon_stamp_01",
        "characterId1": 6
    },
    {
        "id": 94,
        "stampType": "illustration",
        "seq": 940,
        "name": "[스탬프] 하루카: 열심히 하자",
        "assetbundleName": "stamp0099",
        "balloonAssetbundleName": "balloon_stamp_01",
        "characterId1": 6
    },
    {
        "id": 95,
        "stampType": "illustration",
        "seq": 950,
        "name": "[스탬프] 하루카: 놀랐어",
        "assetbundleName": "stamp0100",
        "balloonAssetbundleName": "balloon_stamp_01",
        "characterId1": 6
    },
    {
        "id": 96,
        "stampType": "illustration",
        "seq": 960,
        "name": "[스탬프] 하루카: 후후",
        "assetbundleName": "stamp0101",
        "balloonAssetbundleName": "balloon_stamp_01",
        "characterId1": 6
    },
    {
        "id": 97,
        "stampType": "illustration",
        "seq": 970,
        "name": "[스탬프] 하루카: 그래……",
        "assetbundleName": "stamp0102",
        "balloonAssetbundleName": "balloon_stamp_01",
        "characterId1": 6
    },
    {
        "id": 98,
        "stampType": "illustration",
        "seq": 980,
        "name": "[스탬프] 하루카: 잘했어",
        "assetbundleName": "stamp0103",
        "balloonAssetbundleName": "balloon_stamp_01",
        "characterId1": 6
    },
    {
        "id": 99,
        "stampType": "illustration",
        "seq": 990,
        "name": "[스탬프] 하루카: 고마워",
        "assetbundleName": "stamp0104",
        "balloonAssetbundleName": "balloon_stamp_01",
        "characterId1": 6
    },
    {
        "id": 100,
        "stampType": "illustration",
        "seq": 1000,
        "name": "[스탬프] 하루카: 미안해…",
        "assetbundleName": "stamp0105",
        "balloonAssetbundleName": "balloon_stamp_01",
        "characterId1": 6
    },
    {
        "id": 101,
        "stampType": "illustration",
        "seq": 1010,
        "name": "[스탬프] 하루카: 그럼 안녕",
        "assetbundleName": "stamp0106",
        "balloonAssetbundleName": "balloon_stamp_01",
        "characterId1": 6
    },
    {
        "id": 102,
        "stampType": "illustration",
        "seq": 1020,
        "name": "[스탬프] 하루카: 귀여워…!",
        "assetbundleName": "stamp0386",
        "balloonAssetbundleName": "balloon_stamp_01",
        "characterId1": 6
    },
    {
        "id": 103,
        "stampType": "illustration",
        "seq": 1030,
        "name": "[스탬프] 하루카: 연습 해야지",
        "assetbundleName": "stamp0387",
        "balloonAssetbundleName": "balloon_stamp_01",
        "characterId1": 6
    },
    {
        "id": 104,
        "stampType": "illustration",
        "seq": 1040,
        "name": "[스탬프] 아이리: 잘 부탁해!",
        "assetbundleName": "stamp0107",
        "balloonAssetbundleName": "balloon_stamp_01",
        "characterId1": 7
    },
    {
        "id": 105,
        "stampType": "illustration",
        "seq": 1050,
        "name": "[스탬프] 아이리: 파이팅!",
        "assetbundleName": "stamp0108",
        "balloonAssetbundleName": "balloon_stamp_01",
        "characterId1": 7
    },
    {
        "id": 106,
        "stampType": "illustration",
        "seq": 1060,
        "name": "[스탬프] 아이리: 우와!",
        "assetbundleName": "stamp0109",
        "balloonAssetbundleName": "balloon_stamp_01",
        "characterId1": 7
    },
    {
        "id": 107,
        "stampType": "illustration",
        "seq": 1070,
        "name": "[스탬프] 아이리: 에헤헤",
        "assetbundleName": "stamp0110",
        "balloonAssetbundleName": "balloon_stamp_01",
        "characterId1": 7
    },
    {
        "id": 108,
        "stampType": "illustration",
        "seq": 1080,
        "name": "[스탬프] 아이리: 으으음…",
        "assetbundleName": "stamp0111",
        "balloonAssetbundleName": "balloon_stamp_01",
        "characterId1": 7
    },
    {
        "id": 109,
        "stampType": "illustration",
        "seq": 1090,
        "name": "[스탬프] 아이리: 꽤 하는데!",
        "assetbundleName": "stamp0112",
        "balloonAssetbundleName": "balloon_stamp_01",
        "characterId1": 7
    },
    {
        "id": 110,
        "stampType": "illustration",
        "seq": 1100,
        "name": "[스탬프] 아이리: 고마워",
        "assetbundleName": "stamp0113",
        "balloonAssetbundleName": "balloon_stamp_01",
        "characterId1": 7
    },
    {
        "id": 111,
        "stampType": "illustration",
        "seq": 1110,
        "name": "[스탬프] 아이리: 미안!",
        "assetbundleName": "stamp0114",
        "balloonAssetbundleName": "balloon_stamp_01",
        "characterId1": 7
    },
    {
        "id": 112,
        "stampType": "illustration",
        "seq": 1120,
        "name": "[스탬프] 아이리: 또 같이 노래하자",
        "assetbundleName": "stamp0115",
        "balloonAssetbundleName": "balloon_stamp_01",
        "characterId1": 7
    },
    {
        "id": 113,
        "stampType": "illustration",
        "seq": 1130,
        "name": "[스탬프] 아이리: 정상을 향해!",
        "assetbundleName": "stamp0388",
        "balloonAssetbundleName": "balloon_stamp_01",
        "characterId1": 7
    },
    {
        "id": 114,
        "stampType": "illustration",
        "seq": 1140,
        "name": "[스탬프] 아이리: 나한테 맡겨!",
        "assetbundleName": "stamp0389",
        "balloonAssetbundleName": "balloon_stamp_01",
        "characterId1": 7
    },
    {
        "id": 115,
        "stampType": "illustration",
        "seq": 1150,
        "name": "[스탬프] 시즈쿠: 잘 부탁해",
        "assetbundleName": "stamp0116",
        "balloonAssetbundleName": "balloon_stamp_01",
        "characterId1": 8
    },
    {
        "id": 116,
        "stampType": "illustration",
        "seq": 1160,
        "name": "[스탬프] 시즈쿠: 열심히 해보자",
        "assetbundleName": "stamp0117",
        "balloonAssetbundleName": "balloon_stamp_01",
        "characterId1": 8
    },
    {
        "id": 117,
        "stampType": "illustration",
        "seq": 1170,
        "name": "[스탬프] 시즈쿠: 어머…",
        "assetbundleName": "stamp0118",
        "balloonAssetbundleName": "balloon_stamp_01",
        "characterId1": 8
    },
    {
        "id": 118,
        "stampType": "illustration",
        "seq": 1180,
        "name": "[스탬프] 시즈쿠: 후훗",
        "assetbundleName": "stamp0119",
        "balloonAssetbundleName": "balloon_stamp_01",
        "characterId1": 8
    },
    {
        "id": 119,
        "stampType": "illustration",
        "seq": 1190,
        "name": "[스탬프] 시즈쿠: 이런…",
        "assetbundleName": "stamp0120",
        "balloonAssetbundleName": "balloon_stamp_01",
        "characterId1": 8
    },
    {
        "id": 120,
        "stampType": "illustration",
        "seq": 1200,
        "name": "[스탬프] 시즈쿠: 훌륭했어",
        "assetbundleName": "stamp0121",
        "balloonAssetbundleName": "balloon_stamp_01",
        "characterId1": 8
    },
    {
        "id": 121,
        "stampType": "illustration",
        "seq": 1210,
        "name": "[스탬프] 시즈쿠: 고마워",
        "assetbundleName": "stamp0122",
        "balloonAssetbundleName": "balloon_stamp_01",
        "characterId1": 8
    },
    {
        "id": 122,
        "stampType": "illustration",
        "seq": 1220,
        "name": "[스탬프] 시즈쿠: 미안해",
        "assetbundleName": "stamp0123",
        "balloonAssetbundleName": "balloon_stamp_01",
        "characterId1": 8
    },
    {
        "id": 123,
        "stampType": "illustration",
        "seq": 1230,
        "name": "[스탬프] 시즈쿠: 그럼 안녕",
        "assetbundleName": "stamp0124",
        "balloonAssetbundleName": "balloon_stamp_01",
        "characterId1": 8
    },
    {
        "id": 124,
        "stampType": "illustration",
        "seq": 1240,
        "name": "[스탬프] 시즈쿠: 노래 괜찮았으려나?",
        "assetbundleName": "stamp0390",
        "balloonAssetbundleName": "balloon_stamp_01",
        "characterId1": 8
    },
    {
        "id": 125,
        "stampType": "illustration",
        "seq": 1250,
        "name": "[스탬프] 시즈쿠: 네 덕분이야",
        "assetbundleName": "stamp0391",
        "balloonAssetbundleName": "balloon_stamp_01",
        "characterId1": 8
    },
    {
        "id": 126,
        "stampType": "illustration",
        "seq": 1260,
        "name": "[스탬프] 코하네: 아, 안녕하세요",
        "assetbundleName": "stamp0125",
        "balloonAssetbundleName": "balloon_stamp_01",
        "characterId1": 9
    },
    {
        "id": 127,
        "stampType": "illustration",
        "seq": 1270,
        "name": "[스탬프] 코하네: 파이팅!",
        "assetbundleName": "stamp0392",
        "balloonAssetbundleName": "balloon_stamp_01",
        "characterId1": 9
    },
    {
        "id": 128,
        "stampType": "illustration",
        "seq": 1280,
        "name": "[스탬프] 코하네: 꺅!",
        "assetbundleName": "stamp0393",
        "balloonAssetbundleName": "balloon_stamp_01",
        "characterId1": 9
    },
    {
        "id": 129,
        "stampType": "illustration",
        "seq": 1290,
        "name": "[스탬프] 코하네: 해냈어",
        "assetbundleName": "stamp0394",
        "balloonAssetbundleName": "balloon_stamp_01",
        "characterId1": 9
    },
    {
        "id": 130,
        "stampType": "illustration",
        "seq": 1300,
        "name": "[스탬프] 코하네: 으으…",
        "assetbundleName": "stamp0395",
        "balloonAssetbundleName": "balloon_stamp_01",
        "characterId1": 9
    },
    {
        "id": 131,
        "stampType": "illustration",
        "seq": 1310,
        "name": "[스탬프] 코하네: 대, 대단해!",
        "assetbundleName": "stamp0396",
        "balloonAssetbundleName": "balloon_stamp_01",
        "characterId1": 9
    },
    {
        "id": 132,
        "stampType": "illustration",
        "seq": 1320,
        "name": "[스탬프] 코하네: 고마워",
        "assetbundleName": "stamp0397",
        "balloonAssetbundleName": "balloon_stamp_01",
        "characterId1": 9
    },
    {
        "id": 133,
        "stampType": "illustration",
        "seq": 1330,
        "name": "[스탬프] 코하네: 노래하자",
        "assetbundleName": "stamp0398",
        "balloonAssetbundleName": "balloon_stamp_01",
        "characterId1": 9
    },
    {
        "id": 134,
        "stampType": "illustration",
        "seq": 1340,
        "name": "[스탬프] 코하네: 어, 어떡하지…",
        "assetbundleName": "stamp0399",
        "balloonAssetbundleName": "balloon_stamp_01",
        "characterId1": 9
    },
    {
        "id": 135,
        "stampType": "illustration",
        "seq": 1350,
        "name": "[스탬프] 코하네: 두근두근해…!",
        "assetbundleName": "stamp0400",
        "balloonAssetbundleName": "balloon_stamp_01",
        "characterId1": 9
    },
    {
        "id": 136,
        "stampType": "illustration",
        "seq": 1360,
        "name": "[스탬프] 코하네: 오들오들오들",
        "assetbundleName": "stamp0401",
        "balloonAssetbundleName": "balloon_stamp_01",
        "characterId1": 9
    },
    {
        "id": 137,
        "stampType": "illustration",
        "seq": 1370,
        "name": "[스탬프] 안: 야호~!",
        "assetbundleName": "stamp0126",
        "balloonAssetbundleName": "balloon_stamp_01",
        "characterId1": 10
    },
    {
        "id": 138,
        "stampType": "illustration",
        "seq": 1380,
        "name": "[스탬프] 안: 같이 힘내자!",
        "assetbundleName": "stamp0402",
        "balloonAssetbundleName": "balloon_stamp_01",
        "characterId1": 10
    },
    {
        "id": 139,
        "stampType": "illustration",
        "seq": 1390,
        "name": "[스탬프] 안: 으앗?!",
        "assetbundleName": "stamp0403",
        "balloonAssetbundleName": "balloon_stamp_01",
        "characterId1": 10
    },
    {
        "id": 140,
        "stampType": "illustration",
        "seq": 1400,
        "name": "[스탬프] 안: 괜찮은데!",
        "assetbundleName": "stamp0404",
        "balloonAssetbundleName": "balloon_stamp_01",
        "characterId1": 10
    },
    {
        "id": 141,
        "stampType": "illustration",
        "seq": 1410,
        "name": "[스탬프] 안: 이런…!",
        "assetbundleName": "stamp0405",
        "balloonAssetbundleName": "balloon_stamp_01",
        "characterId1": 10
    },
    {
        "id": 142,
        "stampType": "illustration",
        "seq": 1420,
        "name": "[스탬프] 안: 좋은데!",
        "assetbundleName": "stamp0406",
        "balloonAssetbundleName": "balloon_stamp_01",
        "characterId1": 10
    },
    {
        "id": 143,
        "stampType": "illustration",
        "seq": 1430,
        "name": "[스탬프] 안: 고마워!",
        "assetbundleName": "stamp0407",
        "balloonAssetbundleName": "balloon_stamp_01",
        "characterId1": 10
    },
    {
        "id": 144,
        "stampType": "illustration",
        "seq": 1440,
        "name": "[스탬프] 안: 미안!",
        "assetbundleName": "stamp0408",
        "balloonAssetbundleName": "balloon_stamp_01",
        "characterId1": 10
    },
    {
        "id": 145,
        "stampType": "illustration",
        "seq": 1450,
        "name": "[스탬프] 안: 그럼 안녕!",
        "assetbundleName": "stamp0409",
        "balloonAssetbundleName": "balloon_stamp_01",
        "characterId1": 10
    },
    {
        "id": 146,
        "stampType": "illustration",
        "seq": 1460,
        "name": "[스탬프] 안: 나만 믿으시라♪",
        "assetbundleName": "stamp0410",
        "balloonAssetbundleName": "balloon_stamp_01",
        "characterId1": 10
    },
    {
        "id": 147,
        "stampType": "illustration",
        "seq": 1470,
        "name": "[스탬프] 안: 흠~",
        "assetbundleName": "stamp0411",
        "balloonAssetbundleName": "balloon_stamp_01",
        "characterId1": 10
    },
    {
        "id": 148,
        "stampType": "illustration",
        "seq": 1480,
        "name": "[스탬프] 아키토: 여어",
        "assetbundleName": "stamp0127",
        "balloonAssetbundleName": "balloon_stamp_01",
        "characterId1": 11
    },
    {
        "id": 149,
        "stampType": "illustration",
        "seq": 1490,
        "name": "[스탬프] 아키토: 가자!",
        "assetbundleName": "stamp0128",
        "balloonAssetbundleName": "balloon_stamp_01",
        "characterId1": 11
    },
    {
        "id": 150,
        "stampType": "illustration",
        "seq": 1500,
        "name": "[스탬프] 아키토: 엥?!",
        "assetbundleName": "stamp0129",
        "balloonAssetbundleName": "balloon_stamp_01",
        "characterId1": 11
    },
    {
        "id": 151,
        "stampType": "illustration",
        "seq": 1510,
        "name": "[스탬프] 아키토: 하하하",
        "assetbundleName": "stamp0130",
        "balloonAssetbundleName": "balloon_stamp_01",
        "characterId1": 11
    },
    {
        "id": 152,
        "stampType": "illustration",
        "seq": 1520,
        "name": "[스탬프] 아키토: 젠장…",
        "assetbundleName": "stamp0131",
        "balloonAssetbundleName": "balloon_stamp_01",
        "characterId1": 11
    },
    {
        "id": 153,
        "stampType": "illustration",
        "seq": 1530,
        "name": "[스탬프] 아키토: 조금 다시 봤는데",
        "assetbundleName": "stamp0132",
        "balloonAssetbundleName": "balloon_stamp_01",
        "characterId1": 11
    },
    {
        "id": 154,
        "stampType": "illustration",
        "seq": 1540,
        "name": "[스탬프] 아키토: 생큐",
        "assetbundleName": "stamp0133",
        "balloonAssetbundleName": "balloon_stamp_01",
        "characterId1": 11
    },
    {
        "id": 155,
        "stampType": "illustration",
        "seq": 1550,
        "name": "[스탬프] 아키토: 미안…",
        "assetbundleName": "stamp0134",
        "balloonAssetbundleName": "balloon_stamp_01",
        "characterId1": 11
    },
    {
        "id": 156,
        "stampType": "illustration",
        "seq": 1560,
        "name": "[스탬프] 아키토: 그럼 안녕",
        "assetbundleName": "stamp0135",
        "balloonAssetbundleName": "balloon_stamp_01",
        "characterId1": 11
    },
    {
        "id": 157,
        "stampType": "illustration",
        "seq": 1570,
        "name": "[스탬프] 아키토: 재밌겠는데",
        "assetbundleName": "stamp0136",
        "balloonAssetbundleName": "balloon_stamp_01",
        "characterId1": 11
    },
    {
        "id": 158,
        "stampType": "illustration",
        "seq": 1580,
        "name": "[스탬프] 아키토: 신나게 가보자고!",
        "assetbundleName": "stamp0137",
        "balloonAssetbundleName": "balloon_stamp_01",
        "characterId1": 11
    },
    {
        "id": 159,
        "stampType": "illustration",
        "seq": 1590,
        "name": "[스탬프] 토우야: 안녕",
        "assetbundleName": "stamp0138",
        "balloonAssetbundleName": "balloon_stamp_01",
        "characterId1": 12
    },
    {
        "id": 160,
        "stampType": "illustration",
        "seq": 1600,
        "name": "[스탬프] 토우야: 잘되면 좋겠다",
        "assetbundleName": "stamp0139",
        "balloonAssetbundleName": "balloon_stamp_01",
        "characterId1": 12
    },
    {
        "id": 161,
        "stampType": "illustration",
        "seq": 1610,
        "name": "[스탬프] 토우야: …윽!",
        "assetbundleName": "stamp0140",
        "balloonAssetbundleName": "balloon_stamp_01",
        "characterId1": 12
    },
    {
        "id": 162,
        "stampType": "illustration",
        "seq": 1620,
        "name": "[스탬프] 토우야: …다행이다",
        "assetbundleName": "stamp0141",
        "balloonAssetbundleName": "balloon_stamp_01",
        "characterId1": 12
    },
    {
        "id": 163,
        "stampType": "illustration",
        "seq": 1630,
        "name": "[스탬프] 토우야: …",
        "assetbundleName": "stamp0142",
        "balloonAssetbundleName": "balloon_stamp_01",
        "characterId1": 12
    },
    {
        "id": 164,
        "stampType": "illustration",
        "seq": 1640,
        "name": "[스탬프] 토우야: 좋은 것 같아",
        "assetbundleName": "stamp0143",
        "balloonAssetbundleName": "balloon_stamp_01",
        "characterId1": 12
    },
    {
        "id": 165,
        "stampType": "illustration",
        "seq": 1650,
        "name": "[스탬프] 토우야: 고마워",
        "assetbundleName": "stamp0144",
        "balloonAssetbundleName": "balloon_stamp_01",
        "characterId1": 12
    },
    {
        "id": 166,
        "stampType": "illustration",
        "seq": 1660,
        "name": "[스탬프] 토우야: 미안하다",
        "assetbundleName": "stamp0145",
        "balloonAssetbundleName": "balloon_stamp_01",
        "characterId1": 12
    },
    {
        "id": 167,
        "stampType": "illustration",
        "seq": 1670,
        "name": "[스탬프] 토우야: …그럼 안녕",
        "assetbundleName": "stamp0146",
        "balloonAssetbundleName": "balloon_stamp_01",
        "characterId1": 12
    },
    {
        "id": 168,
        "stampType": "illustration",
        "seq": 1680,
        "name": "[스탬프] 토우야: 너무하잖아",
        "assetbundleName": "stamp0147",
        "balloonAssetbundleName": "balloon_stamp_01",
        "characterId1": 12
    },
    {
        "id": 169,
        "stampType": "illustration",
        "seq": 1690,
        "name": "[스탬프] 토우야: 같이 노래할래?",
        "assetbundleName": "stamp0148",
        "balloonAssetbundleName": "balloon_stamp_01",
        "characterId1": 12
    },
    {
        "id": 170,
        "stampType": "illustration",
        "seq": 1700,
        "name": "[스탬프] 츠카사: 내가 왔다!",
        "assetbundleName": "stamp0149",
        "balloonAssetbundleName": "balloon_stamp_01",
        "characterId1": 13
    },
    {
        "id": 171,
        "stampType": "illustration",
        "seq": 1710,
        "name": "[스탬프] 츠카사: 더 잘할 수 있잖아!",
        "assetbundleName": "stamp0150",
        "balloonAssetbundleName": "balloon_stamp_01",
        "characterId1": 13
    },
    {
        "id": 172,
        "stampType": "illustration",
        "seq": 1720,
        "name": "[스탬프] 츠카사: 뭣이?!",
        "assetbundleName": "stamp0151",
        "balloonAssetbundleName": "balloon_stamp_01",
        "characterId1": 13
    },
    {
        "id": 173,
        "stampType": "illustration",
        "seq": 1730,
        "name": "[스탬프] 츠카사: 핫핫핫!",
        "assetbundleName": "stamp0152",
        "balloonAssetbundleName": "balloon_stamp_01",
        "characterId1": 13
    },
    {
        "id": 174,
        "stampType": "illustration",
        "seq": 1740,
        "name": "[스탬프] 츠카사: 윽…",
        "assetbundleName": "stamp0153",
        "balloonAssetbundleName": "balloon_stamp_01",
        "characterId1": 13
    },
    {
        "id": 175,
        "stampType": "illustration",
        "seq": 1750,
        "name": "[스탬프] 츠카사: 잘하고 있어!",
        "assetbundleName": "stamp0154",
        "balloonAssetbundleName": "balloon_stamp_01",
        "characterId1": 13
    },
    {
        "id": 176,
        "stampType": "illustration",
        "seq": 1760,
        "name": "[스탬프] 츠카사: 고맙군!",
        "assetbundleName": "stamp0155",
        "balloonAssetbundleName": "balloon_stamp_01",
        "characterId1": 13
    },
    {
        "id": 177,
        "stampType": "illustration",
        "seq": 1770,
        "name": "[스탬프] 츠카사: 미안……",
        "assetbundleName": "stamp0156",
        "balloonAssetbundleName": "balloon_stamp_01",
        "characterId1": 13
    },
    {
        "id": 178,
        "stampType": "illustration",
        "seq": 1780,
        "name": "[스탬프] 츠카사: 그럼 이만!",
        "assetbundleName": "stamp0157",
        "balloonAssetbundleName": "balloon_stamp_01",
        "characterId1": 13
    },
    {
        "id": 179,
        "stampType": "illustration",
        "seq": 1790,
        "name": "[스탬프] 츠카사: 쇼타임이다!",
        "assetbundleName": "stamp0412",
        "balloonAssetbundleName": "balloon_stamp_01",
        "characterId1": 13
    },
    {
        "id": 180,
        "stampType": "illustration",
        "seq": 1800,
        "name": "[스탬프] 츠카사: 잠까아안!!",
        "assetbundleName": "stamp0413",
        "balloonAssetbundleName": "balloon_stamp_01",
        "characterId1": 13
    },
    {
        "id": 181,
        "stampType": "illustration",
        "seq": 1810,
        "name": "[스탬프] 에무: 잘 부탁해☆",
        "assetbundleName": "stamp0158",
        "balloonAssetbundleName": "balloon_stamp_01",
        "characterId1": 14
    },
    {
        "id": 182,
        "stampType": "illustration",
        "seq": 1820,
        "name": "[스탬프] 에무: 파이팅~!",
        "assetbundleName": "stamp0159",
        "balloonAssetbundleName": "balloon_stamp_01",
        "characterId1": 14
    },
    {
        "id": 183,
        "stampType": "illustration",
        "seq": 1830,
        "name": "[스탬프] 에무: 에엑~?!",
        "assetbundleName": "stamp0160",
        "balloonAssetbundleName": "balloon_stamp_01",
        "characterId1": 14
    },
    {
        "id": 184,
        "stampType": "illustration",
        "seq": 1840,
        "name": "[스탬프] 에무: 우하하~!",
        "assetbundleName": "stamp0161",
        "balloonAssetbundleName": "balloon_stamp_01",
        "characterId1": 14
    },
    {
        "id": 185,
        "stampType": "illustration",
        "seq": 1850,
        "name": "[스탬프] 에무: 어쩌지~",
        "assetbundleName": "stamp0162",
        "balloonAssetbundleName": "balloon_stamp_01",
        "characterId1": 14
    },
    {
        "id": 186,
        "stampType": "illustration",
        "seq": 1860,
        "name": "[스탬프] 에무: 잘했어 잘했어!",
        "assetbundleName": "stamp0163",
        "balloonAssetbundleName": "balloon_stamp_01",
        "characterId1": 14
    },
    {
        "id": 187,
        "stampType": "illustration",
        "seq": 1870,
        "name": "[스탬프] 에무: 즐거웠어!",
        "assetbundleName": "stamp0164",
        "balloonAssetbundleName": "balloon_stamp_01",
        "characterId1": 14
    },
    {
        "id": 188,
        "stampType": "illustration",
        "seq": 1880,
        "name": "[스탬프] 에무: 미안해!",
        "assetbundleName": "stamp0165",
        "balloonAssetbundleName": "balloon_stamp_01",
        "characterId1": 14
    },
    {
        "id": 189,
        "stampType": "illustration",
        "seq": 1890,
        "name": "[스탬프] 에무: 또 보자☆",
        "assetbundleName": "stamp0166",
        "balloonAssetbundleName": "balloon_stamp_01",
        "characterId1": 14
    },
    {
        "id": 190,
        "stampType": "illustration",
        "seq": 1900,
        "name": "[스탬프] 에무: 우와~ 우와~!",
        "assetbundleName": "stamp0167",
        "balloonAssetbundleName": "balloon_stamp_01",
        "characterId1": 14
    },
    {
        "id": 191,
        "stampType": "illustration",
        "seq": 1910,
        "name": "[스탬프] 에무: 원더호~이!",
        "assetbundleName": "stamp0168",
        "balloonAssetbundleName": "balloon_stamp_01",
        "characterId1": 14
    },
    {
        "id": 192,
        "stampType": "illustration",
        "seq": 1920,
        "name": "[스탬프] 네네: …왜?",
        "assetbundleName": "stamp0169",
        "balloonAssetbundleName": "balloon_stamp_01",
        "characterId1": 15
    },
    {
        "id": 193,
        "stampType": "illustration",
        "seq": 1930,
        "name": "[스탬프] 네네: 할 수 있잖아",
        "assetbundleName": "stamp0170",
        "balloonAssetbundleName": "balloon_stamp_01",
        "characterId1": 15
    },
    {
        "id": 194,
        "stampType": "illustration",
        "seq": 1940,
        "name": "[스탬프] 네네: 어…",
        "assetbundleName": "stamp0171",
        "balloonAssetbundleName": "balloon_stamp_01",
        "characterId1": 15
    },
    {
        "id": 195,
        "stampType": "illustration",
        "seq": 1950,
        "name": "[스탬프] 네네: 후후",
        "assetbundleName": "stamp0172",
        "balloonAssetbundleName": "balloon_stamp_01",
        "characterId1": 15
    },
    {
        "id": 196,
        "stampType": "illustration",
        "seq": 1960,
        "name": "[스탬프] 네네: 음…",
        "assetbundleName": "stamp0173",
        "balloonAssetbundleName": "balloon_stamp_01",
        "characterId1": 15
    },
    {
        "id": 197,
        "stampType": "illustration",
        "seq": 1970,
        "name": "[스탬프] 네네: 좋은 노래였어",
        "assetbundleName": "stamp0174",
        "balloonAssetbundleName": "balloon_stamp_01",
        "characterId1": 15
    },
    {
        "id": 198,
        "stampType": "illustration",
        "seq": 1980,
        "name": "[스탬프] 네네: …고마워",
        "assetbundleName": "stamp0175",
        "balloonAssetbundleName": "balloon_stamp_01",
        "characterId1": 15
    },
    {
        "id": 199,
        "stampType": "illustration",
        "seq": 1990,
        "name": "[스탬프] 네네: 미안…",
        "assetbundleName": "stamp0176",
        "balloonAssetbundleName": "balloon_stamp_01",
        "characterId1": 15
    },
    {
        "id": 200,
        "stampType": "illustration",
        "seq": 2000,
        "name": "[스탬프] 네네: 그럼 안녕",
        "assetbundleName": "stamp0177",
        "balloonAssetbundleName": "balloon_stamp_01",
        "characterId1": 15
    },
    {
        "id": 201,
        "stampType": "illustration",
        "seq": 2010,
        "name": "[스탬프] 네네: …흐음~",
        "assetbundleName": "stamp0178",
        "balloonAssetbundleName": "balloon_stamp_01",
        "characterId1": 15
    },
    {
        "id": 202,
        "stampType": "illustration",
        "seq": 2020,
        "name": "[스탬프] 네네:",
        "assetbundleName": "stamp0179",
        "balloonAssetbundleName": "balloon_stamp_01",
        "characterId1": 15
    },
    {
        "id": 203,
        "stampType": "illustration",
        "seq": 2030,
        "name": "[스탬프] 루이: 잘 부탁해!",
        "assetbundleName": "stamp0180",
        "balloonAssetbundleName": "balloon_stamp_01",
        "characterId1": 16
    },
    {
        "id": 204,
        "stampType": "illustration",
        "seq": 2040,
        "name": "[스탬프] 루이: 어라?",
        "assetbundleName": "stamp0181",
        "balloonAssetbundleName": "balloon_stamp_01",
        "characterId1": 16
    },
    {
        "id": 205,
        "stampType": "illustration",
        "seq": 2050,
        "name": "[스탬프] 루이: 후후후",
        "assetbundleName": "stamp0182",
        "balloonAssetbundleName": "balloon_stamp_01",
        "characterId1": 16
    },
    {
        "id": 206,
        "stampType": "illustration",
        "seq": 2060,
        "name": "[스탬프] 루이: 흐음…",
        "assetbundleName": "stamp0183",
        "balloonAssetbundleName": "balloon_stamp_01",
        "characterId1": 16
    },
    {
        "id": 207,
        "stampType": "illustration",
        "seq": 2070,
        "name": "[스탬프] 루이: 멋지군!",
        "assetbundleName": "stamp0184",
        "balloonAssetbundleName": "balloon_stamp_01",
        "characterId1": 16
    },
    {
        "id": 208,
        "stampType": "illustration",
        "seq": 2080,
        "name": "[스탬프] 루이: 고마워",
        "assetbundleName": "stamp0185",
        "balloonAssetbundleName": "balloon_stamp_01",
        "characterId1": 16
    },
    {
        "id": 209,
        "stampType": "illustration",
        "seq": 2090,
        "name": "[스탬프] 루이: 미안해",
        "assetbundleName": "stamp0186",
        "balloonAssetbundleName": "balloon_stamp_01",
        "characterId1": 16
    },
    {
        "id": 210,
        "stampType": "illustration",
        "seq": 2100,
        "name": "[스탬프] 루이: 또 만나자!",
        "assetbundleName": "stamp0187",
        "balloonAssetbundleName": "balloon_stamp_01",
        "characterId1": 16
    },
    {
        "id": 211,
        "stampType": "illustration",
        "seq": 2110,
        "name": "[스탬프] 루이: 쇼타임이야",
        "assetbundleName": "stamp0188",
        "balloonAssetbundleName": "balloon_stamp_01",
        "characterId1": 16
    },
    {
        "id": 212,
        "stampType": "illustration",
        "seq": 2120,
        "name": "[스탬프] 루이: 그럼 안녕!",
        "assetbundleName": "stamp0189",
        "balloonAssetbundleName": "balloon_stamp_01",
        "characterId1": 16
    },
    {
        "id": 213,
        "stampType": "illustration",
        "seq": 2130,
        "name": "[스탬프] 루이: 같이 가자!",
        "assetbundleName": "stamp0414",
        "balloonAssetbundleName": "balloon_stamp_01",
        "characterId1": 16
    },
    {
        "id": 214,
        "stampType": "illustration",
        "seq": 2140,
        "name": "[스탬프] 카나데: …잘 부탁해",
        "assetbundleName": "stamp0190",
        "balloonAssetbundleName": "balloon_stamp_01",
        "characterId1": 17
    },
    {
        "id": 215,
        "stampType": "illustration",
        "seq": 2150,
        "name": "[스탬프] 카나데: 파이팅",
        "assetbundleName": "stamp0191",
        "balloonAssetbundleName": "balloon_stamp_01",
        "characterId1": 17
    },
    {
        "id": 216,
        "stampType": "illustration",
        "seq": 2160,
        "name": "[스탬프] 카나데: …어?",
        "assetbundleName": "stamp0192",
        "balloonAssetbundleName": "balloon_stamp_01",
        "characterId1": 17
    },
    {
        "id": 217,
        "stampType": "illustration",
        "seq": 2170,
        "name": "[스탬프] 카나데: …좋네",
        "assetbundleName": "stamp0193",
        "balloonAssetbundleName": "balloon_stamp_01",
        "characterId1": 17
    },
    {
        "id": 218,
        "stampType": "illustration",
        "seq": 2180,
        "name": "[스탬프] 카나데: …그래",
        "assetbundleName": "stamp0194",
        "balloonAssetbundleName": "balloon_stamp_01",
        "characterId1": 17
    },
    {
        "id": 219,
        "stampType": "illustration",
        "seq": 2190,
        "name": "[스탬프] 카나데: 좋은 소리였어",
        "assetbundleName": "stamp0195",
        "balloonAssetbundleName": "balloon_stamp_01",
        "characterId1": 17
    },
    {
        "id": 220,
        "stampType": "illustration",
        "seq": 2200,
        "name": "[스탬프] 카나데: 고마워",
        "assetbundleName": "stamp0196",
        "balloonAssetbundleName": "balloon_stamp_01",
        "characterId1": 17
    },
    {
        "id": 221,
        "stampType": "illustration",
        "seq": 2210,
        "name": "[스탬프] 카나데: …미안",
        "assetbundleName": "stamp0197",
        "balloonAssetbundleName": "balloon_stamp_01",
        "characterId1": 17
    },
    {
        "id": 222,
        "stampType": "illustration",
        "seq": 2220,
        "name": "[스탬프] 카나데: 곡을 만들어야 해…",
        "assetbundleName": "stamp0198",
        "balloonAssetbundleName": "balloon_stamp_01",
        "characterId1": 17
    },
    {
        "id": 223,
        "stampType": "illustration",
        "seq": 2230,
        "name": "[스탬프] 카나데: …",
        "assetbundleName": "stamp0199",
        "balloonAssetbundleName": "balloon_stamp_01",
        "characterId1": 17
    },
    {
        "id": 224,
        "stampType": "illustration",
        "seq": 2240,
        "name": "[스탬프] 카나데: 조금만 더…",
        "assetbundleName": "stamp0200",
        "balloonAssetbundleName": "balloon_stamp_01",
        "characterId1": 17
    },
    {
        "id": 225,
        "stampType": "illustration",
        "seq": 2250,
        "name": "[스탬프] 마후유(밝은 모습): 잘 부탁해",
        "assetbundleName": "stamp0201",
        "balloonAssetbundleName": "balloon_stamp_01",
        "characterId1": 18
    },
    {
        "id": 226,
        "stampType": "illustration",
        "seq": 2260,
        "name": "[스탬프] 마후유(밝은 모습): 같이 힘내자!",
        "assetbundleName": "stamp0202",
        "balloonAssetbundleName": "balloon_stamp_01",
        "characterId1": 18
    },
    {
        "id": 227,
        "stampType": "illustration",
        "seq": 2270,
        "name": "[스탬프] 마후유(밝은 모습): 꺅!",
        "assetbundleName": "stamp0203",
        "balloonAssetbundleName": "balloon_stamp_01",
        "characterId1": 18
    },
    {
        "id": 228,
        "stampType": "illustration",
        "seq": 2280,
        "name": "[스탬프] 마후유(밝은 모습): 기뻐",
        "assetbundleName": "stamp0204",
        "balloonAssetbundleName": "balloon_stamp_01",
        "characterId1": 18
    },
    {
        "id": 229,
        "stampType": "illustration",
        "seq": 2290,
        "name": "[스탬프] 마후유(밝은 모습): 아…",
        "assetbundleName": "stamp0205",
        "balloonAssetbundleName": "balloon_stamp_01",
        "characterId1": 18
    },
    {
        "id": 230,
        "stampType": "illustration",
        "seq": 2300,
        "name": "[스탬프] 마후유(밝은 모습): 잘됐다!",
        "assetbundleName": "stamp0206",
        "balloonAssetbundleName": "balloon_stamp_01",
        "characterId1": 18
    },
    {
        "id": 231,
        "stampType": "illustration",
        "seq": 2310,
        "name": "[스탬프] 마후유(밝은 모습): 고마워",
        "assetbundleName": "stamp0207",
        "balloonAssetbundleName": "balloon_stamp_01",
        "characterId1": 18
    },
    {
        "id": 232,
        "stampType": "illustration",
        "seq": 2320,
        "name": "[스탬프] 마후유(밝은 모습): 미안해",
        "assetbundleName": "stamp0208",
        "balloonAssetbundleName": "balloon_stamp_01",
        "characterId1": 18
    },
    {
        "id": 233,
        "stampType": "illustration",
        "seq": 2330,
        "name": "[스탬프] 마후유(밝은 모습): 또 보자!",
        "assetbundleName": "stamp0209",
        "balloonAssetbundleName": "balloon_stamp_01",
        "characterId1": 18
    },
    {
        "id": 234,
        "stampType": "illustration",
        "seq": 2340,
        "name": "[스탬프] 마후유(어두운 모습): …",
        "assetbundleName": "stamp0415",
        "balloonAssetbundleName": "balloon_stamp_01",
        "characterId1": 18
    },
    {
        "id": 235,
        "stampType": "illustration",
        "seq": 2350,
        "name": "[스탬프] 마후유(어두운 모습): 혼자 있고 싶어…",
        "assetbundleName": "stamp0416",
        "balloonAssetbundleName": "balloon_stamp_01",
        "characterId1": 18
    },
    {
        "id": 236,
        "stampType": "illustration",
        "seq": 2360,
        "name": "[스탬프] 에나: 잘 부탁해♪",
        "assetbundleName": "stamp0210",
        "balloonAssetbundleName": "balloon_stamp_01",
        "characterId1": 19
    },
    {
        "id": 237,
        "stampType": "illustration",
        "seq": 2370,
        "name": "[스탬프] 에나: 적당히 힘내볼까?",
        "assetbundleName": "stamp0211",
        "balloonAssetbundleName": "balloon_stamp_01",
        "characterId1": 19
    },
    {
        "id": 238,
        "stampType": "illustration",
        "seq": 2380,
        "name": "[스탬프] 에나: 꺅!",
        "assetbundleName": "stamp0212",
        "balloonAssetbundleName": "balloon_stamp_01",
        "characterId1": 19
    },
    {
        "id": 239,
        "stampType": "illustration",
        "seq": 2390,
        "name": "[스탬프] 에나: 에헤헤",
        "assetbundleName": "stamp0213",
        "balloonAssetbundleName": "balloon_stamp_01",
        "characterId1": 19
    },
    {
        "id": 240,
        "stampType": "illustration",
        "seq": 2400,
        "name": "[스탬프] 에나: 으음…",
        "assetbundleName": "stamp0214",
        "balloonAssetbundleName": "balloon_stamp_01",
        "characterId1": 19
    },
    {
        "id": 241,
        "stampType": "illustration",
        "seq": 2410,
        "name": "[스탬프] 에나: 잘됐다♪",
        "assetbundleName": "stamp0215",
        "balloonAssetbundleName": "balloon_stamp_01",
        "characterId1": 19
    },
    {
        "id": 242,
        "stampType": "illustration",
        "seq": 2420,
        "name": "[스탬프] 에나: 고마워!",
        "assetbundleName": "stamp0216",
        "balloonAssetbundleName": "balloon_stamp_01",
        "characterId1": 19
    },
    {
        "id": 243,
        "stampType": "illustration",
        "seq": 2430,
        "name": "[스탬프] 에나: …미안하다니까",
        "assetbundleName": "stamp0217",
        "balloonAssetbundleName": "balloon_stamp_01",
        "characterId1": 19
    },
    {
        "id": 244,
        "stampType": "illustration",
        "seq": 2440,
        "name": "[스탬프] 에나: 또 봐~",
        "assetbundleName": "stamp0218",
        "balloonAssetbundleName": "balloon_stamp_01",
        "characterId1": 19
    },
    {
        "id": 245,
        "stampType": "illustration",
        "seq": 2450,
        "name": "[스탬프] 에나: 졸려…",
        "assetbundleName": "stamp0219",
        "balloonAssetbundleName": "balloon_stamp_01",
        "characterId1": 19
    },
    {
        "id": 246,
        "stampType": "illustration",
        "seq": 2460,
        "name": "[스탬프] 에나:",
        "assetbundleName": "stamp0220",
        "balloonAssetbundleName": "balloon_stamp_01",
        "characterId1": 19
    },
    {
        "id": 247,
        "stampType": "illustration",
        "seq": 2470,
        "name": "[스탬프] 미즈키: 잘 부탁해~",
        "assetbundleName": "stamp0221",
        "balloonAssetbundleName": "balloon_stamp_01",
        "characterId1": 20
    },
    {
        "id": 248,
        "stampType": "illustration",
        "seq": 2480,
        "name": "[스탬프] 미즈키: 할 수 있지?",
        "assetbundleName": "stamp0222",
        "balloonAssetbundleName": "balloon_stamp_01",
        "characterId1": 20
    },
    {
        "id": 249,
        "stampType": "illustration",
        "seq": 2490,
        "name": "[스탬프] 미즈키: 헤에~~!",
        "assetbundleName": "stamp0223",
        "balloonAssetbundleName": "balloon_stamp_01",
        "characterId1": 20
    },
    {
        "id": 250,
        "stampType": "illustration",
        "seq": 2500,
        "name": "[스탬프] 미즈키: 후훗",
        "assetbundleName": "stamp0224",
        "balloonAssetbundleName": "balloon_stamp_01",
        "characterId1": 20
    },
    {
        "id": 251,
        "stampType": "illustration",
        "seq": 2510,
        "name": "[스탬프] 미즈키: 이런…",
        "assetbundleName": "stamp0225",
        "balloonAssetbundleName": "balloon_stamp_01",
        "characterId1": 20
    },
    {
        "id": 252,
        "stampType": "illustration",
        "seq": 2520,
        "name": "[스탬프] 미즈키: 좋은데!",
        "assetbundleName": "stamp0226",
        "balloonAssetbundleName": "balloon_stamp_01",
        "characterId1": 20
    },
    {
        "id": 253,
        "stampType": "illustration",
        "seq": 2530,
        "name": "[스탬프] 미즈키: 즐거웠어",
        "assetbundleName": "stamp0227",
        "balloonAssetbundleName": "balloon_stamp_01",
        "characterId1": 20
    },
    {
        "id": 254,
        "stampType": "illustration",
        "seq": 2540,
        "name": "[스탬프] 미즈키: 미안!",
        "assetbundleName": "stamp0228",
        "balloonAssetbundleName": "balloon_stamp_01",
        "characterId1": 20
    },
    {
        "id": 255,
        "stampType": "illustration",
        "seq": 2550,
        "name": "[스탬프] 미즈키: 그럼 안녕~♪",
        "assetbundleName": "stamp0229",
        "balloonAssetbundleName": "balloon_stamp_01",
        "characterId1": 20
    },
    {
        "id": 256,
        "stampType": "illustration",
        "seq": 2560,
        "name": "[스탬프] 미즈키: 귀엽지?",
        "assetbundleName": "stamp0230",
        "balloonAssetbundleName": "balloon_stamp_01",
        "characterId1": 20
    },
    {
        "id": 257,
        "stampType": "illustration",
        "seq": 2570,
        "name": "[스탬프] 미즈키: 뭐야~!",
        "assetbundleName": "stamp0231",
        "balloonAssetbundleName": "balloon_stamp_01",
        "characterId1": 20
    },
    {
        "id": 258,
        "stampType": "illustration",
        "seq": 2580,
        "name": "[스탬프] 미쿠: 열심히 하자!",
        "assetbundleName": "stamp0232",
        "balloonAssetbundleName": "balloon_stamp_01",
        "characterId1": 21
    },
    {
        "id": 259,
        "stampType": "illustration",
        "seq": 2590,
        "name": "[스탬프] 미쿠: 으앗!",
        "assetbundleName": "stamp0233",
        "balloonAssetbundleName": "balloon_stamp_01",
        "characterId1": 21
    },
    {
        "id": 260,
        "stampType": "illustration",
        "seq": 2600,
        "name": "[스탬프] 미쿠: 에헤헤",
        "assetbundleName": "stamp0234",
        "balloonAssetbundleName": "balloon_stamp_01",
        "characterId1": 21
    },
    {
        "id": 261,
        "stampType": "illustration",
        "seq": 2610,
        "name": "[스탬프] 미쿠: 으으…",
        "assetbundleName": "stamp0235",
        "balloonAssetbundleName": "balloon_stamp_01",
        "characterId1": 21
    },
    {
        "id": 262,
        "stampType": "illustration",
        "seq": 2620,
        "name": "[스탬프] 미쿠: 즐거운 라이브였어!",
        "assetbundleName": "stamp0236",
        "balloonAssetbundleName": "balloon_stamp_01",
        "characterId1": 21
    },
    {
        "id": 263,
        "stampType": "illustration",
        "seq": 2630,
        "name": "[스탬프] 미쿠: 고마워!",
        "assetbundleName": "stamp0237",
        "balloonAssetbundleName": "balloon_stamp_01",
        "characterId1": 21
    },
    {
        "id": 264,
        "stampType": "illustration",
        "seq": 2640,
        "name": "[스탬프] 미쿠: 미안해…",
        "assetbundleName": "stamp0238",
        "balloonAssetbundleName": "balloon_stamp_01",
        "characterId1": 21
    },
    {
        "id": 265,
        "stampType": "illustration",
        "seq": 2650,
        "name": "[스탬프] 미쿠: 또 봐~",
        "assetbundleName": "stamp0239",
        "balloonAssetbundleName": "balloon_stamp_01",
        "characterId1": 21
    },
    {
        "id": 266,
        "stampType": "illustration",
        "seq": 2660,
        "name": "[스탬프] 미쿠: 같이 노래하자!",
        "assetbundleName": "stamp0240",
        "balloonAssetbundleName": "balloon_stamp_01",
        "characterId1": 21
    },
    {
        "id": 267,
        "stampType": "illustration",
        "seq": 2670,
        "name": "[스탬프] 미쿠: 생큐♪",
        "assetbundleName": "stamp0241",
        "balloonAssetbundleName": "balloon_stamp_01",
        "characterId1": 21
    },
    {
        "id": 268,
        "stampType": "illustration",
        "seq": 2680,
        "name": "[스탬프] 미쿠: 좋은 스테이지였어!",
        "assetbundleName": "stamp0242",
        "balloonAssetbundleName": "balloon_stamp_01",
        "characterId1": 21
    },
    {
        "id": 269,
        "stampType": "illustration",
        "seq": 2690,
        "name": "[스탬프] 린: 에엑?!",
        "assetbundleName": "stamp0243",
        "balloonAssetbundleName": "balloon_stamp_01",
        "characterId1": 22
    },
    {
        "id": 270,
        "stampType": "illustration",
        "seq": 2700,
        "name": "[스탬프] 린: 예~이!!",
        "assetbundleName": "stamp0244",
        "balloonAssetbundleName": "balloon_stamp_01",
        "characterId1": 22
    },
    {
        "id": 271,
        "stampType": "illustration",
        "seq": 2710,
        "name": "[스탬프] 린: 훌쩍훌쩍…",
        "assetbundleName": "stamp0245",
        "balloonAssetbundleName": "balloon_stamp_01",
        "characterId1": 22
    },
    {
        "id": 272,
        "stampType": "illustration",
        "seq": 2720,
        "name": "[스탬프] 린: 잘됐다!",
        "assetbundleName": "stamp0246",
        "balloonAssetbundleName": "balloon_stamp_01",
        "characterId1": 22
    },
    {
        "id": 273,
        "stampType": "illustration",
        "seq": 2730,
        "name": "[스탬프] 린: 고마워!",
        "assetbundleName": "stamp0247",
        "balloonAssetbundleName": "balloon_stamp_01",
        "characterId1": 22
    },
    {
        "id": 274,
        "stampType": "illustration",
        "seq": 2740,
        "name": "[스탬프] 린: 미안해~!",
        "assetbundleName": "stamp0248",
        "balloonAssetbundleName": "balloon_stamp_01",
        "characterId1": 22
    },
    {
        "id": 275,
        "stampType": "illustration",
        "seq": 2750,
        "name": "[스탬프] 린: 또 보자~!",
        "assetbundleName": "stamp0249",
        "balloonAssetbundleName": "balloon_stamp_01",
        "characterId1": 22
    },
    {
        "id": 276,
        "stampType": "illustration",
        "seq": 2760,
        "name": "[스탬프] 린: 힘차게 가자~!",
        "assetbundleName": "stamp0250",
        "balloonAssetbundleName": "balloon_stamp_01",
        "characterId1": 22
    },
    {
        "id": 277,
        "stampType": "illustration",
        "seq": 2770,
        "name": "[스탬프] 린: 에헤헤",
        "assetbundleName": "stamp0251",
        "balloonAssetbundleName": "balloon_stamp_01",
        "characterId1": 22
    },
    {
        "id": 278,
        "stampType": "illustration",
        "seq": 2780,
        "name": "[스탬프] 린: 좋은데!",
        "assetbundleName": "stamp0252",
        "balloonAssetbundleName": "balloon_stamp_01",
        "characterId1": 22
    },
    {
        "id": 279,
        "stampType": "illustration",
        "seq": 2790,
        "name": "[스탬프] 린: 잘 부탁해!",
        "assetbundleName": "stamp0417",
        "balloonAssetbundleName": "balloon_stamp_01",
        "characterId1": 22
    },
    {
        "id": 280,
        "stampType": "illustration",
        "seq": 2800,
        "name": "[스탬프] 렌: 잘 부탁해!",
        "assetbundleName": "stamp0253",
        "balloonAssetbundleName": "balloon_stamp_01",
        "characterId1": 23
    },
    {
        "id": 281,
        "stampType": "illustration",
        "seq": 2810,
        "name": "[스탬프] 렌: 열심히 하자!",
        "assetbundleName": "stamp0254",
        "balloonAssetbundleName": "balloon_stamp_01",
        "characterId1": 23
    },
    {
        "id": 282,
        "stampType": "illustration",
        "seq": 2820,
        "name": "[스탬프] 렌: 으악!",
        "assetbundleName": "stamp0255",
        "balloonAssetbundleName": "balloon_stamp_01",
        "characterId1": 23
    },
    {
        "id": 283,
        "stampType": "illustration",
        "seq": 2830,
        "name": "[스탬프] 렌: 예~이!!",
        "assetbundleName": "stamp0256",
        "balloonAssetbundleName": "balloon_stamp_01",
        "characterId1": 23
    },
    {
        "id": 284,
        "stampType": "illustration",
        "seq": 2840,
        "name": "[스탬프] 렌: 에엑……",
        "assetbundleName": "stamp0257",
        "balloonAssetbundleName": "balloon_stamp_01",
        "characterId1": 23
    },
    {
        "id": 285,
        "stampType": "illustration",
        "seq": 2850,
        "name": "[스탬프] 렌: 생큐!",
        "assetbundleName": "stamp0258",
        "balloonAssetbundleName": "balloon_stamp_01",
        "characterId1": 23
    },
    {
        "id": 286,
        "stampType": "illustration",
        "seq": 2860,
        "name": "[스탬프] 렌: 미안!",
        "assetbundleName": "stamp0259",
        "balloonAssetbundleName": "balloon_stamp_01",
        "characterId1": 23
    },
    {
        "id": 287,
        "stampType": "illustration",
        "seq": 2870,
        "name": "[스탬프] 렌: 바이바이~!",
        "assetbundleName": "stamp0260",
        "balloonAssetbundleName": "balloon_stamp_01",
        "characterId1": 23
    },
    {
        "id": 288,
        "stampType": "illustration",
        "seq": 2880,
        "name": "[스탬프] 렌: 나만 믿어~!",
        "assetbundleName": "stamp0261",
        "balloonAssetbundleName": "balloon_stamp_01",
        "characterId1": 23
    },
    {
        "id": 289,
        "stampType": "illustration",
        "seq": 2890,
        "name": "[스탬프] 렌: 헤헷",
        "assetbundleName": "stamp0262",
        "balloonAssetbundleName": "balloon_stamp_01",
        "characterId1": 23
    },
    {
        "id": 290,
        "stampType": "illustration",
        "seq": 2900,
        "name": "[스탬프] 렌: 좋은데!",
        "assetbundleName": "stamp0263",
        "balloonAssetbundleName": "balloon_stamp_01",
        "characterId1": 23
    },
    {
        "id": 291,
        "stampType": "illustration",
        "seq": 2910,
        "name": "[스탬프] 루카: 잘 부탁해",
        "assetbundleName": "stamp0264",
        "balloonAssetbundleName": "balloon_stamp_01",
        "characterId1": 24
    },
    {
        "id": 292,
        "stampType": "illustration",
        "seq": 2920,
        "name": "[스탬프] 루카: 열심히 하자",
        "assetbundleName": "stamp0265",
        "balloonAssetbundleName": "balloon_stamp_01",
        "characterId1": 24
    },
    {
        "id": 293,
        "stampType": "illustration",
        "seq": 2930,
        "name": "[스탬프] 루카: 어머",
        "assetbundleName": "stamp0266",
        "balloonAssetbundleName": "balloon_stamp_01",
        "characterId1": 24
    },
    {
        "id": 294,
        "stampType": "illustration",
        "seq": 2940,
        "name": "[스탬프] 루카: 아…",
        "assetbundleName": "stamp0267",
        "balloonAssetbundleName": "balloon_stamp_01",
        "characterId1": 24
    },
    {
        "id": 295,
        "stampType": "illustration",
        "seq": 2950,
        "name": "[스탬프] 루카: 참 잘했어요",
        "assetbundleName": "stamp0268",
        "balloonAssetbundleName": "balloon_stamp_01",
        "characterId1": 24
    },
    {
        "id": 296,
        "stampType": "illustration",
        "seq": 2960,
        "name": "[스탬프] 루카: 고마워",
        "assetbundleName": "stamp0269",
        "balloonAssetbundleName": "balloon_stamp_01",
        "characterId1": 24
    },
    {
        "id": 297,
        "stampType": "illustration",
        "seq": 2970,
        "name": "[스탬프] 루카: 미안해",
        "assetbundleName": "stamp0270",
        "balloonAssetbundleName": "balloon_stamp_01",
        "characterId1": 24
    },
    {
        "id": 298,
        "stampType": "illustration",
        "seq": 2980,
        "name": "[스탬프] 루카: 또 만나면 좋겠네",
        "assetbundleName": "stamp0271",
        "balloonAssetbundleName": "balloon_stamp_01",
        "characterId1": 24
    },
    {
        "id": 299,
        "stampType": "illustration",
        "seq": 2990,
        "name": "[스탬프] 루카: 같이 노래하자",
        "assetbundleName": "stamp0272",
        "balloonAssetbundleName": "balloon_stamp_01",
        "characterId1": 24
    },
    {
        "id": 300,
        "stampType": "illustration",
        "seq": 3000,
        "name": "[스탬프] 루카: 후후",
        "assetbundleName": "stamp0273",
        "balloonAssetbundleName": "balloon_stamp_01",
        "characterId1": 24
    },
    {
        "id": 301,
        "stampType": "illustration",
        "seq": 3010,
        "name": "[스탬프] 루카: 어땠어?",
        "assetbundleName": "stamp0274",
        "balloonAssetbundleName": "balloon_stamp_01",
        "characterId1": 24
    },
    {
        "id": 302,
        "stampType": "illustration",
        "seq": 3020,
        "name": "[스탬프] MEIKO: 잘 부탁해♪",
        "assetbundleName": "stamp0286",
        "balloonAssetbundleName": "balloon_stamp_01",
        "characterId1": 25
    },
    {
        "id": 303,
        "stampType": "illustration",
        "seq": 3030,
        "name": "[스탬프] MEIKO: 파이팅!",
        "assetbundleName": "stamp0287",
        "balloonAssetbundleName": "balloon_stamp_01",
        "characterId1": 25
    },
    {
        "id": 304,
        "stampType": "illustration",
        "seq": 3040,
        "name": "[스탬프] MEIKO: 어?!",
        "assetbundleName": "stamp0288",
        "balloonAssetbundleName": "balloon_stamp_01",
        "characterId1": 25
    },
    {
        "id": 305,
        "stampType": "illustration",
        "seq": 3050,
        "name": "[스탬프] MEIKO: 후후",
        "assetbundleName": "stamp0289",
        "balloonAssetbundleName": "balloon_stamp_01",
        "characterId1": 25
    },
    {
        "id": 306,
        "stampType": "illustration",
        "seq": 3060,
        "name": "[스탬프] MEIKO: 하아…",
        "assetbundleName": "stamp0290",
        "balloonAssetbundleName": "balloon_stamp_01",
        "characterId1": 25
    },
    {
        "id": 307,
        "stampType": "illustration",
        "seq": 3070,
        "name": "[스탬프] MEIKO: 고마워!",
        "assetbundleName": "stamp0291",
        "balloonAssetbundleName": "balloon_stamp_01",
        "characterId1": 25
    },
    {
        "id": 308,
        "stampType": "illustration",
        "seq": 3080,
        "name": "[스탬프] MEIKO: 미안해",
        "assetbundleName": "stamp0292",
        "balloonAssetbundleName": "balloon_stamp_01",
        "characterId1": 25
    },
    {
        "id": 309,
        "stampType": "illustration",
        "seq": 3090,
        "name": "[스탬프] MEIKO: 그럼 안녕",
        "assetbundleName": "stamp0293",
        "balloonAssetbundleName": "balloon_stamp_01",
        "characterId1": 25
    },
    {
        "id": 310,
        "stampType": "illustration",
        "seq": 3100,
        "name": "[스탬프] MEIKO: 즐거운 시간이었어",
        "assetbundleName": "stamp0294",
        "balloonAssetbundleName": "balloon_stamp_01",
        "characterId1": 25
    },
    {
        "id": 311,
        "stampType": "illustration",
        "seq": 3110,
        "name": "[스탬프] MEIKO: 잠깐 쉬자",
        "assetbundleName": "stamp0295",
        "balloonAssetbundleName": "balloon_stamp_01",
        "characterId1": 25
    },
    {
        "id": 312,
        "stampType": "illustration",
        "seq": 3120,
        "name": "[스탬프] MEIKO: 시작하자",
        "assetbundleName": "stamp0296",
        "balloonAssetbundleName": "balloon_stamp_01",
        "characterId1": 25
    },
    {
        "id": 313,
        "stampType": "illustration",
        "seq": 3130,
        "name": "[스탬프] KAITO: 잘 부탁해",
        "assetbundleName": "stamp0275",
        "balloonAssetbundleName": "balloon_stamp_01",
        "characterId1": 26
    },
    {
        "id": 314,
        "stampType": "illustration",
        "seq": 3140,
        "name": "[스탬프] KAITO: 열심히 하자!",
        "assetbundleName": "stamp0276",
        "balloonAssetbundleName": "balloon_stamp_01",
        "characterId1": 26
    },
    {
        "id": 315,
        "stampType": "illustration",
        "seq": 3150,
        "name": "[스탬프] KAITO: 으악!",
        "assetbundleName": "stamp0277",
        "balloonAssetbundleName": "balloon_stamp_01",
        "characterId1": 26
    },
    {
        "id": 316,
        "stampType": "illustration",
        "seq": 3160,
        "name": "[스탬프] KAITO: 하핫",
        "assetbundleName": "stamp0278",
        "balloonAssetbundleName": "balloon_stamp_01",
        "characterId1": 26
    },
    {
        "id": 317,
        "stampType": "illustration",
        "seq": 3170,
        "name": "[스탬프] KAITO: 좋은데!",
        "assetbundleName": "stamp0279",
        "balloonAssetbundleName": "balloon_stamp_01",
        "characterId1": 26
    },
    {
        "id": 318,
        "stampType": "illustration",
        "seq": 3180,
        "name": "[스탬프] KAITO: 고마워",
        "assetbundleName": "stamp0280",
        "balloonAssetbundleName": "balloon_stamp_01",
        "characterId1": 26
    },
    {
        "id": 319,
        "stampType": "illustration",
        "seq": 3190,
        "name": "[스탬프] KAITO: 미안!",
        "assetbundleName": "stamp0281",
        "balloonAssetbundleName": "balloon_stamp_01",
        "characterId1": 26
    },
    {
        "id": 320,
        "stampType": "illustration",
        "seq": 3200,
        "name": "[스탬프] KAITO: 또 보자",
        "assetbundleName": "stamp0282",
        "balloonAssetbundleName": "balloon_stamp_01",
        "characterId1": 26
    },
    {
        "id": 321,
        "stampType": "illustration",
        "seq": 3210,
        "name": "[스탬프] KAITO: 이럴 수가…",
        "assetbundleName": "stamp0283",
        "balloonAssetbundleName": "balloon_stamp_01",
        "characterId1": 26
    },
    {
        "id": 322,
        "stampType": "illustration",
        "seq": 3220,
        "name": "[스탬프] KAITO: 즐거웠어",
        "assetbundleName": "stamp0284",
        "balloonAssetbundleName": "balloon_stamp_01",
        "characterId1": 26
    },
    {
        "id": 323,
        "stampType": "illustration",
        "seq": 3230,
        "name": "[스탬프] KAITO: 괜찮아",
        "assetbundleName": "stamp0285",
        "balloonAssetbundleName": "balloon_stamp_01",
        "characterId1": 26
    },
    {
        "id": 370,
        "stampType": "text",
        "seq": 3760,
        "name": "[텍스트 스탬프] 이치카!",
        "assetbundleName": "stamp0333",
        "balloonAssetbundleName": "balloon_stamp_03"
    },
    {
        "id": 371,
        "stampType": "text",
        "seq": 3770,
        "name": "[텍스트 스탬프] 사키!",
        "assetbundleName": "stamp0334",
        "balloonAssetbundleName": "balloon_stamp_03"
    },
    {
        "id": 372,
        "stampType": "text",
        "seq": 3780,
        "name": "[텍스트 스탬프] 호나미!",
        "assetbundleName": "stamp0335",
        "balloonAssetbundleName": "balloon_stamp_03"
    },
    {
        "id": 373,
        "stampType": "text",
        "seq": 3790,
        "name": "[텍스트 스탬프] 시호!",
        "assetbundleName": "stamp0336",
        "balloonAssetbundleName": "balloon_stamp_03"
    },
    {
        "id": 374,
        "stampType": "text",
        "seq": 3800,
        "name": "[텍스트 스탬프] 미노리!",
        "assetbundleName": "stamp0337",
        "balloonAssetbundleName": "balloon_stamp_03"
    },
    {
        "id": 375,
        "stampType": "text",
        "seq": 3810,
        "name": "[텍스트 스탬프] 하루카!",
        "assetbundleName": "stamp0338",
        "balloonAssetbundleName": "balloon_stamp_03"
    },
    {
        "id": 376,
        "stampType": "text",
        "seq": 3820,
        "name": "[텍스트 스탬프] 아이리!",
        "assetbundleName": "stamp0339",
        "balloonAssetbundleName": "balloon_stamp_03"
    },
    {
        "id": 377,
        "stampType": "text",
        "seq": 3830,
        "name": "[텍스트 스탬프] 시즈쿠!",
        "assetbundleName": "stamp0340",
        "balloonAssetbundleName": "balloon_stamp_03"
    },
    {
        "id": 378,
        "stampType": "text",
        "seq": 3840,
        "name": "[텍스트 스탬프] 코하네!",
        "assetbundleName": "stamp0341",
        "balloonAssetbundleName": "balloon_stamp_03"
    },
    {
        "id": 379,
        "stampType": "text",
        "seq": 3850,
        "name": "[텍스트 스탬프] 안!",
        "assetbundleName": "stamp0342",
        "balloonAssetbundleName": "balloon_stamp_03"
    },
    {
        "id": 380,
        "stampType": "text",
        "seq": 3860,
        "name": "[텍스트 스탬프] 아키토!",
        "assetbundleName": "stamp0343",
        "balloonAssetbundleName": "balloon_stamp_03"
    },
    {
        "id": 381,
        "stampType": "text",
        "seq": 3870,
        "name": "[텍스트 스탬프] 토우야!",
        "assetbundleName": "stamp0344",
        "balloonAssetbundleName": "balloon_stamp_03"
    },
    {
        "id": 382,
        "stampType": "text",
        "seq": 3880,
        "name": "[텍스트 스탬프] 츠카사!",
        "assetbundleName": "stamp0345",
        "balloonAssetbundleName": "balloon_stamp_03"
    },
    {
        "id": 383,
        "stampType": "text",
        "seq": 3890,
        "name": "[텍스트 스탬프] 에무!",
        "assetbundleName": "stamp0346",
        "balloonAssetbundleName": "balloon_stamp_03"
    },
    {
        "id": 384,
        "stampType": "text",
        "seq": 3900,
        "name": "[텍스트 스탬프] 네네!",
        "assetbundleName": "stamp0347",
        "balloonAssetbundleName": "balloon_stamp_03"
    },
    {
        "id": 385,
        "stampType": "text",
        "seq": 3910,
        "name": "[텍스트 스탬프] 루이!",
        "assetbundleName": "stamp0348",
        "balloonAssetbundleName": "balloon_stamp_03"
    },
    {
        "id": 386,
        "stampType": "text",
        "seq": 3920,
        "name": "[텍스트 스탬프] 카나데!",
        "assetbundleName": "stamp0349",
        "balloonAssetbundleName": "balloon_stamp_03"
    },
    {
        "id": 387,
        "stampType": "text",
        "seq": 3930,
        "name": "[텍스트 스탬프] 마후유!",
        "assetbundleName": "stamp0350",
        "balloonAssetbundleName": "balloon_stamp_03"
    },
    {
        "id": 388,
        "stampType": "text",
        "seq": 3940,
        "name": "[텍스트 스탬프] 에나!",
        "assetbundleName": "stamp0351",
        "balloonAssetbundleName": "balloon_stamp_03"
    },
    {
        "id": 389,
        "stampType": "text",
        "seq": 3950,
        "name": "[텍스트 스탬프] 미즈키!",
        "assetbundleName": "stamp0352",
        "balloonAssetbundleName": "balloon_stamp_03"
    },
    {
        "id": 390,
        "stampType": "text",
        "seq": 3700,
        "name": "[텍스트 스탬프] 미쿠!",
        "assetbundleName": "stamp0353",
        "balloonAssetbundleName": "balloon_stamp_03"
    },
    {
        "id": 391,
        "stampType": "text",
        "seq": 3710,
        "name": "[텍스트 스탬프] 린!",
        "assetbundleName": "stamp0354",
        "balloonAssetbundleName": "balloon_stamp_03"
    },
    {
        "id": 392,
        "stampType": "text",
        "seq": 3720,
        "name": "[텍스트 스탬프] 렌!",
        "assetbundleName": "stamp0355",
        "balloonAssetbundleName": "balloon_stamp_03"
    },
    {
        "id": 393,
        "stampType": "text",
        "seq": 3730,
        "name": "[텍스트 스탬프] 루카!",
        "assetbundleName": "stamp0356",
        "balloonAssetbundleName": "balloon_stamp_03"
    },
    {
        "id": 394,
        "stampType": "text",
        "seq": 3740,
        "name": "[텍스트 스탬프] MEIKO!",
        "assetbundleName": "stamp0357",
        "balloonAssetbundleName": "balloon_stamp_03"
    },
    {
        "id": 395,
        "stampType": "text",
        "seq": 3750,
        "name": "[텍스트 스탬프] KAITO!",
        "assetbundleName": "stamp0358",
        "balloonAssetbundleName": "balloon_stamp_03"
    },
    {
        "id": 396,
        "stampType": "text",
        "seq": 3960,
        "name": "[텍스트 스탬프] 귀여워!",
        "assetbundleName": "stamp0359",
        "balloonAssetbundleName": "balloon_stamp_03"
    },
    {
        "id": 397,
        "stampType": "text",
        "seq": 3970,
        "name": "[텍스트 스탬프] 멋있어!",
        "assetbundleName": "stamp0360",
        "balloonAssetbundleName": "balloon_stamp_03"
    },
    {
        "id": 398,
        "stampType": "text",
        "seq": 3980,
        "name": "[텍스트 스탬프] 눈부셔…",
        "assetbundleName": "stamp0361",
        "balloonAssetbundleName": "balloon_stamp_02"
    },
    {
        "id": 399,
        "stampType": "text",
        "seq": 3990,
        "name": "[텍스트 스탬프] 아름다워…",
        "assetbundleName": "stamp0362",
        "balloonAssetbundleName": "balloon_stamp_02"
    },
    {
        "id": 400,
        "stampType": "text",
        "seq": 4000,
        "name": "[텍스트 스탬프] 최고!!",
        "assetbundleName": "stamp0363",
        "balloonAssetbundleName": "balloon_stamp_05"
    },
    {
        "id": 401,
        "stampType": "text",
        "seq": 4010,
        "name": "[텍스트 스탬프] 갓곡!!!",
        "assetbundleName": "stamp0364",
        "balloonAssetbundleName": "balloon_stamp_05"
    },
    {
        "id": 402,
        "stampType": "text",
        "seq": 4020,
        "name": "[텍스트 스탬프] 기대된다~!",
        "assetbundleName": "stamp0365",
        "balloonAssetbundleName": "balloon_stamp_02"
    },
    {
        "id": 403,
        "stampType": "text",
        "seq": 4030,
        "name": "[텍스트 스탬프] 앙코르!",
        "assetbundleName": "stamp0366",
        "balloonAssetbundleName": "balloon_stamp_04"
    },
    {
        "id": 404,
        "stampType": "text",
        "seq": 4040,
        "name": "[텍스트 스탬프] 돌아줘!",
        "assetbundleName": "stamp0367",
        "balloonAssetbundleName": "balloon_stamp_03"
    },
    {
        "id": 405,
        "stampType": "text",
        "seq": 4050,
        "name": "[텍스트 스탬프] 여기 봐줘!",
        "assetbundleName": "stamp0368",
        "balloonAssetbundleName": "balloon_stamp_03"
    },
    {
        "id": 406,
        "stampType": "text",
        "seq": 4060,
        "name": "[텍스트 스탬프] 나왔다~~~!!",
        "assetbundleName": "stamp0369",
        "balloonAssetbundleName": "balloon_stamp_05"
    },
    {
        "id": 407,
        "stampType": "text",
        "seq": 4070,
        "name": "[텍스트 스탬프] 기뻐!",
        "assetbundleName": "stamp0370",
        "balloonAssetbundleName": "balloon_stamp_03"
    },
    {
        "id": 408,
        "stampType": "text",
        "seq": 4080,
        "name": "[텍스트 스탬프] 우오오오오",
        "assetbundleName": "stamp0371",
        "balloonAssetbundleName": "balloon_stamp_05"
    },
    {
        "id": 409,
        "stampType": "text",
        "seq": 4090,
        "name": "[텍스트 스탬프] 술렁술렁…",
        "assetbundleName": "stamp0372",
        "balloonAssetbundleName": "balloon_stamp_04"
    },
    {
        "id": 410,
        "stampType": "text",
        "seq": 4100,
        "name": "[텍스트 스탬프] 사랑해!!",
        "assetbundleName": "stamp0373",
        "balloonAssetbundleName": "balloon_stamp_03"
    },
    {
        "id": 411,
        "stampType": "text",
        "seq": 4110,
        "name": "[텍스트 스탬프] 너무 좋아!!",
        "assetbundleName": "stamp0374",
        "balloonAssetbundleName": "balloon_stamp_05"
    },
    {
        "id": 412,
        "stampType": "text",
        "seq": 4120,
        "name": "[텍스트 스탬프] 즐거웠어~",
        "assetbundleName": "stamp0375",
        "balloonAssetbundleName": "balloon_stamp_04"
    },
    {
        "id": 413,
        "stampType": "text",
        "seq": 4130,
        "name": "[텍스트 스탬프] 파이팅!",
        "assetbundleName": "stamp0376",
        "balloonAssetbundleName": "balloon_stamp_04"
    },
    {
        "id": 414,
        "stampType": "text",
        "seq": 4140,
        "name": "[텍스트 스탬프] 안녕",
        "assetbundleName": "stamp0377",
        "balloonAssetbundleName": "balloon_stamp_02"
    },
    {
        "id": 415,
        "stampType": "text",
        "seq": 4150,
        "name": "[텍스트 스탬프] 좋은 밤",
        "assetbundleName": "stamp0378",
        "balloonAssetbundleName": "balloon_stamp_02"
    },
    {
        "id": 416,
        "stampType": "text",
        "seq": 4160,
        "name": "[텍스트 스탬프] 바이바이~!",
        "assetbundleName": "stamp0379",
        "balloonAssetbundleName": "balloon_stamp_02"
    },
    {
        "id": 417,
        "stampType": "text",
        "seq": 4170,
        "name": "[텍스트 스탬프] 잘 가",
        "assetbundleName": "stamp0380",
        "balloonAssetbundleName": "balloon_stamp_02"
    },
    {
        "id": 418,
        "stampType": "text",
        "seq": 4180,
        "name": "[텍스트 스탬프] 고마워~!!",
        "assetbundleName": "stamp0418",
        "balloonAssetbundleName": "balloon_stamp_05"
    },
    {
        "id": 419,
        "stampType": "text",
        "seq": 4190,
        "name": "[텍스트 스탬프] 굉장해~!",
        "assetbundleName": "stamp0419",
        "balloonAssetbundleName": "balloon_stamp_03"
    },
    {
        "id": 420,
        "stampType": "text",
        "seq": 4200,
        "name": "[텍스트 스탬프] 감동했어!",
        "assetbundleName": "stamp0420",
        "balloonAssetbundleName": "balloon_stamp_05"
    },
    {
        "id": 421,
        "stampType": "illustration",
        "seq": 4210,
        "name": "[스탬프] 텐마 사키: 수고했어!",
        "assetbundleName": "stamp0421",
        "balloonAssetbundleName": "balloon_stamp_01",
        "characterId1": 2
    },
    {
        "id": 422,
        "stampType": "illustration",
        "seq": 4220,
        "name": "[스탬프] 아사히나 마후유: 잘 모르겠어",
        "assetbundleName": "stamp0422",
        "balloonAssetbundleName": "balloon_stamp_01",
        "characterId1": 18
    },
    {
        "id": 423,
        "stampType": "illustration",
        "seq": 4230,
        "name": "[스탬프] 카미시로 루이: 화려하게 가자!",
        "assetbundleName": "stamp0423",
        "balloonAssetbundleName": "balloon_stamp_01",
        "characterId1": 16
    },
    {
        "id": 424,
        "stampType": "illustration",
        "seq": 4240,
        "name": "[스탬프] 모모이 아이리: 지금부터 시작이야",
        "assetbundleName": "stamp0424",
        "balloonAssetbundleName": "balloon_stamp_01",
        "characterId1": 7
    },
    {
        "id": 425,
        "stampType": "illustration",
        "seq": 4250,
        "name": "[스탬프] 시라이시 안: 믿을게!",
        "assetbundleName": "stamp0425",
        "balloonAssetbundleName": "balloon_stamp_01",
        "characterId1": 10
    },
    {
        "id": 426,
        "stampType": "illustration",
        "seq": 4260,
        "name": "[스탬프] 쿠사나기 네네: 내가 제일 즐겨야지!",
        "assetbundleName": "stamp0426",
        "balloonAssetbundleName": "balloon_stamp_01",
        "characterId1": 15
    },
    {
        "id": 427,
        "stampType": "illustration",
        "seq": 4270,
        "name": "[스탬프] 모치즈키 호나미: 최선을 다할게요!",
        "assetbundleName": "stamp0427",
        "balloonAssetbundleName": "balloon_stamp_01",
        "characterId1": 3
    },
    {
        "id": 428,
        "stampType": "illustration",
        "seq": 4280,
        "name": "[스탬프] 히노모리 시즈쿠: 기대에 부응할게",
        "assetbundleName": "stamp0428",
        "balloonAssetbundleName": "balloon_stamp_01",
        "characterId1": 8
    },
    {
        "id": 429,
        "stampType": "illustration",
        "seq": 4290,
        "name": "[스탬프] 아오야기 토우야: 나는 내 길을 간다",
        "assetbundleName": "stamp0429",
        "balloonAssetbundleName": "balloon_stamp_01",
        "characterId1": 12
    },
    {
        "id": 430,
        "stampType": "illustration",
        "seq": 4300,
        "name": "[스탬프] 시노노메 에나: 아직 포기하고 싶지 않아",
        "assetbundleName": "stamp0430",
        "balloonAssetbundleName": "balloon_stamp_01",
        "characterId1": 19
    },
    {
        "id": 431,
        "stampType": "illustration",
        "seq": 4310,
        "name": "[스탬프] 오오토리 에무: 따끈따끈해!",
        "assetbundleName": "stamp0431",
        "balloonAssetbundleName": "balloon_stamp_01",
        "characterId1": 14
    },
    {
        "id": 432,
        "stampType": "illustration",
        "seq": 4320,
        "name": "[스탬프] 텐마 사키: 으앙~",
        "assetbundleName": "stamp0432",
        "balloonAssetbundleName": "balloon_stamp_01",
        "characterId1": 2
    },
    {
        "id": 433,
        "stampType": "illustration",
        "seq": 4330,
        "name": "[스탬프] 하나사토 미노리: 처음 봤어…!",
        "assetbundleName": "stamp0433",
        "balloonAssetbundleName": "balloon_stamp_01",
        "characterId1": 5
    },
    {
        "id": 434,
        "stampType": "cheerful_carnival_message",
        "seq": 4340,
        "name": "[텍스트 스탬프] 우리 팀 파이팅!",
        "assetbundleName": "stamp0434",
        "balloonAssetbundleName": "balloon_stamp_04"
    },
    {
        "id": 435,
        "stampType": "cheerful_carnival_message",
        "seq": 4350,
        "name": "[텍스트 스탬프] 연승하자!",
        "assetbundleName": "stamp0435",
        "balloonAssetbundleName": "balloon_stamp_04"
    },
    {
        "id": 436,
        "stampType": "cheerful_carnival_message",
        "seq": 4360,
        "name": "[텍스트 스탬프] 라이브 보너스가 없어…",
        "assetbundleName": "stamp0436",
        "balloonAssetbundleName": "balloon_stamp_03"
    },
    {
        "id": 437,
        "stampType": "cheerful_carnival_message",
        "seq": 4370,
        "name": "[텍스트 스탬프] 라이브 보너스 줄게!",
        "assetbundleName": "stamp0437",
        "balloonAssetbundleName": "balloon_stamp_04"
    },
    {
        "id": 438,
        "stampType": "cheerful_carnival_message",
        "seq": 4380,
        "name": "[텍스트 스탬프] 고마워!",
        "assetbundleName": "stamp0438",
        "balloonAssetbundleName": "balloon_stamp_04"
    },
    {
        "id": 439,
        "stampType": "cheerful_carnival_message",
        "seq": 4390,
        "name": "[텍스트 스탬프] 한 번 더 하자!",
        "assetbundleName": "stamp0439",
        "balloonAssetbundleName": "balloon_stamp_04"
    },
    {
        "id": 440,
        "stampType": "cheerful_carnival_message",
        "seq": 4400,
        "name": "[텍스트 스탬프] 슬슬 가 볼게",
        "assetbundleName": "stamp0440",
        "balloonAssetbundleName": "balloon_stamp_02"
    },
    {
        "id": 441,
        "stampType": "cheerful_carnival_message",
        "seq": 4410,
        "name": "[텍스트 스탬프] 친구가 되자!",
        "assetbundleName": "stamp0441",
        "balloonAssetbundleName": "balloon_stamp_04"
    },
    {
        "id": 442,
        "stampType": "cheerful_carnival_message",
        "seq": 4420,
        "name": "[텍스트 스탬프] 또 보자!",
        "assetbundleName": "stamp0442",
        "balloonAssetbundleName": "balloon_stamp_04"
    },
    {
        "id": 443,
        "stampType": "illustration",
        "seq": 4430,
        "name": "[스탬프] 호시노 이치카: 더 노래하고 싶어",
        "assetbundleName": "stamp0443",
        "balloonAssetbundleName": "balloon_stamp_01",
        "characterId1": 1
    },
    {
        "id": 444,
        "stampType": "illustration",
        "seq": 4440,
        "name": "[스탬프] 아키야마 미즈키: …아아~",
        "assetbundleName": "stamp0444",
        "balloonAssetbundleName": "balloon_stamp_01",
        "characterId1": 20
    },
    {
        "id": 445,
        "stampType": "illustration",
        "seq": 4450,
        "name": "[스탬프] 히노모리 시호: 후회해도 난 몰라",
        "assetbundleName": "stamp0445",
        "balloonAssetbundleName": "balloon_stamp_01",
        "characterId1": 4
    },
    {
        "id": 446,
        "stampType": "illustration",
        "seq": 4460,
        "name": "[스탬프] 시노노메 아키토: 가자 얘들아!",
        "assetbundleName": "stamp0446",
        "balloonAssetbundleName": "balloon_stamp_01",
        "characterId1": 11
    },
    {
        "id": 447,
        "stampType": "illustration",
        "seq": 4470,
        "name": "[스탬프] 모모이 아이리: 믿고 기다리자!",
        "assetbundleName": "stamp0447",
        "balloonAssetbundleName": "balloon_stamp_01",
        "characterId1": 7
    },
    {
        "id": 448,
        "stampType": "illustration",
        "seq": 4480,
        "name": "[스탬프] 키리타니 하루카: 잘 먹겠습니다",
        "assetbundleName": "stamp0448",
        "balloonAssetbundleName": "balloon_stamp_01",
        "characterId1": 6
    },
    {
        "id": 449,
        "stampType": "illustration",
        "seq": 4490,
        "name": "[스탬프] 카미시로 루이: 좋은걸!",
        "assetbundleName": "stamp0449",
        "balloonAssetbundleName": "balloon_stamp_01",
        "characterId1": 16
    },
    {
        "id": 450,
        "stampType": "illustration",
        "seq": 4500,
        "name": "[스탬프] 텐마 츠카사: 훌륭해!",
        "assetbundleName": "stamp0450",
        "balloonAssetbundleName": "balloon_stamp_01",
        "characterId1": 13
    },
    {
        "id": 451,
        "stampType": "illustration",
        "seq": 4510,
        "name": "[스탬프] 요이사키 카나데: 이런 거구나",
        "assetbundleName": "stamp0451",
        "balloonAssetbundleName": "balloon_stamp_01",
        "characterId1": 17
    },
    {
        "id": 452,
        "stampType": "illustration",
        "seq": 4520,
        "name": "[스탬프] 텐마 사키: 알겠다!",
        "assetbundleName": "stamp0452",
        "balloonAssetbundleName": "balloon_stamp_01",
        "characterId1": 2
    },
    {
        "id": 453,
        "stampType": "illustration",
        "seq": 4530,
        "name": "[스탬프] 아즈사와 코하네: 더 할 수 있어!",
        "assetbundleName": "stamp0453",
        "balloonAssetbundleName": "balloon_stamp_01",
        "characterId1": 9
    },
    {
        "id": 454,
        "stampType": "illustration",
        "seq": 4540,
        "name": "[스탬프] 시노노메 에나: 꽤 하는데",
        "assetbundleName": "stamp0454",
        "balloonAssetbundleName": "balloon_stamp_01",
        "characterId1": 19
    },
    {
        "id": 455,
        "stampType": "illustration",
        "seq": 4550,
        "name": "[스탬프] 모치즈키 호나미: 한 번 더 해 보자!",
        "assetbundleName": "stamp0455",
        "balloonAssetbundleName": "balloon_stamp_01",
        "characterId1": 3
    },
    {
        "id": 456,
        "stampType": "illustration",
        "seq": 4560,
        "name": "[스탬프] 모모이 아이리: 여유롭지!",
        "assetbundleName": "stamp0456",
        "balloonAssetbundleName": "balloon_stamp_01",
        "characterId1": 7
    },
    {
        "id": 457,
        "stampType": "illustration",
        "seq": 4570,
        "name": "[스탬프] 쿠사나기 네네: 죽는 줄 알았네…",
        "assetbundleName": "stamp0457",
        "balloonAssetbundleName": "balloon_stamp_01",
        "characterId1": 15
    },
    {
        "id": 458,
        "stampType": "illustration",
        "seq": 4580,
        "name": "[스탬프] 히노모리 시호: 잔뜩 받았어",
        "assetbundleName": "stamp0458",
        "balloonAssetbundleName": "balloon_stamp_01",
        "characterId1": 4
    },
    {
        "id": 459,
        "stampType": "illustration",
        "seq": 4590,
        "name": "[스탬프] 호시노 이치카: 끝까지 가보자!",
        "assetbundleName": "stamp0459",
        "balloonAssetbundleName": "balloon_stamp_01",
        "characterId1": 1
    },
    {
        "id": 460,
        "stampType": "illustration",
        "seq": 4600,
        "name": "[스탬프] 아사히나 마후유: 윽…",
        "assetbundleName": "stamp0460",
        "balloonAssetbundleName": "balloon_stamp_01",
        "characterId1": 18
    }
]