[
    {
        "panel": 0,
        "titleText": "WORD_GUIDEGROUP_TITLE_001",
        "details": [
            {
                "panel": 1,
                "guideText": "WORD_GUIDEGROUP_GUIDETEXT_002",
                "buttonText": "WORD_GUIDEGROUP_BUTTONTEXT_002"
            },
            {
                "panel": 2,
                "guideText": "WORD_GUIDEGROUP_GUIDETEXT_003",
                "buttonText": "WORD_GUIDEGROUP_BUTTONTEXT_003"
            }
        ]
    },
    {
        "panel": 1,
        "titleText": "WORD_GUIDEGROUP_TITLE_001",
        "details": [
            {
                "panel": 1,
                "guideText": "WORD_GUIDEGROUP_GUIDETEXT_002",
                "buttonText": "WORD_GUIDEGROUP_BUTTONTEXT_002"
            },
            {
                "panel": 2,
                "guideText": "WORD_GUIDEGROUP_GUIDETEXT_003",
                "buttonText": "WORD_GUIDEGROUP_BUTTONTEXT_003"
            }
        ]
    },
    {
        "panel": 2,
        "titleText": "WORD_GUIDEGROUP_TITLE_001",
        "details": [
            {
                "panel": 3,
                "guideText": "WORD_GUIDEGROUP_GUIDETEXT_005",
                "buttonText": "WORD_GUIDEGROUP_BUTTONTEXT_005"
            }
        ]
    },
    {
        "panel": 3,
        "titleText": "WORD_GUIDEGROUP_TITLE_001",
        "details": [
            {
                "panel": 4,
                "guideText": "WORD_GUIDEGROUP_GUIDETEXT_006",
                "buttonText": "WORD_GUIDEGROUP_BUTTONTEXT_006"
            }
        ]
    },
    {
        "panel": 5,
        "titleText": "WORD_GUIDEGROUP_TITLE_001",
        "details": [
            {
                "panel": 1,
                "guideText": "WORD_GUIDEGROUP_GUIDETEXT_002",
                "buttonText": "WORD_GUIDEGROUP_BUTTONTEXT_002"
            },
            {
                "panel": 2,
                "guideText": "WORD_GUIDEGROUP_GUIDETEXT_003",
                "buttonText": "WORD_GUIDEGROUP_BUTTONTEXT_003"
            }
        ]
    },
    {
        "panel": 7,
        "titleText": "WORD_GUIDEGROUP_TITLE_001",
        "details": [
            {
                "panel": 1,
                "guideText": "WORD_GUIDEGROUP_GUIDETEXT_002",
                "buttonText": "WORD_GUIDEGROUP_BUTTONTEXT_002"
            },
            {
                "panel": 2,
                "guideText": "WORD_GUIDEGROUP_GUIDETEXT_003",
                "buttonText": "WORD_GUIDEGROUP_BUTTONTEXT_003"
            }
        ]
    },
    {
        "panel": 8,
        "titleText": "WORD_GUIDEGROUP_TITLE_001",
        "details": [
            {
                "panel": 1,
                "guideText": "WORD_GUIDEGROUP_GUIDETEXT_002",
                "buttonText": "WORD_GUIDEGROUP_BUTTONTEXT_002"
            },
            {
                "panel": 2,
                "guideText": "WORD_GUIDEGROUP_GUIDETEXT_003",
                "buttonText": "WORD_GUIDEGROUP_BUTTONTEXT_003"
            }
        ]
    },
    {
        "panel": 9,
        "titleText": "WORD_GUIDEGROUP_TITLE_001",
        "details": [
            {
                "panel": 2,
                "guideText": "WORD_GUIDEGROUP_GUIDETEXT_003",
                "buttonText": "WORD_GUIDEGROUP_BUTTONTEXT_003"
            }
        ]
    }
]