[
    {
        "customProfileResourceType": "story_background",
        "id": 1,
        "seq": 1,
        "name": "교실 세카이",
        "resourceLoadType": "assetbundle",
        "resourceLoadVal": "custom_profile/bg",
        "fileName": "profile_bg_story_0001"
    },
    {
        "customProfileResourceType": "story_background",
        "id": 2,
        "seq": 2,
        "name": "스테이지 세카이",
        "resourceLoadType": "assetbundle",
        "resourceLoadVal": "custom_profile/bg",
        "fileName": "profile_bg_story_0002"
    },
    {
        "customProfileResourceType": "story_background",
        "id": 3,
        "seq": 3,
        "name": "스트리트 세카이",
        "resourceLoadType": "assetbundle",
        "resourceLoadVal": "custom_profile/bg",
        "fileName": "profile_bg_story_0003"
    },
    {
        "customProfileResourceType": "story_background",
        "id": 4,
        "seq": 4,
        "name": "원더랜드 세카이",
        "resourceLoadType": "assetbundle",
        "resourceLoadVal": "custom_profile/bg",
        "fileName": "profile_bg_story_0004"
    },
    {
        "customProfileResourceType": "story_background",
        "id": 5,
        "seq": 5,
        "name": "아무도 없는 세카이",
        "resourceLoadType": "assetbundle",
        "resourceLoadVal": "custom_profile/bg",
        "fileName": "profile_bg_story_0005"
    },
    {
        "customProfileResourceType": "story_background",
        "id": 6,
        "seq": 6,
        "name": "미야마스자카 여학원 안뜰",
        "resourceLoadType": "assetbundle",
        "resourceLoadVal": "custom_profile/bg",
        "fileName": "profile_bg_story_0006"
    },
    {
        "customProfileResourceType": "story_background",
        "id": 7,
        "seq": 7,
        "name": "미야마스자카 여학원 교실",
        "resourceLoadType": "assetbundle",
        "resourceLoadVal": "custom_profile/bg",
        "fileName": "profile_bg_story_0007"
    },
    {
        "customProfileResourceType": "story_background",
        "id": 8,
        "seq": 8,
        "name": "미야마스자카 여학원 옥상",
        "resourceLoadType": "assetbundle",
        "resourceLoadVal": "custom_profile/bg",
        "fileName": "profile_bg_story_0008"
    },
    {
        "customProfileResourceType": "story_background",
        "id": 9,
        "seq": 9,
        "name": "카미야마 고등학교 교문",
        "resourceLoadType": "assetbundle",
        "resourceLoadVal": "custom_profile/bg",
        "fileName": "profile_bg_story_0009"
    },
    {
        "customProfileResourceType": "story_background",
        "id": 10,
        "seq": 10,
        "name": "카미야마 고등학교 교실",
        "resourceLoadType": "assetbundle",
        "resourceLoadVal": "custom_profile/bg",
        "fileName": "profile_bg_story_0010"
    },
    {
        "customProfileResourceType": "story_background",
        "id": 11,
        "seq": 11,
        "name": "카미야마 고등학교 옥상",
        "resourceLoadType": "assetbundle",
        "resourceLoadVal": "custom_profile/bg",
        "fileName": "profile_bg_story_0011"
    },
    {
        "customProfileResourceType": "story_background",
        "id": 12,
        "seq": 12,
        "name": "스크램블 교차로",
        "resourceLoadType": "assetbundle",
        "resourceLoadVal": "custom_profile/bg",
        "fileName": "profile_bg_story_0012"
    },
    {
        "customProfileResourceType": "story_background",
        "id": 13,
        "seq": 13,
        "name": "음반 상점",
        "resourceLoadType": "assetbundle",
        "resourceLoadVal": "custom_profile/bg",
        "fileName": "profile_bg_story_0013"
    },
    {
        "customProfileResourceType": "story_background",
        "id": 14,
        "seq": 14,
        "name": "WEEKEND GARAGE",
        "resourceLoadType": "assetbundle",
        "resourceLoadVal": "custom_profile/bg",
        "fileName": "profile_bg_story_0014"
    },
    {
        "customProfileResourceType": "story_background",
        "id": 15,
        "seq": 15,
        "name": "피닉스 원더랜드",
        "resourceLoadType": "assetbundle",
        "resourceLoadVal": "custom_profile/bg",
        "fileName": "profile_bg_story_0015"
    },
    {
        "customProfileResourceType": "story_background",
        "id": 16,
        "seq": 16,
        "name": "원더 스테이지",
        "resourceLoadType": "assetbundle",
        "resourceLoadVal": "custom_profile/bg",
        "fileName": "profile_bg_story_0016"
    },
    {
        "customProfileResourceType": "story_background",
        "id": 17,
        "seq": 17,
        "name": "패밀리 레스토랑",
        "resourceLoadType": "assetbundle",
        "resourceLoadVal": "custom_profile/bg",
        "fileName": "profile_bg_story_0017"
    }
]