[
    {
        "characterId": 1,
        "characterVoice": "Ruriko Noguchi",
        "birthday": "8월 11일",
        "height": "161cm",
        "school": "미야마스자카 여학원",
        "schoolYear": "1-C",
        "hobby": "미쿠 노래 듣기,\n키우는 선인장 바라보기",
        "specialSkill": "사과 깎기",
        "favoriteFood": "야키소바빵",
        "hatedFood": "완두콩",
        "weak": "무서운 놀이기구",
        "introduction": " 쿨해 보이지만 사실은 친구를 아끼는 다정한 소녀로, 사키, 호나미, 시호와 소꿉친구지만 어떤 사정 때문에 호나미, 시호와 서먹해졌다. 미쿠의 노래를 듣는 걸 좋아한다.\nLeo/need에서는 기타/보컬 담당.",
        "scenarioId": "self_ichika"
    },
    {
        "characterId": 2,
        "characterVoice": "Karin Isobe",
        "birthday": "5월 9일",
        "height": "159cm",
        "school": "미야마스자카 여학원",
        "schoolYear": "1-C",
        "hobby": "패션&메이크업 영상 보기,\n비즈 액세서리 만들기",
        "specialSkill": "헤어스타일 바꾸기, 공기놀이",
        "favoriteFood": "과자",
        "hatedFood": "죽",
        "weak": "혼자 있기",
        "introduction": " 늘 밝고 웃음을 잃지 않는 분위기 메이커로, 선천적으로 몸이 약해 중학교를 제대로 다니지 못했으나 건강을 회복하고 고등학교에 복학한다. 오랜만에 재회한 소꿉친구들과의 즐거운 고교 생활을 기대했으나……\nLeo/need에서는 키보드 담당.",
        "scenarioId": "self_saki"
    },
    {
        "characterId": 3,
        "characterVoice": "Reina Ueda",
        "birthday": "10월 27일",
        "height": "166cm",
        "school": "미야마스자카 여학원",
        "schoolYear": "1-B",
        "hobby": "반려견 산책하기, 홈 가드닝 하기",
        "specialSkill": "집안일, 수영",
        "favoriteFood": "애플파이",
        "hatedFood": "치즈",
        "weak": "그림 그리기",
        "introduction": " 지덕체를 겸비한 모범생으로 포용력이 있고 다정하다. 이치카, 사키, 시호와는 소꿉친구였지만 중학교 시절에 어떤 일 때문에 거리를 두게 되었다.\nLeo/need에서는 드럼 담당.",
        "scenarioId": "self_honami"
    },
    {
        "characterId": 4,
        "characterVoice": "Yuki Nakashima",
        "birthday": "1월 8일",
        "height": "159cm",
        "school": "미야마스자카 여학원",
        "schoolYear": "1-A",
        "hobby": "좋아하는 걸스 밴드 라이브 가기,\n베이스 연습/연주하기",
        "specialSkill": "서예",
        "favoriteFood": "라멘, 햄버그 스테이크",
        "hatedFood": "두부",
        "weak": "언니",
        "introduction": " 다른 사람과 어울리기를 싫어하는 독불장군으로, 자신이 좋아하는 일에 몰두하여 주변 사람이 어떻게 생각하는지는 신경 쓰지 않는다. 그러나 이런 시호도 예전에는 소꿉친구들과 함께 지내며 친구들을 소중하게 생각했었는데……\nLeo/need에서는 베이스 담당.",
        "scenarioId": "self_shiho"
    },
    {
        "characterId": 5,
        "characterVoice": "Yui Ogura",
        "birthday": "4월 14일",
        "height": "158cm",
        "school": "미야마스자카 여학원",
        "schoolYear": "1-A",
        "hobby": "안무 카피하기, 일기 쓰기,\n동물 돌보기",
        "specialSkill": "캐치프레이즈 만들기",
        "favoriteFood": "연어",
        "hatedFood": "브로콜리",
        "weak": "차분한 행동",
        "introduction": " 순수하고 한결같은 노력파로, 아이돌 그룹 \"ASRUN\"의 키리타니 하루카를 본 뒤 아이돌을 목표로 하게 되었다. 그러나 수많은 오디션에 도전했지만 계속 탈락하고 있다.",
        "scenarioId": "self_minori"
    },
    {
        "characterId": 6,
        "characterVoice": "Mayu Yoshioka",
        "birthday": "10월 5일",
        "height": "163cm",
        "school": "미야마스자카 여학원",
        "schoolYear": "1-C",
        "hobby": "펭귄 굿즈 수집하기",
        "specialSkill": "농구",
        "favoriteFood": "단 음식",
        "hatedFood": "고추냉이",
        "weak": "게으름 피우기",
        "introduction": " 국민 인기 아이돌 그룹 \"ASRUN\" 소속으로 카리스마가 있어 그룹 내에서도 절대적인 인기를 자랑했다. 하지만 그룹이 해체되며 연예계를 은퇴하고 미노리가 다니는 미야마스자카 여학원에 복학한다.",
        "scenarioId": "self_haruka"
    },
    {
        "characterId": 7,
        "characterVoice": "Ai Furihata",
        "birthday": "3월 19일",
        "height": "156cm",
        "school": "미야마스자카 여학원",
        "schoolYear": "2-D",
        "hobby": "아이돌 연구하기, 쇼핑하기",
        "specialSkill": "요리, 아이 돌보기",
        "favoriteFood": "화과자",
        "hatedFood": "간",
        "weak": "고양이(알레르기)",
        "introduction": " 예능 프로그램 등에 출연해 한때 인기를 누렸던 아이돌 출신으로, 자신감 넘치는 성격의 소유자이다. 가끔은 억지스러운 면도 있지만 아이돌 일에 애정과 열정, 강한 자부심을 가지고 있었다. 지금은 사정이 있어 소속사에서 나와 아이돌 활동을 은퇴했다.",
        "scenarioId": "self_airi"
    },
    {
        "characterId": 8,
        "characterVoice": "Rina Honnizumi",
        "birthday": "12월 6일",
        "height": "168cm",
        "school": "미야마스자카 여학원",
        "schoolYear": "2-D",
        "hobby": "책 읽기, 산책하기",
        "specialSkill": "궁도, 자수",
        "favoriteFood": "우동, 두부피",
        "hatedFood": "매운 음식",
        "weak": "지도 보기, 기계 조작",
        "introduction": " 인기 아이돌 그룹 \"Cheerful＊Days\"에 소속한 현역 아이돌로, 비밀스럽고 어른스러운 매력이 느껴지는 외모로 팬을 사로잡는다. 하지만 그룹 멤버들에게 질투를 사기도 한다. 아이리와는 연습생 동기 사이.",
        "scenarioId": "self_shizuku"
    },
    {
        "characterId": 9,
        "characterVoice": "Akina",
        "birthday": "3월 2일",
        "height": "156cm",
        "school": "미야마스자카 여학원",
        "schoolYear": "1-A",
        "hobby": "아빠가 키우는 뱀 돌보기",
        "specialSkill": "사진",
        "favoriteFood": "복숭아 모양 만두, 참깨 경단",
        "hatedFood": "초무침",
        "weak": "사람들 앞에 서기",
        "introduction": " 매우 내성적이고 자신감이 없는 소녀로, 어느 날 우연히 지나가던 라이브 카페&바에서 안과 뮤지션이 합주하는 모습을 목격한다. 음악 수업 시간에 전혀 들어보지 못한 랩과 격렬한 템포의 음악에 충격을 받고는 푹 빠져들게 되는데……",
        "scenarioId": "self_kohane"
    },
    {
        "characterId": 10,
        "characterVoice": "Tomomi Jiena Sumi",
        "birthday": "7월 26일",
        "height": "160cm",
        "school": "카미야마 고등학교",
        "schoolYear": "1-A",
        "hobby": "민트 키우기",
        "specialSkill": "커피나 홍차 끓이기",
        "favoriteFood": "럼 레이즌 아이스크림",
        "hatedFood": "토마토",
        "weak": "유령, 무서운 이야기",
        "introduction": " 털털하고 경쟁심이 강한 성격으로 시부야 거리에서 꽤 유명한 뮤지션 출신의 아버지가 있다. 아버지가 과거에 열었던 라이브 이벤트 \"RAD WEEKEND\"를 뛰어넘는 최고의 이벤트를 자기 손으로 만들 날을 꿈꾸고 있다.",
        "scenarioId": "self_an"
    },
    {
        "characterId": 11,
        "characterVoice": "Fumiya Imai",
        "birthday": "11월 12일",
        "height": "174cm",
        "school": "카미야마 고등학교",
        "schoolYear": "1-C",
        "hobby": "패션 코디네이트 하기",
        "specialSkill": "휴먼 비트 박스",
        "favoriteFood": "팬케이크, 치즈케이크",
        "hatedFood": "당근",
        "weak": "개",
        "introduction": " 안의 아버지를 동경해 중학교 시절부터 음악 활동을 시작했으며, 현재는 파트너 토우야와 \"BAD DOGS\"라는 이름으로 이벤트 하우스 등에서 노래하고 있다. 얼핏 보면 붙임성 있어 보이는데……",
        "scenarioId": "self_akito"
    },
    {
        "characterId": 12,
        "characterVoice": "Kent Ito",
        "birthday": "5월 25일",
        "height": "178cm",
        "school": "카미야마 고등학교",
        "schoolYear": "1-B",
        "hobby": "책 읽기",
        "specialSkill": "피아노, 바이올린",
        "favoriteFood": "커피, 쿠키",
        "hatedFood": "오징어",
        "weak": "높은 곳",
        "introduction": " 쿨하고 과묵한 성격으로 클래식 음악계에 종사하는 엄격한 아버지가 있다. 어렸을 때부터 영재 교육을 받아 음악적 센스가 뛰어나지만, 아버지에게 환멸을 느끼고 길거리에서 음악 활동을 시작했다.",
        "scenarioId": "self_touya"
    },
    {
        "characterId": 13,
        "characterVoice": "Daisuke Hirose",
        "birthday": "5월 17일",
        "height": "172cm",
        "school": "카미야마 고등학교",
        "schoolYear": "2-A",
        "hobby": "뮤지컬 보기, 의상 만들기",
        "specialSkill": "언제든 즉시 멋진 포즈 잡기, 피아노",
        "favoriteFood": "아콰 파차, 돼지고기 생강구이",
        "hatedFood": "피망",
        "weak": "벌레(특히 다리가 많은 것)",
        "introduction": " 자신감이 지나치며 눈에 띄고 싶어 하는 성격으로, 우쭐해지기 쉽고 우쭐하게 만들기도 쉽다. 어렸을 때 본 극단의 쇼를 동경하여 세계 최고의 스타를 꿈꾸고 있다. 몸이 약한 동생 사키를 격려하는 등 오빠로서의 믿음직한 모습도 보여 준다.",
        "scenarioId": "self_tsukasa"
    },
    {
        "characterId": 14,
        "characterVoice": "Hina Kino",
        "birthday": "9월 9일",
        "height": "152cm",
        "school": "미야마스자카 여학원",
        "schoolYear": "1-B",
        "hobby": "주변 탐험하기",
        "specialSkill": "아크로바틱 댄스, 뭐든 맛있게 먹기",
        "favoriteFood": "붕어빵",
        "hatedFood": "없음!",
        "weak": "노을",
        "introduction": " 한없이 밝고 천진난만한 성격으로, 생각한 것을 바로 행동에 옮기기 때문에 자기도 모르게 주위 사람들을 끌어들이는 일이 적지 않다. 피닉스 원더랜드의 낡은 스테이지를 어떻게든 부활시키기 위해 함께 스테이지에 설 사람을 찾고 있다.",
        "scenarioId": "self_emu"
    },
    {
        "characterId": 15,
        "characterVoice": "Machico",
        "birthday": "7월 20일",
        "height": "156cm",
        "school": "카미야마 고등학교",
        "schoolYear": "1-B",
        "hobby": "대전 게임하기, 뮤지컬/영화 보기",
        "specialSkill": "노래, 기계 조작",
        "favoriteFood": "자몽",
        "hatedFood": "민트 맛 음식",
        "weak": "사람이 많은 곳",
        "introduction": " 루이의 추천으로 멤버에 합류한 독설가 소녀로, 뮤지컬 무대를 꿈꾸는 노래 실력은 고등학생 수준을 크게 뛰어넘는다. 하지만 어째서인지 츠카사나 에무의 앞에는 모습을 드러내지 않고, 네네 로봇이라는 로봇을 조작하여 자기 대신 무대에 세운다.",
        "scenarioId": "self_nene"
    },
    {
        "characterId": 16,
        "characterVoice": "Shunichi Toki",
        "birthday": "6월 24일",
        "height": "180cm",
        "school": "카미야마 고등학교",
        "schoolYear": "2-B",
        "hobby": "쇼 연출 구상하기,\n풍선 아트 만들기",
        "specialSkill": "발명",
        "favoriteFood": "라무네 사탕",
        "hatedFood": "채소",
        "weak": "청소, 단순 작업",
        "introduction": " 자유로운 천재 소년으로 네네와는 옆집에 사는 소꿉친구 사이이다. 스테이지 연출을 구성하는 한편, 기계 조작과 발명이 주특기여서 쇼에 이용할 로봇을 만들기도 한다. 독특한 발상 때문에 주변 사람에게 괴짜 취급을 당하는 일이 많다.",
        "scenarioId": "self_rui"
    },
    {
        "characterId": 17,
        "characterVoice": "Tomori Kusunoki",
        "birthday": "2월 10일",
        "height": "154cm",
        "school": "방송 통신 고등학교",
        "schoolYear": "-",
        "hobby": "음악 찾아 듣기, 영화/만화/\n애니메이션/미술 작품 보기",
        "specialSkill": "느낌으로 시간 재기",
        "favoriteFood": "컵라면, 통조림",
        "hatedFood": "고수나 낫토처럼 냄새가 독특한 것",
        "weak": "직사광선, 집안일",
        "introduction": " 자신의 음악이 소중한 사람에게 절망을 준 트라우마가 있다. 그 일 때문에 '누군가를 행복하게 할 수 있는 곡을 계속 만들어야 한다'고 생각하게 되어 \"25시, 나이트 코드에서.\"를 결성했다. 주로 작곡을 담당한다.",
        "scenarioId": "self_kanade"
    },
    {
        "characterId": 18,
        "characterVoice": "Rui Tanabe",
        "birthday": "1월 27일",
        "height": "162cm",
        "school": "미야마스자카 여학원",
        "schoolYear": "2-B",
        "hobby": "어항",
        "specialSkill": "영어 회화",
        "favoriteFood": "엄마가 해 준 요리",
        "hatedFood": "모름",
        "weak": "모름",
        "introduction": " 밝고 유머 감각이 있으며 모두가 신뢰하는 모범생으로, 유일하게 서클 멤버 중에서 평범하게 학교를 다닌다. 서클에서는 작사를 담당하며, 다양한 배려심을 보이는 등 얼핏 완벽한 모범생처럼 보이지만……?",
        "scenarioId": "self_mafuyu"
    },
    {
        "characterId": 19,
        "characterVoice": "Minori Suzuki",
        "birthday": "4월 30일",
        "height": "158cm",
        "school": "카미야마 고등학교(야간 정시제)",
        "schoolYear": "2-D",
        "hobby": "그림 그리기, 자기 이름 검색하기,\n셀카 찍어서 SNS에 업로드하기",
        "specialSkill": "패션 소품 조사, 음식 재료 맞히기",
        "favoriteFood": "팬케이크, 치즈케이크",
        "hatedFood": "당근",
        "weak": "아침에 일어나기",
        "introduction": " 인정받고 싶은 욕구가 강하고 SNS에 다소 의존한다. 유명한 화가 아버지가 있으며, 그림을 그려 인터넷에 올리던 중 카나데의 제안을 받아 멤버가 되었다. 서클에서는 주로 동영상에 들어갈 일러스트를 담당한다.",
        "scenarioId": "self_ena"
    },
    {
        "characterId": 20,
        "characterVoice": "Hinata Sato",
        "birthday": "8월 27일",
        "height": "163cm",
        "school": "카미야마 고등학교",
        "schoolYear": "1-A",
        "hobby": "동영상 소재 모으기, 콜라주 만들기",
        "specialSkill": "옷 리폼",
        "favoriteFood": "카레라이스, 감자튀김",
        "hatedFood": "버섯류",
        "weak": "뜨거운 음식",
        "introduction": " 귀여운 것을 사랑하는 기분파로, 우연히 들은 카나데의 곡에 이끌려 MV를 만들어 인터넷에 올렸다. 이를 본 카나데의 제안으로 서클의 동영상 담당이 되었다. 서클 멤버가 모르는 비밀이 있다.",
        "scenarioId": "self_mizuki"
    },
    {
        "characterId": 21,
        "birthday": "8월 31일",
        "height": "158cm",
        "introduction": " 청록색 양 갈래 머리가 특징인 소녀 버추얼 싱어로, 발랄하고 밝으며 귀여운 음색으로 다양한 장르의 노래를 부른다. 버추얼 싱어 중에서도 세대를 불문하고 전 세계적으로 이름이 알려져 있다.",
        "scenarioId": "self_miku"
    },
    {
        "characterId": 22,
        "birthday": "12월 27일",
        "height": "152cm",
        "introduction": " 커다란 리본을 단 금색 단발머리가 특징인 소녀 버추얼 싱어이며, 카가미네 렌과는 트윈 보컬이다. 귀엽고 활기찬 외모에 꼭 맞는 매력적인 음색을 가지고 있다.",
        "scenarioId": "self_rin"
    },
    {
        "characterId": 23,
        "birthday": "12월 27일",
        "height": "156cm",
        "introduction": " 짧게 뒤로 묶은 금발이 특징인 소년 버추얼 싱어이며, 카가미네 린과는 트윈 보컬이다. 소년 같은 느낌의 굳세고 힘찬 음색을 가졌으며 풍부한 감정 표현도 겸비했다.",
        "scenarioId": "self_len"
    },
    {
        "characterId": 24,
        "birthday": "1월 30일",
        "height": "162cm",
        "introduction": " 긴 분홍색 머리가 특징인 여성 버추얼 싱어로, 침착한 태도와 잘 어울리는 부드러운 음색을 가졌다. 때로는 정열적인 음색을 들려 주며 2개 국어를 구사할 수 있어 일본어와 영어로 노래할 수 있다.",
        "scenarioId": "self_luka"
    },
    {
        "characterId": 25,
        "birthday": "11월 5일",
        "height": "167cm",
        "introduction": " 밤색 쇼트커트, 짧은 빨간색 상의와 미니스커트가 특징인 여성 버추얼 싱어이다. 안정적이고 뛰어난 가창력과 부드럽고 따뜻한 음색을 가지고 있다.",
        "scenarioId": "self_meiko"
    },
    {
        "characterId": 26,
        "birthday": "2월 17일",
        "height": "175cm",
        "introduction": " 살짝 밖으로 뻗친 다크 블루 머리와 푸른색 긴 목도리 의상이 특징인 남성 버추얼 싱어이다. 청량하고 순수한 음색을 가졌으며 탄탄한 저음과 쭉쭉 뻗는 고음을 구사한다.",
        "scenarioId": "self_kaito"
    }
]