[
    {
        "id": 1,
        "eventId": 1,
        "gameCharacterUnitId": 1,
        "cardAttr": "mysterious",
        "bonusRate": 50.0
    },
    {
        "id": 2,
        "eventId": 1,
        "gameCharacterUnitId": 2,
        "cardAttr": "mysterious",
        "bonusRate": 50.0
    },
    {
        "id": 3,
        "eventId": 1,
        "gameCharacterUnitId": 3,
        "cardAttr": "mysterious",
        "bonusRate": 50.0
    },
    {
        "id": 4,
        "eventId": 1,
        "gameCharacterUnitId": 4,
        "cardAttr": "mysterious",
        "bonusRate": 50.0
    },
    {
        "id": 5,
        "eventId": 1,
        "gameCharacterUnitId": 42,
        "cardAttr": "mysterious",
        "bonusRate": 50.0
    },
    {
        "id": 6,
        "eventId": 1,
        "gameCharacterUnitId": 1,
        "bonusRate": 20.0
    },
    {
        "id": 7,
        "eventId": 1,
        "gameCharacterUnitId": 2,
        "bonusRate": 20.0
    },
    {
        "id": 8,
        "eventId": 1,
        "gameCharacterUnitId": 3,
        "bonusRate": 20.0
    },
    {
        "id": 9,
        "eventId": 1,
        "gameCharacterUnitId": 4,
        "bonusRate": 20.0
    },
    {
        "id": 10,
        "eventId": 1,
        "gameCharacterUnitId": 42,
        "bonusRate": 20.0
    },
    {
        "id": 11,
        "eventId": 1,
        "cardAttr": "mysterious",
        "bonusRate": 20.0
    },
    {
        "id": 12,
        "eventId": 2,
        "gameCharacterUnitId": 17,
        "cardAttr": "cool",
        "bonusRate": 50.0
    },
    {
        "id": 13,
        "eventId": 2,
        "gameCharacterUnitId": 18,
        "cardAttr": "cool",
        "bonusRate": 50.0
    },
    {
        "id": 14,
        "eventId": 2,
        "gameCharacterUnitId": 19,
        "cardAttr": "cool",
        "bonusRate": 50.0
    },
    {
        "id": 15,
        "eventId": 2,
        "gameCharacterUnitId": 20,
        "cardAttr": "cool",
        "bonusRate": 50.0
    },
    {
        "id": 16,
        "eventId": 2,
        "gameCharacterUnitId": 31,
        "cardAttr": "cool",
        "bonusRate": 50.0
    },
    {
        "id": 17,
        "eventId": 2,
        "gameCharacterUnitId": 17,
        "bonusRate": 20.0
    },
    {
        "id": 18,
        "eventId": 2,
        "gameCharacterUnitId": 18,
        "bonusRate": 20.0
    },
    {
        "id": 19,
        "eventId": 2,
        "gameCharacterUnitId": 19,
        "bonusRate": 20.0
    },
    {
        "id": 20,
        "eventId": 2,
        "gameCharacterUnitId": 20,
        "bonusRate": 20.0
    },
    {
        "id": 21,
        "eventId": 2,
        "gameCharacterUnitId": 31,
        "bonusRate": 20.0
    },
    {
        "id": 22,
        "eventId": 2,
        "cardAttr": "cool",
        "bonusRate": 20.0
    },
    {
        "id": 23,
        "eventId": 3,
        "gameCharacterUnitId": 13,
        "cardAttr": "happy",
        "bonusRate": 50.0
    },
    {
        "id": 24,
        "eventId": 3,
        "gameCharacterUnitId": 14,
        "cardAttr": "happy",
        "bonusRate": 50.0
    },
    {
        "id": 25,
        "eventId": 3,
        "gameCharacterUnitId": 15,
        "cardAttr": "happy",
        "bonusRate": 50.0
    },
    {
        "id": 26,
        "eventId": 3,
        "gameCharacterUnitId": 16,
        "cardAttr": "happy",
        "bonusRate": 50.0
    },
    {
        "id": 27,
        "eventId": 3,
        "gameCharacterUnitId": 55,
        "cardAttr": "happy",
        "bonusRate": 50.0
    },
    {
        "id": 28,
        "eventId": 3,
        "gameCharacterUnitId": 13,
        "bonusRate": 20.0
    },
    {
        "id": 29,
        "eventId": 3,
        "gameCharacterUnitId": 14,
        "bonusRate": 20.0
    },
    {
        "id": 30,
        "eventId": 3,
        "gameCharacterUnitId": 15,
        "bonusRate": 20.0
    },
    {
        "id": 31,
        "eventId": 3,
        "gameCharacterUnitId": 16,
        "bonusRate": 20.0
    },
    {
        "id": 32,
        "eventId": 3,
        "gameCharacterUnitId": 55,
        "bonusRate": 20.0
    },
    {
        "id": 33,
        "eventId": 3,
        "cardAttr": "happy",
        "bonusRate": 20.0
    },
    {
        "id": 34,
        "eventId": 4,
        "gameCharacterUnitId": 2,
        "cardAttr": "pure",
        "bonusRate": 50.0
    },
    {
        "id": 35,
        "eventId": 4,
        "gameCharacterUnitId": 6,
        "cardAttr": "pure",
        "bonusRate": 50.0
    },
    {
        "id": 36,
        "eventId": 4,
        "gameCharacterUnitId": 14,
        "cardAttr": "pure",
        "bonusRate": 50.0
    },
    {
        "id": 37,
        "eventId": 4,
        "gameCharacterUnitId": 18,
        "cardAttr": "pure",
        "bonusRate": 50.0
    },
    {
        "id": 38,
        "eventId": 4,
        "gameCharacterUnitId": 30,
        "cardAttr": "pure",
        "bonusRate": 50.0
    },
    {
        "id": 39,
        "eventId": 4,
        "gameCharacterUnitId": 2,
        "bonusRate": 20.0
    },
    {
        "id": 40,
        "eventId": 4,
        "gameCharacterUnitId": 6,
        "bonusRate": 20.0
    },
    {
        "id": 41,
        "eventId": 4,
        "gameCharacterUnitId": 14,
        "bonusRate": 20.0
    },
    {
        "id": 42,
        "eventId": 4,
        "gameCharacterUnitId": 18,
        "bonusRate": 20.0
    },
    {
        "id": 43,
        "eventId": 4,
        "gameCharacterUnitId": 30,
        "bonusRate": 20.0
    },
    {
        "id": 44,
        "eventId": 4,
        "cardAttr": "pure",
        "bonusRate": 20.0
    },
    {
        "id": 45,
        "eventId": 5,
        "gameCharacterUnitId": 5,
        "cardAttr": "cute",
        "bonusRate": 50.0
    },
    {
        "id": 46,
        "eventId": 5,
        "gameCharacterUnitId": 6,
        "cardAttr": "cute",
        "bonusRate": 50.0
    },
    {
        "id": 47,
        "eventId": 5,
        "gameCharacterUnitId": 7,
        "cardAttr": "cute",
        "bonusRate": 50.0
    },
    {
        "id": 48,
        "eventId": 5,
        "gameCharacterUnitId": 8,
        "cardAttr": "cute",
        "bonusRate": 50.0
    },
    {
        "id": 49,
        "eventId": 5,
        "gameCharacterUnitId": 33,
        "cardAttr": "cute",
        "bonusRate": 50.0
    },
    {
        "id": 50,
        "eventId": 5,
        "gameCharacterUnitId": 5,
        "bonusRate": 20.0
    },
    {
        "id": 51,
        "eventId": 5,
        "gameCharacterUnitId": 6,
        "bonusRate": 20.0
    },
    {
        "id": 52,
        "eventId": 5,
        "gameCharacterUnitId": 7,
        "bonusRate": 20.0
    },
    {
        "id": 53,
        "eventId": 5,
        "gameCharacterUnitId": 8,
        "bonusRate": 20.0
    },
    {
        "id": 54,
        "eventId": 5,
        "gameCharacterUnitId": 33,
        "bonusRate": 20.0
    },
    {
        "id": 55,
        "eventId": 5,
        "cardAttr": "cute",
        "bonusRate": 20.0
    },
    {
        "id": 56,
        "eventId": 6,
        "gameCharacterUnitId": 9,
        "cardAttr": "cool",
        "bonusRate": 50.0
    },
    {
        "id": 57,
        "eventId": 6,
        "gameCharacterUnitId": 10,
        "cardAttr": "cool",
        "bonusRate": 50.0
    },
    {
        "id": 58,
        "eventId": 6,
        "gameCharacterUnitId": 11,
        "cardAttr": "cool",
        "bonusRate": 50.0
    },
    {
        "id": 59,
        "eventId": 6,
        "gameCharacterUnitId": 12,
        "cardAttr": "cool",
        "bonusRate": 50.0
    },
    {
        "id": 60,
        "eventId": 6,
        "gameCharacterUnitId": 49,
        "cardAttr": "cool",
        "bonusRate": 50.0
    },
    {
        "id": 61,
        "eventId": 6,
        "gameCharacterUnitId": 9,
        "bonusRate": 20.0
    },
    {
        "id": 62,
        "eventId": 6,
        "gameCharacterUnitId": 10,
        "bonusRate": 20.0
    },
    {
        "id": 63,
        "eventId": 6,
        "gameCharacterUnitId": 11,
        "bonusRate": 20.0
    },
    {
        "id": 64,
        "eventId": 6,
        "gameCharacterUnitId": 12,
        "bonusRate": 20.0
    },
    {
        "id": 65,
        "eventId": 6,
        "gameCharacterUnitId": 49,
        "bonusRate": 20.0
    },
    {
        "id": 66,
        "eventId": 6,
        "cardAttr": "cool",
        "bonusRate": 20.0
    }
]