[
    {
        "id": 1,
        "areaId": 5,
        "name": "미쿠 CD",
        "flavorText": "フレーバーテキスト:ミクのCD",
        "spawnPoint": "spawn-point1",
        "assetbundleName": "areaitem0501"
    },
    {
        "id": 2,
        "areaId": 5,
        "name": "피니 인형",
        "flavorText": "フレーバーテキスト:フェニーのぬいぐるみ",
        "spawnPoint": "spawn-point2",
        "assetbundleName": "areaitem0502"
    },
    {
        "id": 3,
        "areaId": 5,
        "name": "밤하늘 도감",
        "flavorText": "フレーバーテキスト:星空図鑑",
        "spawnPoint": "spawn-point3",
        "assetbundleName": "areaitem0503"
    },
    {
        "id": 4,
        "areaId": 5,
        "name": "시호의 베이스",
        "flavorText": "フレーバーテキスト:志歩のベース",
        "spawnPoint": "spawn-point4",
        "assetbundleName": "areaitem0504"
    },
    {
        "id": 5,
        "areaId": 7,
        "name": "아이돌 굿즈",
        "flavorText": "フレーバーテキスト:アイドルグッズ",
        "spawnPoint": "spawn-point1",
        "assetbundleName": "areaitem0701"
    },
    {
        "id": 6,
        "areaId": 7,
        "name": "하루카의 응원봉",
        "flavorText": "フレーバーテキスト:遥のペンライト",
        "spawnPoint": "spawn-point2",
        "assetbundleName": "areaitem0702"
    },
    {
        "id": 7,
        "areaId": 7,
        "name": "팬이 만든 아이리 부채",
        "flavorText": "フレーバーテキスト:光り輝くステージ",
        "spawnPoint": "spawn-point3",
        "assetbundleName": "areaitem0703"
    },
    {
        "id": 8,
        "areaId": 7,
        "name": "아이리가 준 수건",
        "flavorText": "フレーバーテキスト:愛莉がくれたタオル",
        "spawnPoint": "spawn-point4",
        "assetbundleName": "areaitem0704"
    },
    {
        "id": 9,
        "areaId": 8,
        "name": "카페 간판",
        "flavorText": "フレーバーテキスト:カフェの看板",
        "spawnPoint": "spawn-point1",
        "assetbundleName": "areaitem0801"
    },
    {
        "id": 10,
        "areaId": 8,
        "name": "오래된 DJ 세트",
        "flavorText": "フレーバーテキスト:古びたDJセット",
        "spawnPoint": "spawn-point2",
        "assetbundleName": "areaitem0802"
    },
    {
        "id": 11,
        "areaId": 8,
        "name": "켄 씨의 CD",
        "flavorText": "フレーバーテキスト:謙さんのCD",
        "spawnPoint": "spawn-point3",
        "assetbundleName": "areaitem0803"
    },
    {
        "id": 12,
        "areaId": 8,
        "name": "2개의 마이크",
        "flavorText": "フレーバーテキスト:２本のマイク",
        "spawnPoint": "spawn-point4",
        "assetbundleName": "areaitem0804"
    },
    {
        "id": 13,
        "areaId": 9,
        "name": "쇼 스타 동상",
        "flavorText": "フレーバーテキスト:ショースターの銅像",
        "spawnPoint": "spawn-point1",
        "assetbundleName": "areaitem0901"
    },
    {
        "id": 14,
        "areaId": 9,
        "name": "미니어처",
        "flavorText": "フレーバーテキスト:ミニチュア",
        "spawnPoint": "spawn-point2",
        "assetbundleName": "areaitem0902"
    },
    {
        "id": 15,
        "areaId": 9,
        "name": "노래하는 로봇",
        "flavorText": "フレーバーテキスト:歌うロボット",
        "spawnPoint": "spawn-point3",
        "assetbundleName": "areaitem0903"
    },
    {
        "id": 16,
        "areaId": 9,
        "name": "드론이 포함된 쇼 도구",
        "flavorText": "フレーバーテキスト:ドローン入りのショー道具",
        "spawnPoint": "spawn-point4",
        "assetbundleName": "areaitem0904"
    },
    {
        "id": 17,
        "areaId": 10,
        "name": "오르골",
        "flavorText": "フレーバーテキスト:オルゴール",
        "spawnPoint": "spawn-point1",
        "assetbundleName": "areaitem1001"
    },
    {
        "id": 18,
        "areaId": 10,
        "name": "어항",
        "flavorText": "フレーバーテキスト:アクアリウム",
        "spawnPoint": "spawn-point2",
        "assetbundleName": "areaitem1002"
    },
    {
        "id": 19,
        "areaId": 10,
        "name": "에나의 그림",
        "flavorText": "フレーバーテキスト:絵名の絵",
        "spawnPoint": "spawn-point3",
        "assetbundleName": "areaitem1003"
    },
    {
        "id": 20,
        "areaId": 10,
        "name": "귀여운 옷",
        "flavorText": "フレーバーテキスト:かわいい服",
        "spawnPoint": "spawn-point4",
        "assetbundleName": "areaitem1004"
    },
    {
        "id": 21,
        "areaId": 5,
        "name": "미쿠의 기타",
        "flavorText": "フレーバーテキスト:ミクのギター",
        "spawnPoint": "spawn-point5",
        "assetbundleName": "areaitem0505"
    },
    {
        "id": 22,
        "areaId": 7,
        "name": "초록색 화환",
        "flavorText": "フレーバーテキスト:緑のフラワースタンド",
        "spawnPoint": "spawn-point5",
        "assetbundleName": "areaitem0705"
    },
    {
        "id": 23,
        "areaId": 8,
        "name": "카페 핸드벨",
        "flavorText": "フレーバーテキスト:カフェのハンドベル",
        "spawnPoint": "spawn-point5",
        "assetbundleName": "areaitem0805"
    },
    {
        "id": 24,
        "areaId": 9,
        "name": "미쿠(?) 인형 탈",
        "flavorText": "フレーバーテキスト:ミク(？)のきぐるみ",
        "spawnPoint": "spawn-point5",
        "assetbundleName": "areaitem0905"
    },
    {
        "id": 25,
        "areaId": 10,
        "name": "다시 이어진 리본",
        "flavorText": "フレーバーテキスト:繋ぎなおされたリボン",
        "spawnPoint": "spawn-point5",
        "assetbundleName": "areaitem1005"
    },
    {
        "id": 26,
        "areaId": 7,
        "name": "노란색 화환",
        "flavorText": "フレーバーテキスト:黄色いフラワースタンド",
        "spawnPoint": "spawn-point6",
        "assetbundleName": "areaitem0706"
    },
    {
        "id": 27,
        "areaId": 8,
        "name": "렌의 헤드폰",
        "flavorText": "フレーバーテキスト:レンのヘッドフォン",
        "spawnPoint": "spawn-point6",
        "assetbundleName": "areaitem0806"
    },
    {
        "id": 28,
        "areaId": 5,
        "name": "루카의 베이스",
        "flavorText": "フレーバーテキスト:ルカのベース",
        "spawnPoint": "spawn-point6",
        "assetbundleName": "areaitem0506"
    },
    {
        "id": 29,
        "areaId": 9,
        "name": "단장의 쇼 스틱",
        "flavorText": "フレーバーテキスト:座長のショーステッキ",
        "spawnPoint": "spawn-point6",
        "assetbundleName": "areaitem0906"
    },
    {
        "id": 30,
        "areaId": 8,
        "name": "커피 그라인더",
        "flavorText": "フレーバーテキスト:コーヒーミル",
        "spawnPoint": "spawn-point7",
        "assetbundleName": "areaitem0807"
    },
    {
        "id": 31,
        "areaId": 5,
        "name": "천체 망원경",
        "flavorText": "フレーバーテキスト:天体望遠鏡",
        "spawnPoint": "spawn-point7",
        "assetbundleName": "areaitem0507"
    },
    {
        "id": 32,
        "areaId": 5,
        "name": "4명의 사진",
        "flavorText": "フレーバーテキスト:4人の写真",
        "spawnPoint": "spawn-point8",
        "assetbundleName": "areaitem0508"
    },
    {
        "id": 33,
        "areaId": 7,
        "name": "클로버 오브제",
        "flavorText": "フレーバーテキスト:クローバーオブジェ",
        "spawnPoint": "spawn-point7",
        "assetbundleName": "areaitem0707"
    },
    {
        "id": 34,
        "areaId": 7,
        "name": "휴대용 스피커",
        "flavorText": "フレーバーテキスト:ポータブルスピーカー",
        "spawnPoint": "spawn-point8",
        "assetbundleName": "areaitem0708"
    },
    {
        "id": 35,
        "areaId": 8,
        "name": "\"RAD WEEKEND\"의 홍보 포스터",
        "flavorText": "フレーバーテキスト:『RAD WEEKEND』のフライヤー",
        "spawnPoint": "spawn-point8",
        "assetbundleName": "areaitem0808"
    },
    {
        "id": 36,
        "areaId": 8,
        "name": "그라피티",
        "flavorText": "フレーバーテキスト:グラフィティ",
        "spawnPoint": "spawn-point9",
        "assetbundleName": "areaitem0809"
    },
    {
        "id": 37,
        "areaId": 9,
        "name": "퍼레이드 차량",
        "flavorText": "フレーバーテキスト:パレードフロート",
        "spawnPoint": "spawn-point7",
        "assetbundleName": "areaitem0907"
    },
    {
        "id": 38,
        "areaId": 9,
        "name": "쇼 플래그",
        "flavorText": "フレーバーテキスト:ショーフラッグ",
        "spawnPoint": "spawn-point8",
        "assetbundleName": "areaitem0908"
    },
    {
        "id": 39,
        "areaId": 10,
        "name": "나이트 코드 룸",
        "flavorText": "フレーバーテキスト:ナイトコードルーム",
        "spawnPoint": "spawn-point6",
        "assetbundleName": "areaitem1006"
    },
    {
        "id": 40,
        "areaId": 10,
        "name": "깨진 거울",
        "flavorText": "フレーバーテキスト:割れた鏡",
        "spawnPoint": "spawn-point7",
        "assetbundleName": "areaitem1007"
    },
    {
        "id": 41,
        "areaId": 5,
        "name": "뮤직 스피커",
        "flavorText": "フレーバーテキスト:ミュージックスピーカー",
        "spawnPoint": "spawn-point9",
        "assetbundleName": "areaitem0509"
    },
    {
        "id": 42,
        "areaId": 7,
        "name": "뮤직 스피커",
        "flavorText": "フレーバーテキスト:ミュージックスピーカー",
        "spawnPoint": "spawn-point9",
        "assetbundleName": "areaitem0709"
    },
    {
        "id": 43,
        "areaId": 8,
        "name": "뮤직 스피커",
        "flavorText": "フレーバーテキスト:ミュージックスピーカー",
        "spawnPoint": "spawn-point10",
        "assetbundleName": "areaitem0810"
    },
    {
        "id": 44,
        "areaId": 9,
        "name": "뮤직 스피커",
        "flavorText": "フレーバーテキスト:ミュージックスピーカー",
        "spawnPoint": "spawn-point9",
        "assetbundleName": "areaitem0909"
    },
    {
        "id": 45,
        "areaId": 10,
        "name": "뮤직 스피커",
        "flavorText": "フレーバーテキスト:ミュージックスピーカー",
        "spawnPoint": "spawn-point8",
        "assetbundleName": "areaitem1008"
    },
    {
        "id": 46,
        "areaId": 13,
        "name": "쿨 플라워",
        "flavorText": "フレーバーテキスト:クールフラワー",
        "spawnPoint": "spawn-point1",
        "assetbundleName": "areaitem1301"
    },
    {
        "id": 47,
        "areaId": 11,
        "name": "쿨 베리",
        "flavorText": "フレーバーテキスト:クールベリー",
        "spawnPoint": "spawn-point1",
        "assetbundleName": "areaitem1101"
    },
    {
        "id": 48,
        "areaId": 13,
        "name": "큐트 플라워",
        "flavorText": "フレーバーテキスト:キュートフラワー",
        "spawnPoint": "spawn-point2",
        "assetbundleName": "areaitem1302"
    },
    {
        "id": 49,
        "areaId": 11,
        "name": "큐트 체리",
        "flavorText": "フレーバーテキスト:キュートチェリー",
        "spawnPoint": "spawn-point2",
        "assetbundleName": "areaitem1102"
    },
    {
        "id": 50,
        "areaId": 13,
        "name": "퓨어 플라워",
        "flavorText": "フレーバーテキスト:ピュアフラワー",
        "spawnPoint": "spawn-point3",
        "assetbundleName": "areaitem1303"
    },
    {
        "id": 51,
        "areaId": 11,
        "name": "퓨어 애플",
        "flavorText": "フレーバーテキスト:ピュアアップル",
        "spawnPoint": "spawn-point3",
        "assetbundleName": "areaitem1103"
    },
    {
        "id": 52,
        "areaId": 13,
        "name": "해피 플라워",
        "flavorText": "フレーバーテキスト:ハッピーフラワー",
        "spawnPoint": "spawn-point4",
        "assetbundleName": "areaitem1304"
    },
    {
        "id": 53,
        "areaId": 11,
        "name": "해피 오렌지",
        "flavorText": "フレーバーテキスト:ハッピーオレンジ",
        "spawnPoint": "spawn-point4",
        "assetbundleName": "areaitem1104"
    },
    {
        "id": 54,
        "areaId": 13,
        "name": "미스테리어스 플라워",
        "flavorText": "フレーバーテキスト:ミステリアスフラワー",
        "spawnPoint": "spawn-point5",
        "assetbundleName": "areaitem1305"
    },
    {
        "id": 55,
        "areaId": 11,
        "name": "미스테리어스 그레이프",
        "flavorText": "フレーバーテキスト:ミステリアスグレープ",
        "spawnPoint": "spawn-point5",
        "assetbundleName": "areaitem1105"
    }
]