[
    {
        "id": 1,
        "materialExchangeSummaryId": 1,
        "seq": 10,
        "resourceBoxId": 1,
        "refreshCycle": "none",
        "costs": [
            {
                "materialExchangeId": 1,
                "costGroupId": 1,
                "seq": 1,
                "resourceType": "material",
                "resourceId": 15,
                "quantity": 300
            }
        ]
    },
    {
        "id": 2,
        "materialExchangeSummaryId": 1,
        "seq": 20,
        "resourceBoxId": 2,
        "refreshCycle": "none",
        "costs": [
            {
                "materialExchangeId": 2,
                "costGroupId": 1,
                "seq": 2,
                "resourceType": "material",
                "resourceId": 15,
                "quantity": 25
            }
        ]
    },
    {
        "id": 3,
        "materialExchangeSummaryId": 1,
        "seq": 30,
        "resourceBoxId": 3,
        "refreshCycle": "none",
        "costs": [
            {
                "materialExchangeId": 3,
                "costGroupId": 1,
                "seq": 3,
                "resourceType": "material",
                "resourceId": 15,
                "quantity": 10
            }
        ]
    },
    {
        "id": 4,
        "materialExchangeSummaryId": 1,
        "seq": 40,
        "resourceBoxId": 4,
        "refreshCycle": "none",
        "costs": [
            {
                "materialExchangeId": 4,
                "costGroupId": 1,
                "seq": 4,
                "resourceType": "material",
                "resourceId": 15,
                "quantity": 5
            }
        ]
    },
    {
        "id": 5,
        "materialExchangeSummaryId": 1,
        "seq": 50,
        "resourceBoxId": 5,
        "refreshCycle": "none",
        "costs": [
            {
                "materialExchangeId": 5,
                "costGroupId": 1,
                "seq": 5,
                "resourceType": "material",
                "resourceId": 15,
                "quantity": 50
            }
        ]
    },
    {
        "id": 6,
        "materialExchangeSummaryId": 1,
        "seq": 60,
        "resourceBoxId": 6,
        "refreshCycle": "none",
        "costs": [
            {
                "materialExchangeId": 6,
                "costGroupId": 1,
                "seq": 6,
                "resourceType": "material",
                "resourceId": 15,
                "quantity": 5
            }
        ]
    },
    {
        "id": 7,
        "materialExchangeSummaryId": 1,
        "seq": 70,
        "resourceBoxId": 7,
        "refreshCycle": "none",
        "costs": [
            {
                "materialExchangeId": 7,
                "costGroupId": 1,
                "seq": 7,
                "resourceType": "material",
                "resourceId": 15,
                "quantity": 5
            }
        ]
    },
    {
        "id": 8,
        "materialExchangeSummaryId": 1,
        "seq": 80,
        "resourceBoxId": 8,
        "refreshCycle": "none",
        "costs": [
            {
                "materialExchangeId": 8,
                "costGroupId": 1,
                "seq": 8,
                "resourceType": "material",
                "resourceId": 15,
                "quantity": 5
            }
        ]
    },
    {
        "id": 9,
        "materialExchangeSummaryId": 1,
        "seq": 90,
        "resourceBoxId": 9,
        "refreshCycle": "none",
        "costs": [
            {
                "materialExchangeId": 9,
                "costGroupId": 1,
                "seq": 9,
                "resourceType": "material",
                "resourceId": 15,
                "quantity": 5
            }
        ]
    },
    {
        "id": 10,
        "materialExchangeSummaryId": 1,
        "seq": 100,
        "resourceBoxId": 10,
        "refreshCycle": "none",
        "costs": [
            {
                "materialExchangeId": 10,
                "costGroupId": 1,
                "seq": 10,
                "resourceType": "material",
                "resourceId": 15,
                "quantity": 5
            }
        ]
    },
    {
        "id": 11,
        "materialExchangeSummaryId": 1,
        "seq": 110,
        "resourceBoxId": 11,
        "refreshCycle": "none",
        "costs": [
            {
                "materialExchangeId": 11,
                "costGroupId": 1,
                "seq": 11,
                "resourceType": "material",
                "resourceId": 15,
                "quantity": 5
            }
        ]
    },
    {
        "id": 12,
        "materialExchangeSummaryId": 1,
        "seq": 120,
        "resourceBoxId": 12,
        "refreshCycle": "none",
        "costs": [
            {
                "materialExchangeId": 12,
                "costGroupId": 1,
                "seq": 12,
                "resourceType": "material",
                "resourceId": 15,
                "quantity": 5
            }
        ]
    },
    {
        "id": 13,
        "materialExchangeSummaryId": 1,
        "seq": 130,
        "resourceBoxId": 13,
        "refreshCycle": "none",
        "costs": [
            {
                "materialExchangeId": 13,
                "costGroupId": 1,
                "seq": 13,
                "resourceType": "material",
                "resourceId": 15,
                "quantity": 5
            }
        ]
    },
    {
        "id": 14,
        "materialExchangeSummaryId": 1,
        "seq": 140,
        "resourceBoxId": 14,
        "refreshCycle": "none",
        "costs": [
            {
                "materialExchangeId": 14,
                "costGroupId": 1,
                "seq": 14,
                "resourceType": "material",
                "resourceId": 15,
                "quantity": 5
            }
        ]
    },
    {
        "id": 15,
        "materialExchangeSummaryId": 1,
        "seq": 150,
        "resourceBoxId": 15,
        "refreshCycle": "none",
        "costs": [
            {
                "materialExchangeId": 15,
                "costGroupId": 1,
                "seq": 15,
                "resourceType": "material",
                "resourceId": 15,
                "quantity": 5
            }
        ]
    },
    {
        "id": 16,
        "materialExchangeSummaryId": 1,
        "seq": 160,
        "resourceBoxId": 16,
        "refreshCycle": "none",
        "costs": [
            {
                "materialExchangeId": 16,
                "costGroupId": 1,
                "seq": 16,
                "resourceType": "material",
                "resourceId": 15,
                "quantity": 5
            }
        ]
    },
    {
        "id": 17,
        "materialExchangeSummaryId": 2,
        "seq": 70,
        "resourceBoxId": 20001,
        "refreshCycle": "none",
        "costs": [
            {
                "materialExchangeId": 17,
                "costGroupId": 1,
                "seq": 1,
                "resourceType": "material",
                "resourceId": 45,
                "quantity": 1
            }
        ]
    },
    {
        "id": 18,
        "materialExchangeSummaryId": 2,
        "seq": 80,
        "resourceBoxId": 20002,
        "refreshCycle": "none",
        "costs": [
            {
                "materialExchangeId": 18,
                "costGroupId": 1,
                "seq": 2,
                "resourceType": "material",
                "resourceId": 45,
                "quantity": 1
            }
        ]
    },
    {
        "id": 19,
        "materialExchangeSummaryId": 2,
        "seq": 90,
        "resourceBoxId": 20003,
        "refreshCycle": "none",
        "costs": [
            {
                "materialExchangeId": 19,
                "costGroupId": 1,
                "seq": 3,
                "resourceType": "material",
                "resourceId": 45,
                "quantity": 1
            }
        ]
    },
    {
        "id": 20,
        "materialExchangeSummaryId": 2,
        "seq": 100,
        "resourceBoxId": 20004,
        "refreshCycle": "none",
        "costs": [
            {
                "materialExchangeId": 20,
                "costGroupId": 1,
                "seq": 4,
                "resourceType": "material",
                "resourceId": 45,
                "quantity": 1
            }
        ]
    },
    {
        "id": 21,
        "materialExchangeSummaryId": 2,
        "seq": 110,
        "resourceBoxId": 20005,
        "refreshCycle": "none",
        "costs": [
            {
                "materialExchangeId": 21,
                "costGroupId": 1,
                "seq": 5,
                "resourceType": "material",
                "resourceId": 45,
                "quantity": 1
            }
        ]
    },
    {
        "id": 22,
        "materialExchangeSummaryId": 2,
        "seq": 120,
        "resourceBoxId": 20006,
        "refreshCycle": "none",
        "costs": [
            {
                "materialExchangeId": 22,
                "costGroupId": 1,
                "seq": 6,
                "resourceType": "material",
                "resourceId": 45,
                "quantity": 1
            }
        ]
    },
    {
        "id": 23,
        "materialExchangeSummaryId": 2,
        "seq": 130,
        "resourceBoxId": 20007,
        "refreshCycle": "none",
        "costs": [
            {
                "materialExchangeId": 23,
                "costGroupId": 1,
                "seq": 7,
                "resourceType": "material",
                "resourceId": 45,
                "quantity": 1
            }
        ]
    },
    {
        "id": 24,
        "materialExchangeSummaryId": 2,
        "seq": 140,
        "resourceBoxId": 20008,
        "refreshCycle": "none",
        "costs": [
            {
                "materialExchangeId": 24,
                "costGroupId": 1,
                "seq": 8,
                "resourceType": "material",
                "resourceId": 45,
                "quantity": 1
            }
        ]
    },
    {
        "id": 25,
        "materialExchangeSummaryId": 2,
        "seq": 150,
        "resourceBoxId": 20009,
        "refreshCycle": "none",
        "costs": [
            {
                "materialExchangeId": 25,
                "costGroupId": 1,
                "seq": 9,
                "resourceType": "material",
                "resourceId": 45,
                "quantity": 1
            }
        ]
    },
    {
        "id": 26,
        "materialExchangeSummaryId": 2,
        "seq": 160,
        "resourceBoxId": 20010,
        "refreshCycle": "none",
        "costs": [
            {
                "materialExchangeId": 26,
                "costGroupId": 1,
                "seq": 10,
                "resourceType": "material",
                "resourceId": 45,
                "quantity": 1
            }
        ]
    },
    {
        "id": 27,
        "materialExchangeSummaryId": 2,
        "seq": 170,
        "resourceBoxId": 20011,
        "refreshCycle": "none",
        "costs": [
            {
                "materialExchangeId": 27,
                "costGroupId": 1,
                "seq": 11,
                "resourceType": "material",
                "resourceId": 45,
                "quantity": 1
            }
        ]
    },
    {
        "id": 28,
        "materialExchangeSummaryId": 2,
        "seq": 180,
        "resourceBoxId": 20012,
        "refreshCycle": "none",
        "costs": [
            {
                "materialExchangeId": 28,
                "costGroupId": 1,
                "seq": 12,
                "resourceType": "material",
                "resourceId": 45,
                "quantity": 1
            }
        ]
    },
    {
        "id": 29,
        "materialExchangeSummaryId": 2,
        "seq": 190,
        "resourceBoxId": 20013,
        "refreshCycle": "none",
        "costs": [
            {
                "materialExchangeId": 29,
                "costGroupId": 1,
                "seq": 13,
                "resourceType": "material",
                "resourceId": 45,
                "quantity": 1
            }
        ]
    },
    {
        "id": 30,
        "materialExchangeSummaryId": 2,
        "seq": 200,
        "resourceBoxId": 20014,
        "refreshCycle": "none",
        "costs": [
            {
                "materialExchangeId": 30,
                "costGroupId": 1,
                "seq": 14,
                "resourceType": "material",
                "resourceId": 45,
                "quantity": 1
            }
        ]
    },
    {
        "id": 31,
        "materialExchangeSummaryId": 2,
        "seq": 210,
        "resourceBoxId": 20015,
        "refreshCycle": "none",
        "costs": [
            {
                "materialExchangeId": 31,
                "costGroupId": 1,
                "seq": 15,
                "resourceType": "material",
                "resourceId": 45,
                "quantity": 1
            }
        ]
    },
    {
        "id": 32,
        "materialExchangeSummaryId": 2,
        "seq": 220,
        "resourceBoxId": 20016,
        "refreshCycle": "none",
        "costs": [
            {
                "materialExchangeId": 32,
                "costGroupId": 1,
                "seq": 16,
                "resourceType": "material",
                "resourceId": 45,
                "quantity": 1
            }
        ]
    },
    {
        "id": 33,
        "materialExchangeSummaryId": 2,
        "seq": 230,
        "resourceBoxId": 20017,
        "refreshCycle": "none",
        "costs": [
            {
                "materialExchangeId": 33,
                "costGroupId": 1,
                "seq": 17,
                "resourceType": "material",
                "resourceId": 45,
                "quantity": 1
            }
        ]
    },
    {
        "id": 34,
        "materialExchangeSummaryId": 2,
        "seq": 240,
        "resourceBoxId": 20018,
        "refreshCycle": "none",
        "costs": [
            {
                "materialExchangeId": 34,
                "costGroupId": 1,
                "seq": 18,
                "resourceType": "material",
                "resourceId": 45,
                "quantity": 1
            }
        ]
    },
    {
        "id": 35,
        "materialExchangeSummaryId": 2,
        "seq": 250,
        "resourceBoxId": 20019,
        "refreshCycle": "none",
        "costs": [
            {
                "materialExchangeId": 35,
                "costGroupId": 1,
                "seq": 19,
                "resourceType": "material",
                "resourceId": 45,
                "quantity": 1
            }
        ]
    },
    {
        "id": 36,
        "materialExchangeSummaryId": 2,
        "seq": 260,
        "resourceBoxId": 20020,
        "refreshCycle": "none",
        "costs": [
            {
                "materialExchangeId": 36,
                "costGroupId": 1,
                "seq": 20,
                "resourceType": "material",
                "resourceId": 45,
                "quantity": 1
            }
        ]
    },
    {
        "id": 37,
        "materialExchangeSummaryId": 2,
        "seq": 10,
        "resourceBoxId": 20021,
        "refreshCycle": "none",
        "costs": [
            {
                "materialExchangeId": 37,
                "costGroupId": 1,
                "seq": 21,
                "resourceType": "material",
                "resourceId": 45,
                "quantity": 1
            }
        ]
    },
    {
        "id": 38,
        "materialExchangeSummaryId": 2,
        "seq": 20,
        "resourceBoxId": 20022,
        "refreshCycle": "none",
        "costs": [
            {
                "materialExchangeId": 38,
                "costGroupId": 1,
                "seq": 22,
                "resourceType": "material",
                "resourceId": 45,
                "quantity": 1
            }
        ]
    },
    {
        "id": 39,
        "materialExchangeSummaryId": 2,
        "seq": 30,
        "resourceBoxId": 20023,
        "refreshCycle": "none",
        "costs": [
            {
                "materialExchangeId": 39,
                "costGroupId": 1,
                "seq": 23,
                "resourceType": "material",
                "resourceId": 45,
                "quantity": 1
            }
        ]
    },
    {
        "id": 40,
        "materialExchangeSummaryId": 2,
        "seq": 40,
        "resourceBoxId": 20024,
        "refreshCycle": "none",
        "costs": [
            {
                "materialExchangeId": 40,
                "costGroupId": 1,
                "seq": 24,
                "resourceType": "material",
                "resourceId": 45,
                "quantity": 1
            }
        ]
    },
    {
        "id": 41,
        "materialExchangeSummaryId": 2,
        "seq": 50,
        "resourceBoxId": 20025,
        "refreshCycle": "none",
        "costs": [
            {
                "materialExchangeId": 41,
                "costGroupId": 1,
                "seq": 25,
                "resourceType": "material",
                "resourceId": 45,
                "quantity": 1
            }
        ]
    },
    {
        "id": 42,
        "materialExchangeSummaryId": 2,
        "seq": 60,
        "resourceBoxId": 20026,
        "refreshCycle": "none",
        "costs": [
            {
                "materialExchangeId": 42,
                "costGroupId": 1,
                "seq": 26,
                "resourceType": "material",
                "resourceId": 45,
                "quantity": 1
            }
        ]
    },
    {
        "id": 30001,
        "materialExchangeSummaryId": 3,
        "seq": 10,
        "resourceBoxId": 30001,
        "refreshCycle": "none",
        "costs": [
            {
                "materialExchangeId": 30001,
                "costGroupId": 1,
                "seq": 1,
                "resourceType": "material",
                "resourceId": 46,
                "quantity": 1
            }
        ]
    },
    {
        "id": 30002,
        "materialExchangeSummaryId": 3,
        "seq": 20,
        "resourceBoxId": 30002,
        "refreshCycle": "none",
        "costs": [
            {
                "materialExchangeId": 30002,
                "costGroupId": 1,
                "seq": 2,
                "resourceType": "material",
                "resourceId": 46,
                "quantity": 1
            }
        ]
    },
    {
        "id": 30003,
        "materialExchangeSummaryId": 3,
        "seq": 30,
        "resourceBoxId": 30003,
        "refreshCycle": "none",
        "costs": [
            {
                "materialExchangeId": 30003,
                "costGroupId": 1,
                "seq": 3,
                "resourceType": "material",
                "resourceId": 46,
                "quantity": 1
            }
        ]
    },
    {
        "id": 30004,
        "materialExchangeSummaryId": 3,
        "seq": 40,
        "resourceBoxId": 30004,
        "refreshCycle": "none",
        "costs": [
            {
                "materialExchangeId": 30004,
                "costGroupId": 1,
                "seq": 4,
                "resourceType": "material",
                "resourceId": 46,
                "quantity": 1
            }
        ]
    },
    {
        "id": 40001,
        "materialExchangeSummaryId": 4,
        "seq": 10,
        "resourceBoxId": 40001,
        "refreshCycle": "none",
        "costs": [
            {
                "materialExchangeId": 40001,
                "costGroupId": 1,
                "seq": 1,
                "resourceType": "material",
                "resourceId": 49,
                "quantity": 1
            }
        ]
    },
    {
        "id": 40002,
        "materialExchangeSummaryId": 4,
        "seq": 20,
        "resourceBoxId": 40002,
        "refreshCycle": "none",
        "costs": [
            {
                "materialExchangeId": 40002,
                "costGroupId": 1,
                "seq": 1,
                "resourceType": "material",
                "resourceId": 49,
                "quantity": 1
            }
        ]
    },
    {
        "id": 40003,
        "materialExchangeSummaryId": 4,
        "seq": 30,
        "resourceBoxId": 40003,
        "refreshCycle": "none",
        "costs": [
            {
                "materialExchangeId": 40003,
                "costGroupId": 1,
                "seq": 1,
                "resourceType": "material",
                "resourceId": 49,
                "quantity": 1
            }
        ]
    },
    {
        "id": 40004,
        "materialExchangeSummaryId": 4,
        "seq": 40,
        "resourceBoxId": 40004,
        "refreshCycle": "none",
        "costs": [
            {
                "materialExchangeId": 40004,
                "costGroupId": 1,
                "seq": 1,
                "resourceType": "material",
                "resourceId": 49,
                "quantity": 1
            }
        ]
    },
    {
        "id": 40005,
        "materialExchangeSummaryId": 4,
        "seq": 50,
        "resourceBoxId": 40005,
        "refreshCycle": "none",
        "costs": [
            {
                "materialExchangeId": 40005,
                "costGroupId": 1,
                "seq": 1,
                "resourceType": "material",
                "resourceId": 49,
                "quantity": 1
            }
        ]
    },
    {
        "id": 40006,
        "materialExchangeSummaryId": 4,
        "seq": 60,
        "resourceBoxId": 40006,
        "refreshCycle": "none",
        "costs": [
            {
                "materialExchangeId": 40006,
                "costGroupId": 1,
                "seq": 1,
                "resourceType": "material",
                "resourceId": 49,
                "quantity": 1
            }
        ]
    },
    {
        "id": 40007,
        "materialExchangeSummaryId": 4,
        "seq": 70,
        "resourceBoxId": 40007,
        "refreshCycle": "none",
        "costs": [
            {
                "materialExchangeId": 40007,
                "costGroupId": 1,
                "seq": 1,
                "resourceType": "material",
                "resourceId": 50,
                "quantity": 1
            },
            {
                "materialExchangeId": 40007,
                "costGroupId": 2,
                "seq": 1,
                "resourceType": "material",
                "resourceId": 49,
                "quantity": 1
            }
        ]
    },
    {
        "id": 40008,
        "materialExchangeSummaryId": 4,
        "seq": 80,
        "resourceBoxId": 40008,
        "refreshCycle": "none",
        "costs": [
            {
                "materialExchangeId": 40008,
                "costGroupId": 1,
                "seq": 1,
                "resourceType": "material",
                "resourceId": 50,
                "quantity": 1
            },
            {
                "materialExchangeId": 40008,
                "costGroupId": 2,
                "seq": 1,
                "resourceType": "material",
                "resourceId": 49,
                "quantity": 1
            }
        ]
    },
    {
        "id": 40009,
        "materialExchangeSummaryId": 4,
        "seq": 90,
        "resourceBoxId": 40009,
        "refreshCycle": "none",
        "costs": [
            {
                "materialExchangeId": 40009,
                "costGroupId": 1,
                "seq": 1,
                "resourceType": "material",
                "resourceId": 50,
                "quantity": 1
            },
            {
                "materialExchangeId": 40009,
                "costGroupId": 2,
                "seq": 1,
                "resourceType": "material",
                "resourceId": 49,
                "quantity": 1
            }
        ]
    },
    {
        "id": 40010,
        "materialExchangeSummaryId": 4,
        "seq": 100,
        "resourceBoxId": 40010,
        "refreshCycle": "none",
        "costs": [
            {
                "materialExchangeId": 40010,
                "costGroupId": 1,
                "seq": 1,
                "resourceType": "material",
                "resourceId": 50,
                "quantity": 1
            },
            {
                "materialExchangeId": 40010,
                "costGroupId": 2,
                "seq": 1,
                "resourceType": "material",
                "resourceId": 49,
                "quantity": 1
            }
        ]
    },
    {
        "id": 40011,
        "materialExchangeSummaryId": 4,
        "seq": 110,
        "resourceBoxId": 40011,
        "refreshCycle": "none",
        "costs": [
            {
                "materialExchangeId": 40011,
                "costGroupId": 1,
                "seq": 1,
                "resourceType": "material",
                "resourceId": 51,
                "quantity": 1
            },
            {
                "materialExchangeId": 40011,
                "costGroupId": 2,
                "seq": 1,
                "resourceType": "material",
                "resourceId": 49,
                "quantity": 1
            }
        ]
    },
    {
        "id": 40012,
        "materialExchangeSummaryId": 4,
        "seq": 120,
        "resourceBoxId": 40012,
        "refreshCycle": "none",
        "costs": [
            {
                "materialExchangeId": 40012,
                "costGroupId": 1,
                "seq": 1,
                "resourceType": "material",
                "resourceId": 51,
                "quantity": 1
            },
            {
                "materialExchangeId": 40012,
                "costGroupId": 2,
                "seq": 1,
                "resourceType": "material",
                "resourceId": 49,
                "quantity": 1
            }
        ]
    },
    {
        "id": 40013,
        "materialExchangeSummaryId": 4,
        "seq": 130,
        "resourceBoxId": 40013,
        "refreshCycle": "none",
        "costs": [
            {
                "materialExchangeId": 40013,
                "costGroupId": 1,
                "seq": 1,
                "resourceType": "material",
                "resourceId": 51,
                "quantity": 1
            },
            {
                "materialExchangeId": 40013,
                "costGroupId": 2,
                "seq": 1,
                "resourceType": "material",
                "resourceId": 49,
                "quantity": 1
            }
        ]
    },
    {
        "id": 40014,
        "materialExchangeSummaryId": 4,
        "seq": 140,
        "resourceBoxId": 40014,
        "refreshCycle": "none",
        "costs": [
            {
                "materialExchangeId": 40014,
                "costGroupId": 1,
                "seq": 1,
                "resourceType": "material",
                "resourceId": 51,
                "quantity": 1
            },
            {
                "materialExchangeId": 40014,
                "costGroupId": 2,
                "seq": 1,
                "resourceType": "material",
                "resourceId": 49,
                "quantity": 1
            }
        ]
    },
    {
        "id": 40015,
        "materialExchangeSummaryId": 4,
        "seq": 150,
        "resourceBoxId": 40015,
        "refreshCycle": "none",
        "costs": [
            {
                "materialExchangeId": 40015,
                "costGroupId": 1,
                "seq": 1,
                "resourceType": "material",
                "resourceId": 52,
                "quantity": 1
            },
            {
                "materialExchangeId": 40015,
                "costGroupId": 2,
                "seq": 1,
                "resourceType": "material",
                "resourceId": 49,
                "quantity": 1
            }
        ]
    },
    {
        "id": 40016,
        "materialExchangeSummaryId": 4,
        "seq": 160,
        "resourceBoxId": 40016,
        "refreshCycle": "none",
        "costs": [
            {
                "materialExchangeId": 40016,
                "costGroupId": 1,
                "seq": 1,
                "resourceType": "material",
                "resourceId": 52,
                "quantity": 1
            },
            {
                "materialExchangeId": 40016,
                "costGroupId": 2,
                "seq": 1,
                "resourceType": "material",
                "resourceId": 49,
                "quantity": 1
            }
        ]
    },
    {
        "id": 40017,
        "materialExchangeSummaryId": 4,
        "seq": 170,
        "resourceBoxId": 40017,
        "refreshCycle": "none",
        "costs": [
            {
                "materialExchangeId": 40017,
                "costGroupId": 1,
                "seq": 1,
                "resourceType": "material",
                "resourceId": 52,
                "quantity": 1
            },
            {
                "materialExchangeId": 40017,
                "costGroupId": 2,
                "seq": 1,
                "resourceType": "material",
                "resourceId": 49,
                "quantity": 1
            }
        ]
    },
    {
        "id": 40018,
        "materialExchangeSummaryId": 4,
        "seq": 180,
        "resourceBoxId": 40018,
        "refreshCycle": "none",
        "costs": [
            {
                "materialExchangeId": 40018,
                "costGroupId": 1,
                "seq": 1,
                "resourceType": "material",
                "resourceId": 52,
                "quantity": 1
            },
            {
                "materialExchangeId": 40018,
                "costGroupId": 2,
                "seq": 1,
                "resourceType": "material",
                "resourceId": 49,
                "quantity": 1
            }
        ]
    },
    {
        "id": 40019,
        "materialExchangeSummaryId": 4,
        "seq": 190,
        "resourceBoxId": 40019,
        "refreshCycle": "none",
        "costs": [
            {
                "materialExchangeId": 40019,
                "costGroupId": 1,
                "seq": 1,
                "resourceType": "material",
                "resourceId": 53,
                "quantity": 1
            },
            {
                "materialExchangeId": 40019,
                "costGroupId": 2,
                "seq": 1,
                "resourceType": "material",
                "resourceId": 49,
                "quantity": 1
            }
        ]
    },
    {
        "id": 40020,
        "materialExchangeSummaryId": 4,
        "seq": 200,
        "resourceBoxId": 40020,
        "refreshCycle": "none",
        "costs": [
            {
                "materialExchangeId": 40020,
                "costGroupId": 1,
                "seq": 1,
                "resourceType": "material",
                "resourceId": 53,
                "quantity": 1
            },
            {
                "materialExchangeId": 40020,
                "costGroupId": 2,
                "seq": 1,
                "resourceType": "material",
                "resourceId": 49,
                "quantity": 1
            }
        ]
    },
    {
        "id": 40021,
        "materialExchangeSummaryId": 4,
        "seq": 210,
        "resourceBoxId": 40021,
        "refreshCycle": "none",
        "costs": [
            {
                "materialExchangeId": 40021,
                "costGroupId": 1,
                "seq": 1,
                "resourceType": "material",
                "resourceId": 53,
                "quantity": 1
            },
            {
                "materialExchangeId": 40021,
                "costGroupId": 2,
                "seq": 1,
                "resourceType": "material",
                "resourceId": 49,
                "quantity": 1
            }
        ]
    },
    {
        "id": 40022,
        "materialExchangeSummaryId": 4,
        "seq": 220,
        "resourceBoxId": 40022,
        "refreshCycle": "none",
        "costs": [
            {
                "materialExchangeId": 40022,
                "costGroupId": 1,
                "seq": 1,
                "resourceType": "material",
                "resourceId": 53,
                "quantity": 1
            },
            {
                "materialExchangeId": 40022,
                "costGroupId": 2,
                "seq": 1,
                "resourceType": "material",
                "resourceId": 49,
                "quantity": 1
            }
        ]
    },
    {
        "id": 40023,
        "materialExchangeSummaryId": 4,
        "seq": 230,
        "resourceBoxId": 40023,
        "refreshCycle": "none",
        "costs": [
            {
                "materialExchangeId": 40023,
                "costGroupId": 1,
                "seq": 1,
                "resourceType": "material",
                "resourceId": 54,
                "quantity": 1
            },
            {
                "materialExchangeId": 40023,
                "costGroupId": 2,
                "seq": 1,
                "resourceType": "material",
                "resourceId": 49,
                "quantity": 1
            }
        ]
    },
    {
        "id": 40024,
        "materialExchangeSummaryId": 4,
        "seq": 240,
        "resourceBoxId": 40024,
        "refreshCycle": "none",
        "costs": [
            {
                "materialExchangeId": 40024,
                "costGroupId": 1,
                "seq": 1,
                "resourceType": "material",
                "resourceId": 54,
                "quantity": 1
            },
            {
                "materialExchangeId": 40024,
                "costGroupId": 2,
                "seq": 1,
                "resourceType": "material",
                "resourceId": 49,
                "quantity": 1
            }
        ]
    },
    {
        "id": 40025,
        "materialExchangeSummaryId": 4,
        "seq": 250,
        "resourceBoxId": 40025,
        "refreshCycle": "none",
        "costs": [
            {
                "materialExchangeId": 40025,
                "costGroupId": 1,
                "seq": 1,
                "resourceType": "material",
                "resourceId": 54,
                "quantity": 1
            },
            {
                "materialExchangeId": 40025,
                "costGroupId": 2,
                "seq": 1,
                "resourceType": "material",
                "resourceId": 49,
                "quantity": 1
            }
        ]
    },
    {
        "id": 40026,
        "materialExchangeSummaryId": 4,
        "seq": 260,
        "resourceBoxId": 40026,
        "refreshCycle": "none",
        "costs": [
            {
                "materialExchangeId": 40026,
                "costGroupId": 1,
                "seq": 1,
                "resourceType": "material",
                "resourceId": 54,
                "quantity": 1
            },
            {
                "materialExchangeId": 40026,
                "costGroupId": 2,
                "seq": 1,
                "resourceType": "material",
                "resourceId": 49,
                "quantity": 1
            }
        ]
    }
]