[
    {
        "id": 1,
        "name": "퓨어 1",
        "fontName": "FOT-RodinNTLGPro-DB",
        "assetbundleName": "custom_profile/font"
    },
    {
        "id": 2,
        "name": "퓨어 2",
        "fontName": "FOT-SkipProN-B",
        "assetbundleName": "custom_profile/font"
    },
    {
        "id": 3,
        "name": "해피 1",
        "fontName": "FOT-PopHappinessStd-EB",
        "assetbundleName": "custom_profile/font"
    }
]