[
    {
        "id": 1,
        "virtualLiveType": "beginner",
        "resourceType": "jewel",
        "fromCost": 100,
        "toCost": 299,
        "assetbundleName": "small",
        "messageLengthLimit": 8,
        "displaySec": 1,
        "messageSize": "small",
        "colorCode": "#ffffff",
        "virtualLiveCheerMessageDisplayLimitId": 1
    },
    {
        "id": 2,
        "virtualLiveType": "beginner",
        "resourceType": "jewel",
        "fromCost": 300,
        "toCost": 999,
        "assetbundleName": "medium",
        "messageLengthLimit": 16,
        "displaySec": 2,
        "messageSize": "medium",
        "colorCode": "#00ccbb",
        "virtualLiveCheerMessageDisplayLimitId": 2
    },
    {
        "id": 3,
        "virtualLiveType": "beginner",
        "resourceType": "jewel",
        "fromCost": 1000,
        "toCost": 1999,
        "assetbundleName": "large",
        "messageLengthLimit": 24,
        "displaySec": 3,
        "messageSize": "large",
        "colorCode": "#ffbb00",
        "virtualLiveCheerMessageDisplayLimitId": 3
    },
    {
        "id": 4,
        "virtualLiveType": "beginner",
        "resourceType": "jewel",
        "fromCost": 3000,
        "toCost": 50000,
        "assetbundleName": "xx_large",
        "messageLengthLimit": 64,
        "displaySec": 10,
        "messageSize": "xx_large",
        "colorCode": "#ff55aa",
        "virtualLiveCheerMessageDisplayLimitId": 4
    },
    {
        "id": 5,
        "virtualLiveType": "beginner",
        "resourceType": "virtual_coin",
        "fromCost": 100,
        "toCost": 999,
        "assetbundleName": "small",
        "messageLengthLimit": 8,
        "displaySec": 1,
        "messageSize": "small",
        "colorCode": "#ffffff",
        "virtualLiveCheerMessageDisplayLimitId": 1
    },
    {
        "id": 6,
        "virtualLiveType": "beginner",
        "resourceType": "virtual_coin",
        "fromCost": 1000,
        "toCost": 2999,
        "assetbundleName": "medium",
        "messageLengthLimit": 16,
        "displaySec": 2,
        "messageSize": "medium",
        "colorCode": "#00ccbb",
        "virtualLiveCheerMessageDisplayLimitId": 2
    },
    {
        "id": 7,
        "virtualLiveType": "beginner",
        "resourceType": "virtual_coin",
        "fromCost": 3000,
        "toCost": 4999,
        "assetbundleName": "large",
        "messageLengthLimit": 24,
        "displaySec": 3,
        "messageSize": "large",
        "colorCode": "#ffbb00",
        "virtualLiveCheerMessageDisplayLimitId": 3
    },
    {
        "id": 8,
        "virtualLiveType": "beginner",
        "resourceType": "virtual_coin",
        "fromCost": 10000,
        "toCost": 50000,
        "assetbundleName": "xx_large",
        "messageLengthLimit": 64,
        "displaySec": 10,
        "messageSize": "xx_large",
        "colorCode": "#ff55aa",
        "virtualLiveCheerMessageDisplayLimitId": 4
    },
    {
        "id": 9,
        "virtualLiveType": "normal",
        "resourceType": "jewel",
        "fromCost": 100,
        "toCost": 299,
        "assetbundleName": "small",
        "messageLengthLimit": 8,
        "displaySec": 1,
        "messageSize": "small",
        "colorCode": "#ffffff",
        "virtualLiveCheerMessageDisplayLimitId": 1
    },
    {
        "id": 10,
        "virtualLiveType": "normal",
        "resourceType": "jewel",
        "fromCost": 300,
        "toCost": 999,
        "assetbundleName": "medium",
        "messageLengthLimit": 16,
        "displaySec": 2,
        "messageSize": "medium",
        "colorCode": "#00ccbb",
        "virtualLiveCheerMessageDisplayLimitId": 2
    },
    {
        "id": 11,
        "virtualLiveType": "normal",
        "resourceType": "jewel",
        "fromCost": 1000,
        "toCost": 1999,
        "assetbundleName": "large",
        "messageLengthLimit": 24,
        "displaySec": 3,
        "messageSize": "large",
        "colorCode": "#ffbb00",
        "virtualLiveCheerMessageDisplayLimitId": 3
    },
    {
        "id": 12,
        "virtualLiveType": "normal",
        "resourceType": "jewel",
        "fromCost": 3000,
        "toCost": 50000,
        "assetbundleName": "xx_large",
        "messageLengthLimit": 64,
        "displaySec": 10,
        "messageSize": "xx_large",
        "colorCode": "#ff55aa",
        "virtualLiveCheerMessageDisplayLimitId": 4
    },
    {
        "id": 13,
        "virtualLiveType": "normal",
        "resourceType": "virtual_coin",
        "fromCost": 100,
        "toCost": 999,
        "assetbundleName": "small",
        "messageLengthLimit": 8,
        "displaySec": 1,
        "messageSize": "small",
        "colorCode": "#ffffff",
        "virtualLiveCheerMessageDisplayLimitId": 1
    },
    {
        "id": 14,
        "virtualLiveType": "normal",
        "resourceType": "virtual_coin",
        "fromCost": 1000,
        "toCost": 2999,
        "assetbundleName": "medium",
        "messageLengthLimit": 16,
        "displaySec": 2,
        "messageSize": "medium",
        "colorCode": "#00ccbb",
        "virtualLiveCheerMessageDisplayLimitId": 2
    },
    {
        "id": 15,
        "virtualLiveType": "normal",
        "resourceType": "virtual_coin",
        "fromCost": 3000,
        "toCost": 4999,
        "assetbundleName": "large",
        "messageLengthLimit": 24,
        "displaySec": 3,
        "messageSize": "large",
        "colorCode": "#ffbb00",
        "virtualLiveCheerMessageDisplayLimitId": 3
    },
    {
        "id": 16,
        "virtualLiveType": "normal",
        "resourceType": "virtual_coin",
        "fromCost": 10000,
        "toCost": 50000,
        "assetbundleName": "xx_large",
        "messageLengthLimit": 64,
        "displaySec": 10,
        "messageSize": "xx_large",
        "colorCode": "#ff55aa",
        "virtualLiveCheerMessageDisplayLimitId": 4
    },
    {
        "id": 17,
        "virtualLiveType": "archive",
        "resourceType": "jewel",
        "fromCost": 100,
        "toCost": 299,
        "assetbundleName": "small",
        "messageLengthLimit": 8,
        "displaySec": 1,
        "messageSize": "small",
        "colorCode": "#ffffff",
        "virtualLiveCheerMessageDisplayLimitId": 1
    },
    {
        "id": 18,
        "virtualLiveType": "archive",
        "resourceType": "jewel",
        "fromCost": 300,
        "toCost": 999,
        "assetbundleName": "medium",
        "messageLengthLimit": 16,
        "displaySec": 2,
        "messageSize": "medium",
        "colorCode": "#00ccbb",
        "virtualLiveCheerMessageDisplayLimitId": 2
    },
    {
        "id": 19,
        "virtualLiveType": "archive",
        "resourceType": "jewel",
        "fromCost": 1000,
        "toCost": 1999,
        "assetbundleName": "large",
        "messageLengthLimit": 24,
        "displaySec": 3,
        "messageSize": "large",
        "colorCode": "#ffbb00",
        "virtualLiveCheerMessageDisplayLimitId": 3
    },
    {
        "id": 20,
        "virtualLiveType": "archive",
        "resourceType": "jewel",
        "fromCost": 3000,
        "toCost": 50000,
        "assetbundleName": "xx_large",
        "messageLengthLimit": 64,
        "displaySec": 10,
        "messageSize": "xx_large",
        "colorCode": "#ff55aa",
        "virtualLiveCheerMessageDisplayLimitId": 4
    },
    {
        "id": 21,
        "virtualLiveType": "archive",
        "resourceType": "virtual_coin",
        "fromCost": 100,
        "toCost": 999,
        "assetbundleName": "small",
        "messageLengthLimit": 8,
        "displaySec": 1,
        "messageSize": "small",
        "colorCode": "#ffffff",
        "virtualLiveCheerMessageDisplayLimitId": 1
    },
    {
        "id": 22,
        "virtualLiveType": "archive",
        "resourceType": "virtual_coin",
        "fromCost": 1000,
        "toCost": 2999,
        "assetbundleName": "medium",
        "messageLengthLimit": 16,
        "displaySec": 2,
        "messageSize": "medium",
        "colorCode": "#00ccbb",
        "virtualLiveCheerMessageDisplayLimitId": 2
    },
    {
        "id": 23,
        "virtualLiveType": "archive",
        "resourceType": "virtual_coin",
        "fromCost": 3000,
        "toCost": 4999,
        "assetbundleName": "large",
        "messageLengthLimit": 24,
        "displaySec": 3,
        "messageSize": "large",
        "colorCode": "#ffbb00",
        "virtualLiveCheerMessageDisplayLimitId": 3
    },
    {
        "id": 24,
        "virtualLiveType": "archive",
        "resourceType": "virtual_coin",
        "fromCost": 10000,
        "toCost": 50000,
        "assetbundleName": "xx_large",
        "messageLengthLimit": 64,
        "displaySec": 10,
        "messageSize": "xx_large",
        "colorCode": "#ff55aa",
        "virtualLiveCheerMessageDisplayLimitId": 4
    },
    {
        "id": 25,
        "virtualLiveType": "cheerful_carnival",
        "resourceType": "jewel",
        "fromCost": 100,
        "toCost": 299,
        "assetbundleName": "small",
        "messageLengthLimit": 8,
        "displaySec": 1,
        "messageSize": "small",
        "colorCode": "#ffffff",
        "virtualLiveCheerMessageDisplayLimitId": 1
    },
    {
        "id": 26,
        "virtualLiveType": "cheerful_carnival",
        "resourceType": "jewel",
        "fromCost": 300,
        "toCost": 999,
        "assetbundleName": "medium",
        "messageLengthLimit": 16,
        "displaySec": 2,
        "messageSize": "medium",
        "colorCode": "#00ccbb",
        "virtualLiveCheerMessageDisplayLimitId": 2
    },
    {
        "id": 27,
        "virtualLiveType": "cheerful_carnival",
        "resourceType": "jewel",
        "fromCost": 1000,
        "toCost": 1999,
        "assetbundleName": "large",
        "messageLengthLimit": 24,
        "displaySec": 3,
        "messageSize": "large",
        "colorCode": "#ffbb00",
        "virtualLiveCheerMessageDisplayLimitId": 3
    },
    {
        "id": 28,
        "virtualLiveType": "cheerful_carnival",
        "resourceType": "jewel",
        "fromCost": 3000,
        "toCost": 50000,
        "assetbundleName": "xx_large",
        "messageLengthLimit": 64,
        "displaySec": 10,
        "messageSize": "xx_large",
        "colorCode": "#ff55aa",
        "virtualLiveCheerMessageDisplayLimitId": 4
    },
    {
        "id": 29,
        "virtualLiveType": "cheerful_carnival",
        "resourceType": "virtual_coin",
        "fromCost": 100,
        "toCost": 999,
        "assetbundleName": "small",
        "messageLengthLimit": 8,
        "displaySec": 1,
        "messageSize": "small",
        "colorCode": "#ffffff",
        "virtualLiveCheerMessageDisplayLimitId": 1
    },
    {
        "id": 30,
        "virtualLiveType": "cheerful_carnival",
        "resourceType": "virtual_coin",
        "fromCost": 1000,
        "toCost": 2999,
        "assetbundleName": "medium",
        "messageLengthLimit": 16,
        "displaySec": 2,
        "messageSize": "medium",
        "colorCode": "#00ccbb",
        "virtualLiveCheerMessageDisplayLimitId": 2
    },
    {
        "id": 31,
        "virtualLiveType": "cheerful_carnival",
        "resourceType": "virtual_coin",
        "fromCost": 3000,
        "toCost": 4999,
        "assetbundleName": "large",
        "messageLengthLimit": 24,
        "displaySec": 3,
        "messageSize": "large",
        "colorCode": "#ffbb00",
        "virtualLiveCheerMessageDisplayLimitId": 3
    },
    {
        "id": 32,
        "virtualLiveType": "cheerful_carnival",
        "resourceType": "virtual_coin",
        "fromCost": 10000,
        "toCost": 50000,
        "assetbundleName": "xx_large",
        "messageLengthLimit": 64,
        "displaySec": 10,
        "messageSize": "xx_large",
        "colorCode": "#ff55aa",
        "virtualLiveCheerMessageDisplayLimitId": 4
    },
    {
        "id": 33,
        "virtualLiveType": "streaming",
        "resourceType": "jewel",
        "fromCost": 100,
        "toCost": 299,
        "assetbundleName": "small",
        "messageLengthLimit": 8,
        "displaySec": 1,
        "messageSize": "small",
        "colorCode": "#ffffff",
        "virtualLiveCheerMessageDisplayLimitId": 1
    },
    {
        "id": 34,
        "virtualLiveType": "streaming",
        "resourceType": "jewel",
        "fromCost": 300,
        "toCost": 999,
        "assetbundleName": "medium",
        "messageLengthLimit": 16,
        "displaySec": 2,
        "messageSize": "medium",
        "colorCode": "#00ccbb",
        "virtualLiveCheerMessageDisplayLimitId": 2
    },
    {
        "id": 35,
        "virtualLiveType": "streaming",
        "resourceType": "jewel",
        "fromCost": 1000,
        "toCost": 1999,
        "assetbundleName": "large",
        "messageLengthLimit": 24,
        "displaySec": 3,
        "messageSize": "large",
        "colorCode": "#ffbb00",
        "virtualLiveCheerMessageDisplayLimitId": 3
    },
    {
        "id": 36,
        "virtualLiveType": "streaming",
        "resourceType": "jewel",
        "fromCost": 3000,
        "toCost": 50000,
        "assetbundleName": "xx_large",
        "messageLengthLimit": 64,
        "displaySec": 10,
        "messageSize": "xx_large",
        "colorCode": "#ff55aa",
        "virtualLiveCheerMessageDisplayLimitId": 4
    },
    {
        "id": 37,
        "virtualLiveType": "streaming",
        "resourceType": "virtual_coin",
        "fromCost": 100,
        "toCost": 999,
        "assetbundleName": "small",
        "messageLengthLimit": 8,
        "displaySec": 1,
        "messageSize": "small",
        "colorCode": "#ffffff",
        "virtualLiveCheerMessageDisplayLimitId": 1
    },
    {
        "id": 38,
        "virtualLiveType": "streaming",
        "resourceType": "virtual_coin",
        "fromCost": 1000,
        "toCost": 2999,
        "assetbundleName": "medium",
        "messageLengthLimit": 16,
        "displaySec": 2,
        "messageSize": "medium",
        "colorCode": "#00ccbb",
        "virtualLiveCheerMessageDisplayLimitId": 2
    },
    {
        "id": 39,
        "virtualLiveType": "streaming",
        "resourceType": "virtual_coin",
        "fromCost": 3000,
        "toCost": 4999,
        "assetbundleName": "large",
        "messageLengthLimit": 24,
        "displaySec": 3,
        "messageSize": "large",
        "colorCode": "#ffbb00",
        "virtualLiveCheerMessageDisplayLimitId": 3
    },
    {
        "id": 40,
        "virtualLiveType": "streaming",
        "resourceType": "virtual_coin",
        "fromCost": 10000,
        "toCost": 50000,
        "assetbundleName": "xx_large",
        "messageLengthLimit": 64,
        "displaySec": 10,
        "messageSize": "xx_large",
        "colorCode": "#ff55aa",
        "virtualLiveCheerMessageDisplayLimitId": 4
    },
    {
        "id": 41,
        "virtualLiveType": "beginner",
        "resourceType": "jewel",
        "fromCost": 2000,
        "toCost": 2999,
        "assetbundleName": "x_large",
        "messageLengthLimit": 32,
        "displaySec": 5,
        "messageSize": "x_large",
        "colorCode": "#ff7722",
        "virtualLiveCheerMessageDisplayLimitId": 5
    },
    {
        "id": 42,
        "virtualLiveType": "beginner",
        "resourceType": "virtual_coin",
        "fromCost": 5000,
        "toCost": 9999,
        "assetbundleName": "x_large",
        "messageLengthLimit": 32,
        "displaySec": 5,
        "messageSize": "x_large",
        "colorCode": "#ff7722",
        "virtualLiveCheerMessageDisplayLimitId": 5
    },
    {
        "id": 43,
        "virtualLiveType": "normal",
        "resourceType": "jewel",
        "fromCost": 2000,
        "toCost": 2999,
        "assetbundleName": "x_large",
        "messageLengthLimit": 32,
        "displaySec": 5,
        "messageSize": "x_large",
        "colorCode": "#ff7722",
        "virtualLiveCheerMessageDisplayLimitId": 5
    },
    {
        "id": 44,
        "virtualLiveType": "normal",
        "resourceType": "virtual_coin",
        "fromCost": 5000,
        "toCost": 9999,
        "assetbundleName": "x_large",
        "messageLengthLimit": 32,
        "displaySec": 5,
        "messageSize": "x_large",
        "colorCode": "#ff7722",
        "virtualLiveCheerMessageDisplayLimitId": 5
    },
    {
        "id": 45,
        "virtualLiveType": "archive",
        "resourceType": "jewel",
        "fromCost": 2000,
        "toCost": 2999,
        "assetbundleName": "x_large",
        "messageLengthLimit": 32,
        "displaySec": 5,
        "messageSize": "x_large",
        "colorCode": "#ff7722",
        "virtualLiveCheerMessageDisplayLimitId": 5
    },
    {
        "id": 46,
        "virtualLiveType": "archive",
        "resourceType": "virtual_coin",
        "fromCost": 5000,
        "toCost": 9999,
        "assetbundleName": "x_large",
        "messageLengthLimit": 32,
        "displaySec": 5,
        "messageSize": "x_large",
        "colorCode": "#ff7722",
        "virtualLiveCheerMessageDisplayLimitId": 5
    },
    {
        "id": 47,
        "virtualLiveType": "cheerful_carnival",
        "resourceType": "jewel",
        "fromCost": 2000,
        "toCost": 2999,
        "assetbundleName": "x_large",
        "messageLengthLimit": 32,
        "displaySec": 5,
        "messageSize": "x_large",
        "colorCode": "#ff7722",
        "virtualLiveCheerMessageDisplayLimitId": 5
    },
    {
        "id": 48,
        "virtualLiveType": "cheerful_carnival",
        "resourceType": "virtual_coin",
        "fromCost": 5000,
        "toCost": 9999,
        "assetbundleName": "x_large",
        "messageLengthLimit": 32,
        "displaySec": 5,
        "messageSize": "x_large",
        "colorCode": "#ff7722",
        "virtualLiveCheerMessageDisplayLimitId": 5
    },
    {
        "id": 49,
        "virtualLiveType": "streaming",
        "resourceType": "jewel",
        "fromCost": 2000,
        "toCost": 2999,
        "assetbundleName": "x_large",
        "messageLengthLimit": 32,
        "displaySec": 5,
        "messageSize": "x_large",
        "colorCode": "#ff7722",
        "virtualLiveCheerMessageDisplayLimitId": 5
    },
    {
        "id": 50,
        "virtualLiveType": "streaming",
        "resourceType": "virtual_coin",
        "fromCost": 5000,
        "toCost": 9999,
        "assetbundleName": "x_large",
        "messageLengthLimit": 32,
        "displaySec": 5,
        "messageSize": "x_large",
        "colorCode": "#ff7722",
        "virtualLiveCheerMessageDisplayLimitId": 5
    }
]