[
    {
        "id": 1,
        "resourceType": "jewel",
        "point": 0.5
    },
    {
        "id": 2,
        "resourceType": "paid_jewel",
        "point": 1
    },
    {
        "id": 3,
        "resourceType": "gacha_ticket",
        "point": 0.5
    }
]