[
    {
        "id": 2,
        "title": "Show Mission Pass",
        "description": "Acquire exclusive Costumes each month with the Premium Mission Pass.",
        "fromUserRank": 1,
        "toUserRank": 999
    },
    {
        "id": 3,
        "title": "Colorful Pass",
        "description": "A COLORFUL+ subscription will give you Crystals each day.",
        "fromUserRank": 1,
        "toUserRank": 999
    },
    {
        "id": 7,
        "title": "VIRTUAL SINGERS in other SEKAI?",
        "description": "Miku and the other VIRTUAL SINGERS appear differently in each SEKAI, where they help each character find their true feelings.",
        "fromUserRank": 1,
        "toUserRank": 100
    },
    {
        "id": 9,
        "title": "How are SEKAI created?",
        "description": "SEKAI are born from someone's true feelings.",
        "fromUserRank": 1,
        "toUserRank": 100
    },
    {
        "id": 13,
        "title": "Untitled?",
        "description": "Untitled songs are linked to their SEKAI. They are silent songs with neither melody nor lyrics.",
        "fromUserRank": 1,
        "toUserRank": 100
    },
    {
        "id": 16,
        "title": "Practice Scores - How to Obtain \u0026 Use ①",
        "description": "Level up your Characters in Practice to get higher scores in shows.",
        "fromUserRank": 1,
        "toUserRank": 100
    },
    {
        "id": 17,
        "title": "Music Cards - How to Obtain \u0026 Use",
        "description": "Go to the Music Shop to get new songs to play in shows.",
        "fromUserRank": 1,
        "toUserRank": 999
    },
    {
        "id": 18,
        "title": "Music Cards - How to Obtain \u0026 Use",
        "description": "You can trade Music Cards for new songs. The best way to get these is by viewing stories.",
        "fromUserRank": 1,
        "toUserRank": 100
    },
    {
        "id": 19,
        "title": "Miracle Gems - How to Obtain \u0026 Use",
        "description": "Upgrade your 3★ and 4★ Characters to get higher scores in shows.",
        "fromUserRank": 1,
        "toUserRank": 100
    },
    {
        "id": 21,
        "title": "Costume Materials - How to Obtain \u0026 Use",
        "description": "Visit the Costume Shop in the Shopping Mall to get new Costumes.",
        "fromUserRank": 1,
        "toUserRank": 999
    },
    {
        "id": 22,
        "title": "You can use between 0 and 5 Bonus Energy.",
        "description": "Use more Bonus Energy to increase the amount of Event Points and other rewards you'll earn.",
        "fromUserRank": 1,
        "toUserRank": 100
    },
    {
        "id": 25,
        "title": "Game settings can be changed from the Options screen.",
        "description": "Adjust the note speed to what's best for you from the Options menu.",
        "fromUserRank": 1,
        "toUserRank": 999
    },
    {
        "id": 32,
        "title": "Obtaining Avatar Costumes",
        "description": "Visit the Virtual Shop to get Costumes, Accessories and other customization options for your Virtual Avatar.",
        "fromUserRank": 1,
        "toUserRank": 999
    },
    {
        "id": 34,
        "title": "Virtual Show Rewards",
        "description": "Special Virtual Shows are held on characters' birthdays and anniversaries.",
        "fromUserRank": 1,
        "toUserRank": 999
    },
    {
        "id": 36,
        "title": "Changing Costumes",
        "description": "Change which Costume a character will wear in 3D music videos from the Costumes menu.",
        "fromUserRank": 1,
        "toUserRank": 100
    },
    {
        "id": 41,
        "title": "Fan Pts - Acquisition \u0026 Use",
        "description": "Items used in a Virtual Show will earn you Wish Pieces after the Virtual Show is over.",
        "fromUserRank": 1,
        "toUserRank": 100
    },
    {
        "id": 47,
        "title": "MVP and SUPERSTAR",
        "description": "Players who perform well in Co-op Shows will be crowned a SUPERSTAR.",
        "fromUserRank": 1,
        "toUserRank": 100
    },
    {
        "id": 48,
        "title": "Being ON FIRE in a Co-op Show",
        "description": "If you achieve a long enough combo during a Co-op Show, you will be \"On Fire\", and every player's score will gain a bonus.",
        "fromUserRank": 1,
        "toUserRank": 100
    },
    {
        "id": 50,
        "title": "View Card Episodes to Boost Stats",
        "description": "Many Characters have special Side Stories.",
        "fromUserRank": 1,
        "toUserRank": 999
    },
    {
        "id": 53,
        "title": "Playing Challenge Shows",
        "description": "Surpass certain high scores in a Challenge Show to earn Crystals.",
        "fromUserRank": 1,
        "toUserRank": 100
    },
    {
        "id": 54,
        "title": "Decorations - Basic Effects",
        "description": "Level up your Decorations to get higher scores in shows.",
        "fromUserRank": 1,
        "toUserRank": 100
    },
    {
        "id": 60,
        "title": "Unlock Costume Patterns by Getting 4★ Characters.",
        "description": "If you get a 4★ Character that comes with a Costume, you'll also be able to make it for other characters to wear.",
        "fromUserRank": 1,
        "toUserRank": 100
    },
    {
        "id": 62,
        "title": "Wishes - Acquisition \u0026 Use",
        "description": "You can raise a Character's Mastery Rank using Wish Pieces.",
        "fromUserRank": 1,
        "toUserRank": 100
    },
    {
        "id": 63,
        "title": "Wishes - Acquisition \u0026 Use",
        "description": "Trade Characters in the Green Room for Wish Pieces and Wish Jewels.",
        "fromUserRank": 1,
        "toUserRank": 100
    },
    {
        "id": 68,
        "title": "Increasing Character Rank",
        "description": "Increasing Character Ranks will earn you special Titles and Stamps.",
        "fromUserRank": 1,
        "toUserRank": 999
    },
    {
        "id": 72,
        "title": "Show Mission Points Reset",
        "description": "Show Missions reset at 12:00 a.m. (PT) on the 1st of each month.",
        "fromUserRank": 1,
        "toUserRank": 999
    },
    {
        "id": 75,
        "title": "Decorations - Leveling \u0026 Advantages",
        "description": "Obtain Magical Seeds by playing shows and use them to level up Decorations.",
        "fromUserRank": 1,
        "toUserRank": 100
    },
    {
        "id": 79,
        "title": "Increase Mastery Rank to Boost Stats",
        "description": "Increase a Character's Mastery Rank to earn more Event Points and Tokens during events.",
        "fromUserRank": 1,
        "toUserRank": 100
    },
    {
        "id": 80,
        "title": "Increase Mastery Rank to Boost Stats",
        "description": "Increase the Mastery Rank of a 4★ Character that comes with a Costume to unlock that Costume's color variants.",
        "fromUserRank": 1,
        "toUserRank": 100
    },
    {
        "id": 83,
        "title": "Purchasing Song Covers",
        "description": "You can get Covers of songs from the Cover Shop section of the Music Shop.",
        "fromUserRank": 1,
        "toUserRank": 999
    },
    {
        "id": 87,
        "title": "Co-op Show Rewards (1)",
        "description": "You can earn more rewards by playing Co-op Shows.",
        "fromUserRank": 1,
        "toUserRank": 999
    },
    {
        "id": 88,
        "title": "Obtaining Stamps",
        "description": "Visit the Stamp Shop in the Shopping Mall to get new Stamps.",
        "fromUserRank": 1,
        "toUserRank": 999
    },
    {
        "id": 89,
        "title": "Obtaining Stamp Vouchers",
        "description": "The best way to obtain Stamp Vouchers is through Event Exchanges.",
        "fromUserRank": 1,
        "toUserRank": 100
    },
    {
        "id": 90,
        "title": "Virtual Show - Lobby (1)",
        "description": "You can interact with other players\n in the Virtual Show Lobby.",
        "fromUserRank": 10,
        "toUserRank": 50
    },
    {
        "id": 93,
        "title": "Ver. Select",
        "description": "Switch song versions before starting a Show by tapping Ver. Select.",
        "fromUserRank": 1,
        "toUserRank": 999
    },
    {
        "id": 94,
        "title": "Assigning Favorite Stamps",
        "description": "You can add Stamps to your Favorites from the Stamps menu.",
        "fromUserRank": 1,
        "toUserRank": 999
    },
    {
        "id": 95,
        "title": "Increasing Your Score (1)",
        "description": "Your score in a show is determined by your Characters' Talent, your Combos and the number of Perfects you earn.",
        "fromUserRank": 1,
        "toUserRank": 100
    },
    {
        "id": 101,
        "title": "Auto-Play",
        "description": "You can use Auto-Play to clear Solo Shows for you.",
        "fromUserRank": 1,
        "toUserRank": 999
    },
    {
        "id": 103,
        "title": "Event Story",
        "description": "You can view all past stories from the Story menu.",
        "fromUserRank": 1,
        "toUserRank": 999
    },
    {
        "id": 105,
        "title": "Challenge Shows - EX Levels",
        "description": "When a character's Challenge Show Level reaches 100, it will switch to EX Levels.",
        "fromUserRank": 250,
        "toUserRank": 999
    },
    {
        "id": 110,
        "title": "Hairstyle",
        "description": "Reach Mastery Rank 2 with a Limited Time Character to unlock a special Hairstyle.",
        "fromUserRank": 1,
        "toUserRank": 999
    },
    {
        "id": 115,
        "title": "Profile",
        "description": "Go to the Custom Profile menu to design your own personal Profile.",
        "fromUserRank": 1,
        "toUserRank": 999
    },
    {
        "id": 117,
        "title": "Character Exchange",
        "description": "Trade for previously featured General Characters at the Character Exchange.",
        "fromUserRank": 1,
        "toUserRank": 999
    },
    {
        "id": 119,
        "title": "Trust Rank",
        "description": "Increase the Trust Rank between certain Characters to earn special Titles.",
        "fromUserRank": 1,
        "toUserRank": 999
    },
    {
        "id": 123,
        "title": "Ranked Match",
        "description": "In Ranked Matches, players will compete each season against one another in 1 vs 1 Shows.",
        "fromUserRank": 1,
        "toUserRank": 999
    },
    {
        "id": 126,
        "title": "Character Archive",
        "description": "Earn more Character Rank EXP by clearing Character Missions.",
        "fromUserRank": 1,
        "toUserRank": 999
    },
    {
        "id": 127,
        "title": "Playlists",
        "description": "Go to Playlists to make lists of all your favorite songs.",
        "fromUserRank": 1,
        "toUserRank": 999
    },
    {
        "id": 128,
        "title": "ライブPの獲得方法",
        "description": "Earn up to three Daily Bonuses a day when clearing Co-op Shows or Cheerful Shows.",
        "fromUserRank": 1,
        "toUserRank": 999
    },
    {
        "id": 130,
        "title": "ディスクショップ",
        "description": "Purchase recordings of past Virtual Shows at the Disc Shop in the Lobby.",
        "fromUserRank": 1,
        "toUserRank": 999
    },
    {
        "id": 133,
        "title": "Bookmark",
        "description": "When viewing a story, you can bookmark your spot and continue viewing from there later at any time.",
        "fromUserRank": 1,
        "toUserRank": 999
    },
    {
        "id": 134,
        "title": "記憶のカケラ",
        "description": "Touch the Memory Fragment to look into the past and view Area Conversations from the previous school year.",
        "fromUserRank": 1,
        "toUserRank": 999
    },
    {
        "id": 135,
        "title": "難易度APPEND",
        "description": "Append difficulty is a mode that requires three or more fingers to play.",
        "fromUserRank": 1,
        "toUserRank": 999
    },
    {
        "id": 136,
        "title": "ノーツ種類",
        "description": "Adjust the note designs and sound effects from the Options menu.",
        "fromUserRank": 1,
        "toUserRank": 999
    },
    {
        "id": 137,
        "title": "3DMV Alternate Cut",
        "description": "Reach Mastery Rank 2 with a Group Event Exclusive Character to unlock a 3DMV Alternate Cut.",
        "fromUserRank": 1,
        "toUserRank": 999
    },
    {
        "id": 138,
        "title": "ライブでライフが0になったとき",
        "description": "Even if your Life drops to zero during the rhythm game, you can play the show to the end.",
        "fromUserRank": 1,
        "toUserRank": 999
    },
    {
        "id": 1041,
        "title": "What \"Going Pro\" Means",
        "assetbundleName": "comic_0041",
        "fromUserRank": 1,
        "toUserRank": 999
    },
    {
        "id": 1042,
        "title": "Signs Point to Growth",
        "assetbundleName": "comic_0042",
        "fromUserRank": 1,
        "toUserRank": 999
    },
    {
        "id": 1043,
        "title": "All for Leo/need!",
        "assetbundleName": "comic_0043",
        "fromUserRank": 1,
        "toUserRank": 999
    },
    {
        "id": 1044,
        "title": "Credit-Based Concerns",
        "assetbundleName": "comic_0044",
        "fromUserRank": 1,
        "toUserRank": 999
    },
    {
        "id": 1045,
        "title": "Minori's Growth",
        "assetbundleName": "comic_0045",
        "fromUserRank": 1,
        "toUserRank": 999
    },
    {
        "id": 1046,
        "title": "Divine Presence in the Nurse's Office",
        "assetbundleName": "comic_0046",
        "fromUserRank": 1,
        "toUserRank": 999
    },
    {
        "id": 1047,
        "title": "Training to Surpass It",
        "assetbundleName": "comic_0047",
        "fromUserRank": 1,
        "toUserRank": 999
    },
    {
        "id": 1048,
        "title": "An's Secret Folder",
        "assetbundleName": "comic_0048",
        "fromUserRank": 1,
        "toUserRank": 999
    },
    {
        "id": 1049,
        "title": "Post-Practice Refuel",
        "assetbundleName": "comic_0049",
        "fromUserRank": 1,
        "toUserRank": 999
    },
    {
        "id": 1050,
        "title": "From the Stage to the Stars",
        "assetbundleName": "comic_0050",
        "fromUserRank": 1,
        "toUserRank": 999
    },
    {
        "id": 1051,
        "title": "Hard Work Makes the Dream Work",
        "assetbundleName": "comic_0051",
        "fromUserRank": 1,
        "toUserRank": 999
    },
    {
        "id": 1052,
        "title": "Robo-Emu?",
        "assetbundleName": "comic_0052",
        "fromUserRank": 1,
        "toUserRank": 999
    },
    {
        "id": 1053,
        "title": "Our New Work Setup",
        "assetbundleName": "comic_0053",
        "fromUserRank": 1,
        "toUserRank": 999
    },
    {
        "id": 1054,
        "title": "Walking for Health \u0026 Beauty",
        "assetbundleName": "comic_0054",
        "fromUserRank": 1,
        "toUserRank": 999
    },
    {
        "id": 1055,
        "title": "If You Say So...",
        "assetbundleName": "comic_0055",
        "fromUserRank": 1,
        "toUserRank": 999
    },
    {
        "id": 1056,
        "title": "From Between Worlds",
        "assetbundleName": "comic_0056",
        "fromUserRank": 1,
        "toUserRank": 999
    },
    {
        "id": 1057,
        "title": "Hardworking Juniors",
        "assetbundleName": "comic_0057",
        "fromUserRank": 1,
        "toUserRank": 999
    },
    {
        "id": 1058,
        "title": "Idol-ology",
        "assetbundleName": "comic_0058",
        "fromUserRank": 1,
        "toUserRank": 999
    },
    {
        "id": 1059,
        "title": "Cooking Is My Love Language!",
        "assetbundleName": "comic_0059",
        "fromUserRank": 1,
        "toUserRank": 999
    },
    {
        "id": 1060,
        "title": "Quiet During Rehearsal!",
        "assetbundleName": "comic_0060",
        "fromUserRank": 1,
        "toUserRank": 999
    },
    {
        "id": 1061,
        "title": "Not-So-Empty SEKAI",
        "assetbundleName": "comic_0061",
        "fromUserRank": 1,
        "toUserRank": 999
    },
    {
        "id": 1062,
        "title": "An Extravert in Kamiyama High 2-A",
        "assetbundleName": "comic_0062",
        "fromUserRank": 1,
        "toUserRank": 999
    },
    {
        "id": 1063,
        "title": "A Professor in Kamiyama High 2-B",
        "assetbundleName": "comic_0063",
        "fromUserRank": 1,
        "toUserRank": 999
    },
    {
        "id": 1064,
        "title": "Animal Therapy in Miya Girls 2-A",
        "assetbundleName": "comic_0064",
        "fromUserRank": 1,
        "toUserRank": 999
    },
    {
        "id": 1065,
        "title": "An SSE Sandwich in Miya Girls 2-B",
        "assetbundleName": "comic_0065",
        "fromUserRank": 1,
        "toUserRank": 999
    },
    {
        "id": 1066,
        "title": "My Idol in Miya Girls 2-D",
        "assetbundleName": "comic_0066",
        "fromUserRank": 1,
        "toUserRank": 999
    },
    {
        "id": 1067,
        "title": "A Singularity in Kamiyama High 3-C",
        "assetbundleName": "comic_0067",
        "fromUserRank": 1,
        "toUserRank": 999
    },
    {
        "id": 1068,
        "title": "Forever Classmates in Miya Girls 3-E",
        "assetbundleName": "comic_0068",
        "fromUserRank": 1,
        "toUserRank": 999
    }
]