[
    {
        "id": 1,
        "seq": 10,
        "name": "Headphones",
        "part": "Accessory_face",
        "assetbundleName": "accessory_0001"
    },
    {
        "id": 2,
        "seq": 20,
        "name": "Cat Ears",
        "part": "Accessory_face",
        "assetbundleName": "accessory_0002"
    },
    {
        "id": 3,
        "seq": 30,
        "name": "Ribbon",
        "part": "Accessory_face",
        "assetbundleName": "accessory_0003"
    },
    {
        "id": 4,
        "seq": 40,
        "name": "Cap",
        "part": "Accessory_face",
        "assetbundleName": "accessory_0004"
    },
    {
        "id": 5,
        "seq": 50,
        "name": "Glow Stick Headband",
        "part": "Accessory_face",
        "assetbundleName": "accessory_0005"
    },
    {
        "id": 6,
        "seq": 60,
        "name": "Sunglasses",
        "part": "Accessory_face",
        "assetbundleName": "accessory_0006"
    },
    {
        "id": 7,
        "seq": 70,
        "name": "Halo",
        "part": "Accessory_face",
        "assetbundleName": "accessory_0007"
    },
    {
        "id": 8,
        "seq": 80,
        "name": "Wreath",
        "part": "Accessory_face",
        "assetbundleName": "accessory_0008"
    },
    {
        "id": 9,
        "seq": 90,
        "name": "Leek",
        "part": "Accessory_face",
        "assetbundleName": "accessory_0009"
    },
    {
        "id": 10,
        "seq": 100,
        "name": "Wig",
        "part": "Accessory_face",
        "assetbundleName": "accessory_0010"
    },
    {
        "id": 11,
        "seq": 110,
        "name": "MEIKO's Coffee",
        "part": "Accessory_face",
        "assetbundleName": "accessory_0011"
    },
    {
        "id": 13,
        "seq": 130,
        "name": "Pumpkin Head",
        "part": "Accessory_face",
        "assetbundleName": "accessory_0013"
    },
    {
        "id": 14,
        "seq": 140,
        "name": "Reindeer Headband",
        "part": "Accessory_face",
        "assetbundleName": "accessory_0014"
    },
    {
        "id": 15,
        "seq": 150,
        "name": "Rice Cakes",
        "part": "Accessory_face",
        "assetbundleName": "accessory_0015"
    },
    {
        "id": 16,
        "seq": 160,
        "name": "Crown",
        "part": "Accessory_face",
        "assetbundleName": "accessory_0016"
    },
    {
        "id": 17,
        "seq": 170,
        "name": "Balloon ☆ Hat",
        "part": "Accessory_face",
        "assetbundleName": "accessory_0017"
    },
    {
        "id": 18,
        "seq": 180,
        "name": "School Cap",
        "part": "Accessory_face",
        "assetbundleName": "accessory_0018"
    },
    {
        "id": 19,
        "seq": 190,
        "name": "Lovely Lunch",
        "part": "Accessory_face",
        "assetbundleName": "accessory_0019"
    },
    {
        "id": 20,
        "seq": 200,
        "name": "Family Penguin",
        "part": "Accessory_face",
        "assetbundleName": "accessory_0020"
    },
    {
        "id": 21,
        "seq": 210,
        "name": "Clock Rabbit Headband",
        "part": "Accessory_face",
        "assetbundleName": "accessory_0021"
    },
    {
        "id": 22,
        "seq": 220,
        "name": "Star Festival Ornament",
        "part": "Accessory_face",
        "assetbundleName": "accessory_0022"
    },
    {
        "id": 23,
        "seq": 230,
        "name": "Straw Hat",
        "part": "Accessory_face",
        "assetbundleName": "accessory_0023"
    },
    {
        "id": 24,
        "seq": 240,
        "name": "Singer Beast",
        "part": "Accessory_face",
        "assetbundleName": "accessory_0024"
    },
    {
        "id": 25,
        "seq": 250,
        "name": "Snorkel Mask",
        "part": "Accessory_face",
        "assetbundleName": "accessory_0025"
    },
    {
        "id": 26,
        "seq": 260,
        "name": "Masked Idol Mask",
        "part": "Accessory_face",
        "assetbundleName": "accessory_0026"
    },
    {
        "id": 28,
        "seq": 280,
        "name": "Moon Rabbit Dango",
        "part": "Accessory_face",
        "assetbundleName": "accessory_0028"
    },
    {
        "id": 29,
        "seq": 290,
        "name": "Meteor Headphones",
        "part": "Accessory_face",
        "assetbundleName": "accessory_0029"
    },
    {
        "id": 32,
        "seq": 320,
        "name": "Lonely Horn",
        "part": "Accessory_face",
        "assetbundleName": "accessory_0032"
    },
    {
        "id": 33,
        "seq": 330,
        "name": "CRASH Show Cap",
        "part": "Accessory_face",
        "assetbundleName": "accessory_0033"
    },
    {
        "id": 34,
        "seq": 340,
        "name": "Christmas Tree Hat",
        "part": "Accessory_face",
        "assetbundleName": "accessory_0034"
    },
    {
        "id": 35,
        "seq": 350,
        "name": "Camping Tent",
        "part": "Accessory_face",
        "assetbundleName": "accessory_0035"
    },
    {
        "id": 36,
        "seq": 360,
        "name": "2023 New Years Glasses",
        "part": "Accessory_face",
        "assetbundleName": "accessory_0036"
    },
    {
        "id": 37,
        "seq": 370,
        "name": "Warm Stew",
        "part": "Accessory_face",
        "assetbundleName": "accessory_0037"
    },
    {
        "id": 38,
        "seq": 380,
        "name": "Marzipan Miku",
        "part": "Accessory_face",
        "assetbundleName": "accessory_0038"
    },
    {
        "id": 39,
        "seq": 390,
        "name": "Riding Goggles",
        "part": "Accessory_face",
        "assetbundleName": "accessory_0039"
    },
    {
        "id": 40,
        "seq": 400,
        "name": "Macaron Hat",
        "part": "Accessory_face",
        "assetbundleName": "accessory_0040"
    },
    {
        "id": 41,
        "seq": 410,
        "name": "Plaster Statue Mask",
        "part": "Accessory_face",
        "assetbundleName": "accessory_0041"
    },
    {
        "id": 42,
        "seq": 420,
        "name": "Cherry Blossom Headband",
        "part": "Accessory_face",
        "assetbundleName": "accessory_0042"
    },
    {
        "id": 43,
        "seq": 430,
        "name": "Star Sunglasses",
        "part": "Accessory_face",
        "assetbundleName": "accessory_0043"
    },
    {
        "id": 44,
        "seq": 440,
        "name": "Pancakes",
        "part": "Accessory_face",
        "assetbundleName": "accessory_0044"
    },
    {
        "id": 45,
        "seq": 450,
        "name": "Tropical Fruit Platter",
        "part": "Accessory_face",
        "assetbundleName": "accessory_0045"
    },
    {
        "id": 46,
        "seq": 460,
        "name": "Butterfly Straw Hat",
        "part": "Accessory_face",
        "assetbundleName": "accessory_0046"
    },
    {
        "id": 47,
        "seq": 540,
        "name": "Christmas Cake",
        "part": "Accessory_face",
        "assetbundleName": "accessory_0047"
    },
    {
        "id": 48,
        "seq": 470,
        "name": "Cyber Headband",
        "part": "Accessory_face",
        "assetbundleName": "accessory_0048"
    },
    {
        "id": 49,
        "seq": 480,
        "name": "Ribbon Newsboy Cap",
        "part": "Accessory_face",
        "assetbundleName": "accessory_0049"
    },
    {
        "id": 50,
        "seq": 490,
        "name": "Mountain Hat",
        "part": "Accessory_face",
        "assetbundleName": "accessory_0050"
    },
    {
        "id": 51,
        "seq": 510,
        "name": "Rui's Show Drone",
        "part": "Accessory_face",
        "assetbundleName": "accessory_0051"
    },
    {
        "id": 53,
        "seq": 520,
        "name": "Dark Decora Hat",
        "part": "Accessory_face",
        "assetbundleName": "accessory_0053"
    },
    {
        "id": 54,
        "seq": 530,
        "name": "Heart-Shaped Target",
        "part": "Accessory_face",
        "assetbundleName": "accessory_0054"
    },
    {
        "id": 55,
        "seq": 550,
        "name": "Lucky Daruma",
        "part": "Accessory_face",
        "assetbundleName": "accessory_0055"
    },
    {
        "id": 56,
        "seq": 540,
        "name": "New Year's Lion-Dog",
        "part": "Accessory_face",
        "assetbundleName": "accessory_0056"
    },
    {
        "id": 57,
        "seq": 560,
        "name": "Dreamer Hat",
        "part": "Accessory_face",
        "assetbundleName": "accessory_0057"
    },
    {
        "id": 58,
        "seq": 570,
        "name": "Soft Choco Hat",
        "part": "Accessory_face",
        "assetbundleName": "accessory_0058"
    },
    {
        "id": 59,
        "seq": 610,
        "name": "Beret",
        "part": "Accessory_face",
        "assetbundleName": "accessory_0059"
    },
    {
        "id": 60,
        "seq": 580,
        "name": "Count Pearl Plushie",
        "part": "Accessory_face",
        "assetbundleName": "accessory_0060"
    },
    {
        "id": 61,
        "seq": 600,
        "name": "Wide-Brimmed Hat",
        "part": "Accessory_face",
        "assetbundleName": "accessory_0061"
    },
    {
        "id": 64,
        "seq": 630,
        "name": "Cowardly Canary",
        "part": "Accessory_face",
        "assetbundleName": "accessory_0064"
    },
    {
        "id": 65,
        "seq": 640,
        "name": "Wedding Bells",
        "part": "Accessory_face",
        "assetbundleName": "accessory_0065"
    },
    {
        "id": 67,
        "seq": 650,
        "name": "Homemade Sandwich",
        "part": "Accessory_face",
        "assetbundleName": "accessory_0067"
    },
    {
        "id": 68,
        "seq": 660,
        "name": "Bear Plushie",
        "part": "Accessory_face",
        "assetbundleName": "accessory_0068"
    },
    {
        "id": 69,
        "seq": 680,
        "name": "Cactus",
        "part": "Accessory_face",
        "assetbundleName": "accessory_0069"
    },
    {
        "id": 71,
        "seq": 720,
        "name": "Saki's Photo Album",
        "part": "Accessory_face",
        "assetbundleName": "accessory_0071"
    },
    {
        "id": 72,
        "seq": 730,
        "name": "Hit The Books Headband \u0026 Glasses",
        "part": "Accessory_face",
        "assetbundleName": "accessory_0072"
    },
    {
        "id": 74,
        "seq": 700,
        "name": "Pop Out Of The Phone",
        "part": "Accessory_face",
        "assetbundleName": "accessory_0074"
    },
    {
        "id": 75,
        "seq": 710,
        "name": "Morning Toast♪",
        "part": "Accessory_face",
        "assetbundleName": "accessory_0075"
    },
    {
        "id": 76,
        "seq": 740,
        "name": "Miku CDs",
        "part": "Accessory_face",
        "assetbundleName": "accessory_0076"
    },
    {
        "id": 77,
        "seq": 760,
        "name": "Speaker Head",
        "part": "Accessory_face",
        "assetbundleName": "accessory_0077"
    },
    {
        "id": 78,
        "seq": 770,
        "name": "Ramen",
        "part": "Accessory_face",
        "assetbundleName": "accessory_0078"
    },
    {
        "id": 79,
        "seq": 780,
        "name": "Hot Spring Basin",
        "part": "Accessory_face",
        "assetbundleName": "accessory_0079"
    },
    {
        "id": 80,
        "seq": 790,
        "name": "Pegasus Light Display",
        "part": "Accessory_face",
        "assetbundleName": "accessory_0080"
    },
    {
        "id": 81,
        "seq": 850,
        "name": "Hello Kitty Headband",
        "part": "Accessory_face",
        "assetbundleName": "accessory_0081"
    },
    {
        "id": 82,
        "seq": 840,
        "name": "Pompompurin Headband",
        "part": "Accessory_face",
        "assetbundleName": "accessory_0082"
    },
    {
        "id": 83,
        "seq": 830,
        "name": "My Melody Headband",
        "part": "Accessory_face",
        "assetbundleName": "accessory_0083"
    },
    {
        "id": 84,
        "seq": 820,
        "name": "Pochacco Headband",
        "part": "Accessory_face",
        "assetbundleName": "accessory_0084"
    },
    {
        "id": 85,
        "seq": 810,
        "name": "Cinnamoroll Headband",
        "part": "Accessory_face",
        "assetbundleName": "accessory_0085"
    },
    {
        "id": 86,
        "seq": 800,
        "name": "KUROMI Headband",
        "part": "Accessory_face",
        "assetbundleName": "accessory_0086"
    },
    {
        "id": 87,
        "seq": 860,
        "name": "Music Box",
        "part": "Accessory_face",
        "assetbundleName": "accessory_0087"
    },
    {
        "id": 88,
        "seq": 870,
        "name": "New Year's Meal",
        "part": "Accessory_face",
        "assetbundleName": "accessory_0088"
    },
    {
        "id": 89,
        "seq": 880,
        "name": "Chock-Full Barbecue Lunch",
        "part": "Accessory_face",
        "assetbundleName": "accessory_0089"
    },
    {
        "id": 90,
        "seq": 890,
        "name": "Kohane's Camera",
        "part": "Accessory_face",
        "assetbundleName": "accessory_0090"
    },
    {
        "id": 91,
        "seq": 900,
        "name": "Dream House",
        "part": "Accessory_face",
        "assetbundleName": "accessory_0091"
    },
    {
        "id": 92,
        "seq": 910,
        "name": "Tea Set",
        "part": "Accessory_face",
        "assetbundleName": "accessory_0092"
    },
    {
        "id": 93,
        "seq": 920,
        "name": "Grand Piano",
        "part": "Accessory_face",
        "assetbundleName": "accessory_0093"
    }
]