[
    {
        "id": 1,
        "groupId": 1,
        "platform": "iOS",
        "productId": "com.sega.colorfulstage.en.crystal.0001",
        "price": 0.99,
        "unitPrice": 1.091
    },
    {
        "id": 2,
        "groupId": 1,
        "platform": "Android",
        "productId": "com.sega.colorfulstage.en.crystal.0001",
        "price": 0.99,
        "unitPrice": 1.091
    },
    {
        "id": 3,
        "groupId": 2,
        "platform": "iOS",
        "productId": "com.sega.colorfulstage.en.crystal.0002",
        "price": 2.99,
        "unitPrice": 1.058
    },
    {
        "id": 4,
        "groupId": 2,
        "platform": "Android",
        "productId": "com.sega.colorfulstage.en.crystal.0002",
        "price": 2.99,
        "unitPrice": 1.058
    },
    {
        "id": 5,
        "groupId": 3,
        "platform": "iOS",
        "productId": "com.sega.colorfulstage.en.crystal.0003",
        "price": 7.99,
        "unitPrice": 1.032
    },
    {
        "id": 6,
        "groupId": 3,
        "platform": "Android",
        "productId": "com.sega.colorfulstage.en.crystal.0003",
        "price": 7.99,
        "unitPrice": 1.032
    },
    {
        "id": 7,
        "groupId": 4,
        "platform": "iOS",
        "productId": "com.sega.colorfulstage.en.crystal.0004",
        "price": 14.99,
        "unitPrice": 1.023
    },
    {
        "id": 8,
        "groupId": 4,
        "platform": "Android",
        "productId": "com.sega.colorfulstage.en.crystal.0004",
        "price": 14.99,
        "unitPrice": 1.023
    },
    {
        "id": 9,
        "groupId": 5,
        "platform": "iOS",
        "productId": "com.sega.colorfulstage.en.crystal.0005",
        "price": 24.99,
        "unitPrice": 1
    },
    {
        "id": 10,
        "groupId": 5,
        "platform": "Android",
        "productId": "com.sega.colorfulstage.en.crystal.0005",
        "price": 24.99,
        "unitPrice": 1
    },
    {
        "id": 11,
        "groupId": 6,
        "platform": "iOS",
        "productId": "com.sega.colorfulstage.en.crystal.0006",
        "price": 39.99,
        "unitPrice": 0.98
    },
    {
        "id": 12,
        "groupId": 6,
        "platform": "Android",
        "productId": "com.sega.colorfulstage.en.crystal.0006",
        "price": 39.99,
        "unitPrice": 0.98
    },
    {
        "id": 13,
        "groupId": 7,
        "platform": "iOS",
        "productId": "com.sega.colorfulstage.en.crystal.0007",
        "price": 79.99,
        "unitPrice": 0.953
    },
    {
        "id": 14,
        "groupId": 7,
        "platform": "Android",
        "productId": "com.sega.colorfulstage.en.crystal.0007",
        "price": 79.99,
        "unitPrice": 0.953
    },
    {
        "id": 15,
        "groupId": 8,
        "platform": "iOS",
        "productId": "com.sega.colorfulstage.en.beginnerset.0001",
        "price": 0.99,
        "unitPrice": 1.091
    },
    {
        "id": 16,
        "groupId": 8,
        "platform": "Android",
        "productId": "com.sega.colorfulstage.en.beginnerset.0001",
        "price": 0.99,
        "unitPrice": 1.091
    },
    {
        "id": 17,
        "groupId": 9,
        "platform": "iOS",
        "productId": "com.sega.colorfulstage.en.beginnerset.0002",
        "price": 24.99,
        "unitPrice": 1.089
    },
    {
        "id": 18,
        "groupId": 9,
        "platform": "Android",
        "productId": "com.sega.colorfulstage.en.beginnerset.0002",
        "price": 24.99,
        "unitPrice": 1.089
    },
    {
        "id": 19,
        "groupId": 10,
        "platform": "iOS",
        "productId": "com.sega.colorfulstage.en.beginnerset.0003",
        "price": 79.99,
        "unitPrice": 1.087
    },
    {
        "id": 20,
        "groupId": 10,
        "platform": "Android",
        "productId": "com.sega.colorfulstage.en.beginnerset.0003",
        "price": 79.99,
        "unitPrice": 1.087
    },
    {
        "id": 21,
        "groupId": 11,
        "platform": "iOS",
        "productId": "com.sega.colorfulstage.en.beginnerset.0004",
        "price": 2.99,
        "unitPrice": 1.089
    },
    {
        "id": 22,
        "groupId": 11,
        "platform": "Android",
        "productId": "com.sega.colorfulstage.en.beginnerset.0004",
        "price": 2.99,
        "unitPrice": 1.089
    },
    {
        "id": 23,
        "groupId": 12,
        "platform": "iOS",
        "productId": "com.sega.colorfulstage.en.livep.0001",
        "price": 2.99,
        "unitPrice": 1.089
    },
    {
        "id": 24,
        "groupId": 12,
        "platform": "Android",
        "productId": "com.sega.colorfulstage.en.livep.0001",
        "price": 2.99,
        "unitPrice": 1.089
    },
    {
        "id": 27,
        "groupId": 14,
        "platform": "iOS",
        "productId": "com.sega.colorfulstage.en.set.0002",
        "price": 3.99,
        "unitPrice": 1.089
    },
    {
        "id": 28,
        "groupId": 14,
        "platform": "Android",
        "productId": "com.sega.colorfulstage.en.set.0002",
        "price": 3.99,
        "unitPrice": 1.089
    },
    {
        "id": 29,
        "groupId": 15,
        "platform": "iOS",
        "productId": "com.sega.colorfulstage.en.set.0003",
        "price": 15.99,
        "unitPrice": 1.089
    },
    {
        "id": 30,
        "groupId": 15,
        "platform": "Android",
        "productId": "com.sega.colorfulstage.en.set.0003",
        "price": 15.99,
        "unitPrice": 1.089
    },
    {
        "id": 35,
        "groupId": 18,
        "platform": "iOS",
        "productId": "com.sega.colorfulstage.en.campaign.0001",
        "price": 14.99,
        "unitPrice": 1.023
    },
    {
        "id": 36,
        "groupId": 18,
        "platform": "Android",
        "productId": "com.sega.colorfulstage.en.campaign.0001",
        "price": 14.99,
        "unitPrice": 1.023
    },
    {
        "id": 37,
        "groupId": 19,
        "platform": "iOS",
        "productId": "com.sega.colorfulstage.en.campaign.0002",
        "price": 39.99,
        "unitPrice": 0.98
    },
    {
        "id": 38,
        "groupId": 19,
        "platform": "Android",
        "productId": "com.sega.colorfulstage.en.campaign.0002",
        "price": 39.99,
        "unitPrice": 0.98
    },
    {
        "id": 39,
        "groupId": 20,
        "platform": "iOS",
        "productId": "com.sega.colorfulstage.en.campaign.0003",
        "price": 79.99,
        "unitPrice": 0.953
    },
    {
        "id": 40,
        "groupId": 20,
        "platform": "Android",
        "productId": "com.sega.colorfulstage.en.campaign.0003",
        "price": 79.99,
        "unitPrice": 0.953
    },
    {
        "id": 41,
        "groupId": 21,
        "platform": "iOS",
        "productId": "com.sega.colorfulstage.en.set.0006",
        "price": 11.99,
        "unitPrice": 1.089
    },
    {
        "id": 42,
        "groupId": 21,
        "platform": "Android",
        "productId": "com.sega.colorfulstage.en.set.0006",
        "price": 11.99,
        "unitPrice": 1.089
    },
    {
        "id": 45,
        "groupId": 23,
        "platform": "iOS",
        "productId": "com.sega.colorfulstage.en.beginnerset.0005",
        "price": 3.99,
        "unitPrice": 1.089
    },
    {
        "id": 46,
        "groupId": 23,
        "platform": "Android",
        "productId": "com.sega.colorfulstage.en.beginnerset.0005",
        "price": 3.99,
        "unitPrice": 1.089
    },
    {
        "id": 47,
        "groupId": 24,
        "platform": "iOS",
        "productId": "com.sega.colorfulstage.en.set.0007",
        "price": 15.99,
        "unitPrice": 1.089
    },
    {
        "id": 48,
        "groupId": 24,
        "platform": "Android",
        "productId": "com.sega.colorfulstage.en.set.0007",
        "price": 15.99,
        "unitPrice": 1.089
    },
    {
        "id": 49,
        "groupId": 25,
        "platform": "iOS",
        "productId": "com.sega.colorfulstage.en.christmas.0001",
        "price": 15.99,
        "unitPrice": 1.089
    },
    {
        "id": 50,
        "groupId": 25,
        "platform": "Android",
        "productId": "com.sega.colorfulstage.en.christmas.0001",
        "price": 15.99,
        "unitPrice": 1.089
    },
    {
        "id": 51,
        "groupId": 26,
        "platform": "iOS",
        "productId": "com.sega.colorfulstage.en.christmas.0002",
        "price": 15.99,
        "unitPrice": 1.089
    },
    {
        "id": 52,
        "groupId": 26,
        "platform": "Android",
        "productId": "com.sega.colorfulstage.en.christmas.0002",
        "price": 15.99,
        "unitPrice": 1.089
    },
    {
        "id": 53,
        "groupId": 27,
        "platform": "iOS",
        "productId": "com.sega.colorfulstage.en.newyear.0001",
        "price": 15.99,
        "unitPrice": 1.089
    },
    {
        "id": 54,
        "groupId": 27,
        "platform": "Android",
        "productId": "com.sega.colorfulstage.en.newyear.0001",
        "price": 15.99,
        "unitPrice": 1.089
    },
    {
        "id": 55,
        "groupId": 28,
        "platform": "iOS",
        "productId": "com.sega.colorfulstage.en.newyear.0002",
        "price": 15.99,
        "unitPrice": 1.089
    },
    {
        "id": 56,
        "groupId": 28,
        "platform": "Android",
        "productId": "com.sega.colorfulstage.en.newyear.0002",
        "price": 15.99,
        "unitPrice": 1.089
    },
    {
        "id": 57,
        "groupId": 29,
        "platform": "iOS",
        "productId": "com.sega.colorfulstage.en.newyear.set.0001",
        "price": 3.99,
        "unitPrice": 1.089
    },
    {
        "id": 58,
        "groupId": 29,
        "platform": "Android",
        "productId": "com.sega.colorfulstage.en.newyear.set.0001",
        "price": 3.99,
        "unitPrice": 1.089
    },
    {
        "id": 59,
        "groupId": 30,
        "platform": "iOS",
        "productId": "com.sega.colorfulstage.en.newyear.set.0002",
        "price": 24.99,
        "unitPrice": 1.089
    },
    {
        "id": 60,
        "groupId": 30,
        "platform": "Android",
        "productId": "com.sega.colorfulstage.en.newyear.set.0002",
        "price": 24.99,
        "unitPrice": 1.089
    },
    {
        "id": 61,
        "groupId": 31,
        "platform": "iOS",
        "productId": "com.sega.colorfulstage.en.newyear.set.0003",
        "price": 79.99,
        "unitPrice": 1.087
    },
    {
        "id": 62,
        "groupId": 31,
        "platform": "Android",
        "productId": "com.sega.colorfulstage.en.newyear.set.0003",
        "price": 79.99,
        "unitPrice": 1.087
    },
    {
        "id": 63,
        "groupId": 32,
        "platform": "iOS",
        "productId": "com.sega.colorfulstage.en.set.0005",
        "price": 24.99,
        "unitPrice": 1.089
    },
    {
        "id": 64,
        "groupId": 32,
        "platform": "Android",
        "productId": "com.sega.colorfulstage.en.set.0005",
        "price": 24.99,
        "unitPrice": 1.089
    },
    {
        "id": 65,
        "groupId": 33,
        "platform": "iOS",
        "productId": "com.sega.colorfulstage.en.livep.0002",
        "price": 17.99,
        "unitPrice": 1.089
    },
    {
        "id": 66,
        "groupId": 33,
        "platform": "Android",
        "productId": "com.sega.colorfulstage.en.livep.0002",
        "price": 17.99,
        "unitPrice": 1.089
    },
    {
        "id": 67,
        "groupId": 34,
        "platform": "iOS",
        "productId": "com.sega.colorfulstage.en.halfyearanniversary.set.0001",
        "price": 3.99,
        "unitPrice": 1.089
    },
    {
        "id": 68,
        "groupId": 34,
        "platform": "Android",
        "productId": "com.sega.colorfulstage.en.halfyearanniversary.set.0001",
        "price": 3.99,
        "unitPrice": 1.089
    },
    {
        "id": 69,
        "groupId": 35,
        "platform": "iOS",
        "productId": "com.sega.colorfulstage.en.halfyearanniversary.set.0002",
        "price": 15.99,
        "unitPrice": 1.089
    },
    {
        "id": 70,
        "groupId": 35,
        "platform": "Android",
        "productId": "com.sega.colorfulstage.en.halfyearanniversary.set.0002",
        "price": 15.99,
        "unitPrice": 1.089
    },
    {
        "id": 71,
        "groupId": 36,
        "platform": "iOS",
        "productId": "com.sega.colorfulstage.en.halfyearanniversary.set.0003",
        "price": 40.99,
        "unitPrice": 1.089
    },
    {
        "id": 72,
        "groupId": 36,
        "platform": "Android",
        "productId": "com.sega.colorfulstage.en.halfyearanniversary.set.0003",
        "price": 40.99,
        "unitPrice": 1.089
    },
    {
        "id": 73,
        "groupId": 37,
        "platform": "iOS",
        "productId": "com.sega.colorfulstage.en.campaign.0004",
        "price": 14.99,
        "unitPrice": 1.023
    },
    {
        "id": 74,
        "groupId": 37,
        "platform": "Android",
        "productId": "com.sega.colorfulstage.en.campaign.0004",
        "price": 14.99,
        "unitPrice": 1.023
    },
    {
        "id": 75,
        "groupId": 38,
        "platform": "iOS",
        "productId": "com.sega.colorfulstage.en.campaign.0005",
        "price": 39.99,
        "unitPrice": 0.98
    },
    {
        "id": 76,
        "groupId": 38,
        "platform": "Android",
        "productId": "com.sega.colorfulstage.en.campaign.0005",
        "price": 39.99,
        "unitPrice": 0.98
    },
    {
        "id": 77,
        "groupId": 39,
        "platform": "iOS",
        "productId": "com.sega.colorfulstage.en.campaign.0006",
        "price": 79.99,
        "unitPrice": 0.953
    },
    {
        "id": 78,
        "groupId": 39,
        "platform": "Android",
        "productId": "com.sega.colorfulstage.en.campaign.0006",
        "price": 79.99,
        "unitPrice": 0.953
    },
    {
        "id": 79,
        "groupId": 40,
        "platform": "iOS",
        "productId": "com.sega.colorfulstage.en.halfyearanniversary.0001",
        "price": 15.99,
        "unitPrice": 1.089
    },
    {
        "id": 80,
        "groupId": 40,
        "platform": "Android",
        "productId": "com.sega.colorfulstage.en.halfyearanniversary.0001",
        "price": 15.99,
        "unitPrice": 1.089
    },
    {
        "id": 81,
        "groupId": 41,
        "platform": "iOS",
        "productId": "com.sega.colorfulstage.en.halfyearanniversary.0002",
        "price": 15.99,
        "unitPrice": 1.089
    },
    {
        "id": 82,
        "groupId": 41,
        "platform": "Android",
        "productId": "com.sega.colorfulstage.en.halfyearanniversary.0002",
        "price": 15.99,
        "unitPrice": 1.089
    },
    {
        "id": 89,
        "groupId": 45,
        "platform": "iOS",
        "productId": "com.sega.colorfulstage.en.set.0021",
        "price": 0.99,
        "unitPrice": 1.091
    },
    {
        "id": 90,
        "groupId": 45,
        "platform": "Android",
        "productId": "com.sega.colorfulstage.en.set.0021",
        "price": 0.99,
        "unitPrice": 1.091
    },
    {
        "id": 97,
        "groupId": 49,
        "platform": "iOS",
        "productId": "com.sega.colorfulstage.en.campaign.0014",
        "price": 14.99,
        "unitPrice": 1.023
    },
    {
        "id": 98,
        "groupId": 49,
        "platform": "Android",
        "productId": "com.sega.colorfulstage.en.campaign.0014",
        "price": 14.99,
        "unitPrice": 1.023
    },
    {
        "id": 99,
        "groupId": 50,
        "platform": "iOS",
        "productId": "com.sega.colorfulstage.en.campaign.0015",
        "price": 39.99,
        "unitPrice": 0.98
    },
    {
        "id": 100,
        "groupId": 50,
        "platform": "Android",
        "productId": "com.sega.colorfulstage.en.campaign.0015",
        "price": 39.99,
        "unitPrice": 0.98
    },
    {
        "id": 101,
        "groupId": 51,
        "platform": "iOS",
        "productId": "com.sega.colorfulstage.en.campaign.0016",
        "price": 79.99,
        "unitPrice": 0.953
    },
    {
        "id": 102,
        "groupId": 51,
        "platform": "Android",
        "productId": "com.sega.colorfulstage.en.campaign.0016",
        "price": 79.99,
        "unitPrice": 0.953
    },
    {
        "id": 103,
        "groupId": 52,
        "platform": "iOS",
        "productId": "com.sega.colorfulstage.en.campaign.0017",
        "price": 14.99,
        "unitPrice": 1.023
    },
    {
        "id": 104,
        "groupId": 52,
        "platform": "Android",
        "productId": "com.sega.colorfulstage.en.campaign.0017",
        "price": 14.99,
        "unitPrice": 1.023
    },
    {
        "id": 105,
        "groupId": 53,
        "platform": "iOS",
        "productId": "com.sega.colorfulstage.en.campaign.0018",
        "price": 39.99,
        "unitPrice": 0.98
    },
    {
        "id": 106,
        "groupId": 53,
        "platform": "Android",
        "productId": "com.sega.colorfulstage.en.campaign.0018",
        "price": 39.99,
        "unitPrice": 0.98
    },
    {
        "id": 107,
        "groupId": 54,
        "platform": "iOS",
        "productId": "com.sega.colorfulstage.en.campaign.0019",
        "price": 79.99,
        "unitPrice": 0.953
    },
    {
        "id": 108,
        "groupId": 54,
        "platform": "Android",
        "productId": "com.sega.colorfulstage.en.campaign.0019",
        "price": 79.99,
        "unitPrice": 0.953
    },
    {
        "id": 109,
        "groupId": 56,
        "platform": "iOS",
        "productId": "com.sega.colorfulstage.en.campaign.0020",
        "price": 0.99,
        "unitPrice": 1.091
    },
    {
        "id": 110,
        "groupId": 56,
        "platform": "Android",
        "productId": "com.sega.colorfulstage.en.campaign.0020",
        "price": 0.99,
        "unitPrice": 1.091
    },
    {
        "id": 111,
        "groupId": 57,
        "platform": "iOS",
        "productId": "com.sega.colorfulstage.en.campaign.0021",
        "price": 2.99,
        "unitPrice": 1.058
    },
    {
        "id": 112,
        "groupId": 57,
        "platform": "Android",
        "productId": "com.sega.colorfulstage.en.campaign.0021",
        "price": 2.99,
        "unitPrice": 1.058
    },
    {
        "id": 113,
        "groupId": 58,
        "platform": "iOS",
        "productId": "com.sega.colorfulstage.en.campaign.0022",
        "price": 7.99,
        "unitPrice": 1.032
    },
    {
        "id": 114,
        "groupId": 58,
        "platform": "Android",
        "productId": "com.sega.colorfulstage.en.campaign.0022",
        "price": 7.99,
        "unitPrice": 1.032
    },
    {
        "id": 115,
        "groupId": 59,
        "platform": "iOS",
        "productId": "com.sega.colorfulstage.en.campaign.0023",
        "price": 14.99,
        "unitPrice": 1.023
    },
    {
        "id": 116,
        "groupId": 59,
        "platform": "Android",
        "productId": "com.sega.colorfulstage.en.campaign.0023",
        "price": 14.99,
        "unitPrice": 1.023
    },
    {
        "id": 117,
        "groupId": 60,
        "platform": "iOS",
        "productId": "com.sega.colorfulstage.en.campaign.0024",
        "price": 24.99,
        "unitPrice": 1
    },
    {
        "id": 118,
        "groupId": 60,
        "platform": "Android",
        "productId": "com.sega.colorfulstage.en.campaign.0024",
        "price": 24.99,
        "unitPrice": 1
    },
    {
        "id": 119,
        "groupId": 61,
        "platform": "iOS",
        "productId": "com.sega.colorfulstage.en.campaign.0025",
        "price": 39.99,
        "unitPrice": 0.98
    },
    {
        "id": 120,
        "groupId": 61,
        "platform": "Android",
        "productId": "com.sega.colorfulstage.en.campaign.0025",
        "price": 39.99,
        "unitPrice": 0.98
    },
    {
        "id": 121,
        "groupId": 62,
        "platform": "iOS",
        "productId": "com.sega.colorfulstage.en.campaign.0026",
        "price": 79.99,
        "unitPrice": 0.953
    },
    {
        "id": 122,
        "groupId": 62,
        "platform": "Android",
        "productId": "com.sega.colorfulstage.en.campaign.0026",
        "price": 79.99,
        "unitPrice": 0.953
    },
    {
        "id": 123,
        "groupId": 63,
        "platform": "iOS",
        "productId": "com.sega.colorfulstage.en.set.0025",
        "price": 15.99,
        "unitPrice": 1.089
    },
    {
        "id": 124,
        "groupId": 63,
        "platform": "Android",
        "productId": "com.sega.colorfulstage.en.set.0025",
        "price": 15.99,
        "unitPrice": 1.089
    },
    {
        "id": 125,
        "groupId": 64,
        "platform": "iOS",
        "productId": "com.sega.colorfulstage.en.campaign.0034",
        "price": 24.99,
        "unitPrice": 1
    },
    {
        "id": 126,
        "groupId": 64,
        "platform": "Android",
        "productId": "com.sega.colorfulstage.en.campaign.0034",
        "price": 24.99,
        "unitPrice": 1
    },
    {
        "id": 127,
        "groupId": 65,
        "platform": "iOS",
        "productId": "com.sega.colorfulstage.en.campaign.0035",
        "price": 39.99,
        "unitPrice": 0.98
    },
    {
        "id": 128,
        "groupId": 65,
        "platform": "Android",
        "productId": "com.sega.colorfulstage.en.campaign.0035",
        "price": 39.99,
        "unitPrice": 0.98
    },
    {
        "id": 129,
        "groupId": 66,
        "platform": "iOS",
        "productId": "com.sega.colorfulstage.en.campaign.0036",
        "price": 79.99,
        "unitPrice": 0.953
    },
    {
        "id": 130,
        "groupId": 66,
        "platform": "Android",
        "productId": "com.sega.colorfulstage.en.campaign.0036",
        "price": 79.99,
        "unitPrice": 0.953
    },
    {
        "id": 143,
        "groupId": 73,
        "platform": "iOS",
        "productId": "com.sega.colorfulstage.en.campaign.0053",
        "price": 24.99,
        "unitPrice": 1
    },
    {
        "id": 144,
        "groupId": 73,
        "platform": "Android",
        "productId": "com.sega.colorfulstage.en.campaign.0053",
        "price": 24.99,
        "unitPrice": 1
    },
    {
        "id": 145,
        "groupId": 74,
        "platform": "iOS",
        "productId": "com.sega.colorfulstage.en.campaign.0054",
        "price": 39.99,
        "unitPrice": 0.98
    },
    {
        "id": 146,
        "groupId": 74,
        "platform": "Android",
        "productId": "com.sega.colorfulstage.en.campaign.0054",
        "price": 39.99,
        "unitPrice": 0.98
    },
    {
        "id": 147,
        "groupId": 75,
        "platform": "iOS",
        "productId": "com.sega.colorfulstage.en.campaign.0055",
        "price": 79.99,
        "unitPrice": 0.953
    },
    {
        "id": 148,
        "groupId": 75,
        "platform": "Android",
        "productId": "com.sega.colorfulstage.en.campaign.0055",
        "price": 79.99,
        "unitPrice": 0.953
    },
    {
        "id": 149,
        "groupId": 76,
        "platform": "iOS",
        "productId": "com.sega.colorfulstage.en.beginnerset.0009",
        "price": 39.99,
        "unitPrice": 1
    },
    {
        "id": 150,
        "groupId": 76,
        "platform": "Android",
        "productId": "com.sega.colorfulstage.en.beginnerset.0009",
        "price": 39.99,
        "unitPrice": 1
    },
    {
        "id": 151,
        "groupId": 77,
        "platform": "iOS",
        "productId": "com.sega.colorfulstage.en.campaign.0074",
        "price": 24.99,
        "unitPrice": 1
    },
    {
        "id": 152,
        "groupId": 77,
        "platform": "Android",
        "productId": "com.sega.colorfulstage.en.campaign.0074",
        "price": 24.99,
        "unitPrice": 1
    },
    {
        "id": 153,
        "groupId": 78,
        "platform": "iOS",
        "productId": "com.sega.colorfulstage.en.campaign.0075",
        "price": 39.99,
        "unitPrice": 0.98
    },
    {
        "id": 154,
        "groupId": 78,
        "platform": "Android",
        "productId": "com.sega.colorfulstage.en.campaign.0075",
        "price": 39.99,
        "unitPrice": 0.98
    },
    {
        "id": 155,
        "groupId": 79,
        "platform": "iOS",
        "productId": "com.sega.colorfulstage.en.campaign.0076",
        "price": 79.99,
        "unitPrice": 0.953
    },
    {
        "id": 156,
        "groupId": 79,
        "platform": "Android",
        "productId": "com.sega.colorfulstage.en.campaign.0076",
        "price": 79.99,
        "unitPrice": 0.953
    },
    {
        "id": 20100,
        "groupId": 20100,
        "platform": "iOS",
        "productId": "com.sega.colorfulstage.en.offer.0001",
        "price": 0.99,
        "unitPrice": 1.091
    },
    {
        "id": 20101,
        "groupId": 20100,
        "platform": "Android",
        "productId": "com.sega.colorfulstage.en.offer.0001",
        "price": 0.99,
        "unitPrice": 1.091
    },
    {
        "id": 20102,
        "groupId": 20101,
        "platform": "iOS",
        "productId": "com.sega.colorfulstage.en.offer.0002",
        "price": 24.99,
        "unitPrice": 1.089
    },
    {
        "id": 20103,
        "groupId": 20101,
        "platform": "Android",
        "productId": "com.sega.colorfulstage.en.offer.0002",
        "price": 24.99,
        "unitPrice": 1.089
    },
    {
        "id": 20104,
        "groupId": 20102,
        "platform": "iOS",
        "productId": "com.sega.colorfulstage.en.offer.0003",
        "price": 0.99,
        "unitPrice": 1.091
    },
    {
        "id": 20105,
        "groupId": 20102,
        "platform": "Android",
        "productId": "com.sega.colorfulstage.en.offer.0003",
        "price": 0.99,
        "unitPrice": 1.091
    },
    {
        "id": 20106,
        "groupId": 20103,
        "platform": "iOS",
        "productId": "com.sega.colorfulstage.en.offer.0004",
        "price": 24.99,
        "unitPrice": 1.089
    },
    {
        "id": 20107,
        "groupId": 20103,
        "platform": "Android",
        "productId": "com.sega.colorfulstage.en.offer.0004",
        "price": 24.99,
        "unitPrice": 1.089
    },
    {
        "id": 20108,
        "groupId": 20104,
        "platform": "iOS",
        "productId": "com.sega.colorfulstage.en.offer.0005",
        "price": 0.99,
        "unitPrice": 1.091
    },
    {
        "id": 20109,
        "groupId": 20104,
        "platform": "Android",
        "productId": "com.sega.colorfulstage.en.offer.0005",
        "price": 0.99,
        "unitPrice": 1.091
    },
    {
        "id": 20110,
        "groupId": 20105,
        "platform": "iOS",
        "productId": "com.sega.colorfulstage.en.offer.0006",
        "price": 7.99,
        "unitPrice": 1.032
    },
    {
        "id": 20111,
        "groupId": 20105,
        "platform": "Android",
        "productId": "com.sega.colorfulstage.en.offer.0006",
        "price": 7.99,
        "unitPrice": 1.032
    },
    {
        "id": 20112,
        "groupId": 20106,
        "platform": "iOS",
        "productId": "com.sega.colorfulstage.en.offer.0007",
        "price": 14.99,
        "unitPrice": 1.023
    },
    {
        "id": 20113,
        "groupId": 20106,
        "platform": "Android",
        "productId": "com.sega.colorfulstage.en.offer.0007",
        "price": 14.99,
        "unitPrice": 1.023
    },
    {
        "id": 20114,
        "groupId": 20107,
        "platform": "iOS",
        "productId": "com.sega.colorfulstage.en.offer.0008",
        "price": 24.99,
        "unitPrice": 1.089
    },
    {
        "id": 20115,
        "groupId": 20107,
        "platform": "Android",
        "productId": "com.sega.colorfulstage.en.offer.0008",
        "price": 24.99,
        "unitPrice": 1.089
    },
    {
        "id": 20116,
        "groupId": 20108,
        "platform": "iOS",
        "productId": "com.sega.colorfulstage.en.offer.0009",
        "price": 24.99,
        "unitPrice": 1.089
    },
    {
        "id": 20117,
        "groupId": 20108,
        "platform": "Android",
        "productId": "com.sega.colorfulstage.en.offer.0009",
        "price": 24.99,
        "unitPrice": 1.089
    },
    {
        "id": 20118,
        "groupId": 20109,
        "platform": "iOS",
        "productId": "com.sega.colorfulstage.en.offer.0010",
        "price": 24.99,
        "unitPrice": 1.089
    },
    {
        "id": 20119,
        "groupId": 20109,
        "platform": "Android",
        "productId": "com.sega.colorfulstage.en.offer.0010",
        "price": 24.99,
        "unitPrice": 1.089
    },
    {
        "id": 20120,
        "groupId": 20110,
        "platform": "iOS",
        "productId": "com.sega.colorfulstage.en.offer.0011",
        "price": 3.99,
        "unitPrice": 1.089
    },
    {
        "id": 20121,
        "groupId": 20110,
        "platform": "Android",
        "productId": "com.sega.colorfulstage.en.offer.0011",
        "price": 3.99,
        "unitPrice": 1.089
    },
    {
        "id": 20122,
        "groupId": 20111,
        "platform": "iOS",
        "productId": "com.sega.colorfulstage.en.offer.0012",
        "price": 7.99,
        "unitPrice": 1.032
    },
    {
        "id": 20123,
        "groupId": 20111,
        "platform": "Android",
        "productId": "com.sega.colorfulstage.en.offer.0012",
        "price": 7.99,
        "unitPrice": 1.032
    },
    {
        "id": 20124,
        "groupId": 20112,
        "platform": "iOS",
        "productId": "com.sega.colorfulstage.en.offer.0013",
        "price": 24.99,
        "unitPrice": 1.089
    },
    {
        "id": 20125,
        "groupId": 20112,
        "platform": "Android",
        "productId": "com.sega.colorfulstage.en.offer.0013",
        "price": 24.99,
        "unitPrice": 1.089
    },
    {
        "id": 20126,
        "groupId": 20113,
        "platform": "iOS",
        "productId": "com.sega.colorfulstage.en.offer.0014",
        "price": 0.99,
        "unitPrice": 1.091
    },
    {
        "id": 20127,
        "groupId": 20113,
        "platform": "Android",
        "productId": "com.sega.colorfulstage.en.offer.0014",
        "price": 0.99,
        "unitPrice": 1.091
    },
    {
        "id": 20128,
        "groupId": 20114,
        "platform": "iOS",
        "productId": "com.sega.colorfulstage.en.offer.0015",
        "price": 7.99,
        "unitPrice": 1.032
    },
    {
        "id": 20129,
        "groupId": 20114,
        "platform": "Android",
        "productId": "com.sega.colorfulstage.en.offer.0015",
        "price": 7.99,
        "unitPrice": 1.032
    },
    {
        "id": 20130,
        "groupId": 20115,
        "platform": "iOS",
        "productId": "com.sega.colorfulstage.en.offer.0016",
        "price": 24.99,
        "unitPrice": 1.089
    },
    {
        "id": 20131,
        "groupId": 20115,
        "platform": "Android",
        "productId": "com.sega.colorfulstage.en.offer.0016",
        "price": 24.99,
        "unitPrice": 1.089
    },
    {
        "id": 20132,
        "groupId": 20116,
        "platform": "iOS",
        "productId": "com.sega.colorfulstage.en.offer.0017",
        "price": 24.99,
        "unitPrice": 1.089
    },
    {
        "id": 20133,
        "groupId": 20116,
        "platform": "Android",
        "productId": "com.sega.colorfulstage.en.offer.0017",
        "price": 24.99,
        "unitPrice": 1.089
    },
    {
        "id": 20134,
        "groupId": 20117,
        "platform": "iOS",
        "productId": "com.sega.colorfulstage.en.offer.0018",
        "price": 24.99,
        "unitPrice": 1.089
    },
    {
        "id": 20135,
        "groupId": 20117,
        "platform": "Android",
        "productId": "com.sega.colorfulstage.en.offer.0018",
        "price": 24.99,
        "unitPrice": 1.089
    },
    {
        "id": 20136,
        "groupId": 20118,
        "platform": "iOS",
        "productId": "com.sega.colorfulstage.en.offer.0019",
        "price": 3.99,
        "unitPrice": 1.089
    },
    {
        "id": 20137,
        "groupId": 20118,
        "platform": "Android",
        "productId": "com.sega.colorfulstage.en.offer.0019",
        "price": 3.99,
        "unitPrice": 1.089
    },
    {
        "id": 20138,
        "groupId": 20119,
        "platform": "iOS",
        "productId": "com.sega.colorfulstage.en.offer.0020",
        "price": 7.99,
        "unitPrice": 1.032
    },
    {
        "id": 20139,
        "groupId": 20119,
        "platform": "Android",
        "productId": "com.sega.colorfulstage.en.offer.0020",
        "price": 7.99,
        "unitPrice": 1.032
    },
    {
        "id": 20140,
        "groupId": 20120,
        "platform": "iOS",
        "productId": "com.sega.colorfulstage.en.offer.0021",
        "price": 24.99,
        "unitPrice": 1.089
    },
    {
        "id": 20141,
        "groupId": 20120,
        "platform": "Android",
        "productId": "com.sega.colorfulstage.en.offer.0021",
        "price": 24.99,
        "unitPrice": 1.089
    },
    {
        "id": 20142,
        "groupId": 20142,
        "platform": "iOS",
        "productId": "com.sega.colorfulstage.en.offer.0022",
        "price": 7.99,
        "unitPrice": 1.032
    },
    {
        "id": 20143,
        "groupId": 20142,
        "platform": "Android",
        "productId": "com.sega.colorfulstage.en.offer.0022",
        "price": 7.99,
        "unitPrice": 1.032
    },
    {
        "id": 20144,
        "groupId": 20144,
        "platform": "iOS",
        "productId": "com.sega.colorfulstage.en.offer.0023",
        "price": 7.99,
        "unitPrice": 1.032
    },
    {
        "id": 20145,
        "groupId": 20144,
        "platform": "Android",
        "productId": "com.sega.colorfulstage.en.offer.0023",
        "price": 7.99,
        "unitPrice": 1.032
    },
    {
        "id": 20146,
        "groupId": 20146,
        "platform": "iOS",
        "productId": "com.sega.colorfulstage.en.offer.0024",
        "price": 7.99,
        "unitPrice": 1.032
    },
    {
        "id": 20147,
        "groupId": 20146,
        "platform": "Android",
        "productId": "com.sega.colorfulstage.en.offer.0024",
        "price": 7.99,
        "unitPrice": 1.032
    },
    {
        "id": 20148,
        "groupId": 20148,
        "platform": "iOS",
        "productId": "com.sega.colorfulstage.en.offer.0025",
        "price": 14.99,
        "unitPrice": 1.023
    },
    {
        "id": 20149,
        "groupId": 20148,
        "platform": "Android",
        "productId": "com.sega.colorfulstage.en.offer.0025",
        "price": 14.99,
        "unitPrice": 1.023
    },
    {
        "id": 20150,
        "groupId": 20150,
        "platform": "iOS",
        "productId": "com.sega.colorfulstage.en.offer.0026",
        "price": 24.99,
        "unitPrice": 1.089
    },
    {
        "id": 20151,
        "groupId": 20150,
        "platform": "Android",
        "productId": "com.sega.colorfulstage.en.offer.0026",
        "price": 24.99,
        "unitPrice": 1.089
    },
    {
        "id": 20152,
        "groupId": 20152,
        "platform": "iOS",
        "productId": "com.sega.colorfulstage.en.offer.0027",
        "price": 3.99,
        "unitPrice": 1.089
    },
    {
        "id": 20153,
        "groupId": 20152,
        "platform": "Android",
        "productId": "com.sega.colorfulstage.en.offer.0027",
        "price": 3.99,
        "unitPrice": 1.089
    },
    {
        "id": 20154,
        "groupId": 20154,
        "platform": "iOS",
        "productId": "com.sega.colorfulstage.en.offer.0028",
        "price": 7.99,
        "unitPrice": 1.032
    },
    {
        "id": 20155,
        "groupId": 20154,
        "platform": "Android",
        "productId": "com.sega.colorfulstage.en.offer.0028",
        "price": 7.99,
        "unitPrice": 1.032
    },
    {
        "id": 20156,
        "groupId": 20156,
        "platform": "iOS",
        "productId": "com.sega.colorfulstage.en.offer.0029",
        "price": 7.99,
        "unitPrice": 1.032
    },
    {
        "id": 20157,
        "groupId": 20156,
        "platform": "Android",
        "productId": "com.sega.colorfulstage.en.offer.0029",
        "price": 7.99,
        "unitPrice": 1.032
    },
    {
        "id": 20158,
        "groupId": 20158,
        "platform": "iOS",
        "productId": "com.sega.colorfulstage.en.offer.0030",
        "price": 19.99,
        "unitPrice": 1
    },
    {
        "id": 20159,
        "groupId": 20158,
        "platform": "Android",
        "productId": "com.sega.colorfulstage.en.offer.0030",
        "price": 19.99,
        "unitPrice": 1
    },
    {
        "id": 20160,
        "groupId": 20160,
        "platform": "iOS",
        "productId": "com.sega.colorfulstage.en.offer.0031",
        "price": 37.99,
        "unitPrice": 1
    },
    {
        "id": 20161,
        "groupId": 20160,
        "platform": "Android",
        "productId": "com.sega.colorfulstage.en.offer.0031",
        "price": 37.99,
        "unitPrice": 1
    },
    {
        "id": 20162,
        "groupId": 20162,
        "platform": "iOS",
        "productId": "com.sega.colorfulstage.en.offer.0032",
        "price": 37.99,
        "unitPrice": 1
    },
    {
        "id": 20163,
        "groupId": 20162,
        "platform": "Android",
        "productId": "com.sega.colorfulstage.en.offer.0032",
        "price": 37.99,
        "unitPrice": 1
    },
    {
        "id": 20164,
        "groupId": 20164,
        "platform": "iOS",
        "productId": "com.sega.colorfulstage.en.offer.0033",
        "price": 3.99,
        "unitPrice": 1.089
    },
    {
        "id": 20165,
        "groupId": 20164,
        "platform": "Android",
        "productId": "com.sega.colorfulstage.en.offer.0033",
        "price": 3.99,
        "unitPrice": 1.089
    },
    {
        "id": 50000,
        "groupId": 50000,
        "platform": "iOS",
        "productId": "com.sega.colorfulstage.en.campaign.9007",
        "price": 14.99,
        "unitPrice": 1.023
    },
    {
        "id": 50001,
        "groupId": 50000,
        "platform": "Android",
        "productId": "com.sega.colorfulstage.en.campaign.9007",
        "price": 14.99,
        "unitPrice": 1.023
    },
    {
        "id": 50002,
        "groupId": 50001,
        "platform": "iOS",
        "productId": "com.sega.colorfulstage.en.campaign.9008",
        "price": 39.99,
        "unitPrice": 0.98
    },
    {
        "id": 50003,
        "groupId": 50001,
        "platform": "Android",
        "productId": "com.sega.colorfulstage.en.campaign.9008",
        "price": 39.99,
        "unitPrice": 0.98
    },
    {
        "id": 50004,
        "groupId": 50002,
        "platform": "iOS",
        "productId": "com.sega.colorfulstage.en.campaign.9009",
        "price": 79.99,
        "unitPrice": 0.953
    },
    {
        "id": 50005,
        "groupId": 50002,
        "platform": "Android",
        "productId": "com.sega.colorfulstage.en.campaign.9009",
        "price": 79.99,
        "unitPrice": 0.953
    },
    {
        "id": 50006,
        "groupId": 50003,
        "platform": "iOS",
        "productId": "com.sega.colorfulstage.en.set.9021",
        "price": 0.99,
        "unitPrice": 1.091
    },
    {
        "id": 50007,
        "groupId": 50003,
        "platform": "Android",
        "productId": "com.sega.colorfulstage.en.set.9021",
        "price": 0.99,
        "unitPrice": 1.091
    },
    {
        "id": 50008,
        "groupId": 50004,
        "platform": "iOS",
        "productId": "com.sega.colorfulstage.en.set.9022",
        "price": 3.99,
        "unitPrice": 1.089
    },
    {
        "id": 50009,
        "groupId": 50004,
        "platform": "Android",
        "productId": "com.sega.colorfulstage.en.set.9022",
        "price": 3.99,
        "unitPrice": 1.089
    },
    {
        "id": 50010,
        "groupId": 50005,
        "platform": "iOS",
        "productId": "com.sega.colorfulstage.en.set.9023",
        "price": 24.99,
        "unitPrice": 1.089
    },
    {
        "id": 50011,
        "groupId": 50005,
        "platform": "Android",
        "productId": "com.sega.colorfulstage.en.set.9023",
        "price": 24.99,
        "unitPrice": 1.089
    },
    {
        "id": 50012,
        "groupId": 50006,
        "platform": "iOS",
        "productId": "com.sega.colorfulstage.en.set.9024",
        "price": 79.99,
        "unitPrice": 1.087
    },
    {
        "id": 50013,
        "groupId": 50006,
        "platform": "Android",
        "productId": "com.sega.colorfulstage.en.set.9024",
        "price": 79.99,
        "unitPrice": 1.087
    },
    {
        "id": 50014,
        "groupId": 50014,
        "platform": "iOS",
        "productId": "com.sega.colorfulstage.en.campaign.0010",
        "price": 2.99,
        "unitPrice": 1.089
    },
    {
        "id": 50015,
        "groupId": 50014,
        "platform": "Android",
        "productId": "com.sega.colorfulstage.en.campaign.0010",
        "price": 2.99,
        "unitPrice": 1.089
    },
    {
        "id": 50016,
        "groupId": 50016,
        "platform": "iOS",
        "productId": "com.sega.colorfulstage.en.campaign.0011",
        "price": 24.99,
        "unitPrice": 1.089
    },
    {
        "id": 50017,
        "groupId": 50016,
        "platform": "Android",
        "productId": "com.sega.colorfulstage.en.campaign.0011",
        "price": 24.99,
        "unitPrice": 1.089
    },
    {
        "id": 50018,
        "groupId": 50018,
        "platform": "iOS",
        "productId": "com.sega.colorfulstage.en.campaign.0012",
        "price": 39.99,
        "unitPrice": 0.98
    },
    {
        "id": 50019,
        "groupId": 50018,
        "platform": "Android",
        "productId": "com.sega.colorfulstage.en.campaign.0012",
        "price": 39.99,
        "unitPrice": 0.98
    },
    {
        "id": 50020,
        "groupId": 50020,
        "platform": "iOS",
        "productId": "com.sega.colorfulstage.en.campaign.0013",
        "price": 79.99,
        "unitPrice": 1.087
    },
    {
        "id": 50021,
        "groupId": 50020,
        "platform": "Android",
        "productId": "com.sega.colorfulstage.en.campaign.0013",
        "price": 79.99,
        "unitPrice": 1.087
    },
    {
        "id": 50022,
        "groupId": 50022,
        "platform": "iOS",
        "productId": "com.sega.colorfulstage.en.campaign.9907",
        "price": 14.99,
        "unitPrice": 1.023
    },
    {
        "id": 50023,
        "groupId": 50022,
        "platform": "Android",
        "productId": "com.sega.colorfulstage.en.campaign.9907",
        "price": 14.99,
        "unitPrice": 1.023
    },
    {
        "id": 50024,
        "groupId": 50024,
        "platform": "iOS",
        "productId": "com.sega.colorfulstage.en.campaign.9908",
        "price": 39.99,
        "unitPrice": 0.98
    },
    {
        "id": 50025,
        "groupId": 50024,
        "platform": "Android",
        "productId": "com.sega.colorfulstage.en.campaign.9908",
        "price": 39.99,
        "unitPrice": 0.98
    },
    {
        "id": 50026,
        "groupId": 50026,
        "platform": "iOS",
        "productId": "com.sega.colorfulstage.en.campaign.9909",
        "price": 79.99,
        "unitPrice": 0.953
    },
    {
        "id": 50027,
        "groupId": 50026,
        "platform": "Android",
        "productId": "com.sega.colorfulstage.en.campaign.9909",
        "price": 79.99,
        "unitPrice": 0.953
    },
    {
        "id": 50028,
        "groupId": 50028,
        "platform": "iOS",
        "productId": "com.sega.colorfulstage.en.set.9921",
        "price": 0.99,
        "unitPrice": 1.091
    },
    {
        "id": 50029,
        "groupId": 50028,
        "platform": "Android",
        "productId": "com.sega.colorfulstage.en.set.9921",
        "price": 0.99,
        "unitPrice": 1.091
    },
    {
        "id": 50030,
        "groupId": 50030,
        "platform": "iOS",
        "productId": "com.sega.colorfulstage.en.set.9922",
        "price": 3.99,
        "unitPrice": 1.089
    },
    {
        "id": 50031,
        "groupId": 50030,
        "platform": "Android",
        "productId": "com.sega.colorfulstage.en.set.9922",
        "price": 3.99,
        "unitPrice": 1.089
    },
    {
        "id": 50032,
        "groupId": 50032,
        "platform": "iOS",
        "productId": "com.sega.colorfulstage.en.set.9923",
        "price": 24.99,
        "unitPrice": 1.089
    },
    {
        "id": 50033,
        "groupId": 50032,
        "platform": "Android",
        "productId": "com.sega.colorfulstage.en.set.9923",
        "price": 24.99,
        "unitPrice": 1.089
    },
    {
        "id": 50034,
        "groupId": 50034,
        "platform": "iOS",
        "productId": "com.sega.colorfulstage.en.set.9924",
        "price": 79.99,
        "unitPrice": 1.087
    },
    {
        "id": 50035,
        "groupId": 50034,
        "platform": "Android",
        "productId": "com.sega.colorfulstage.en.set.9924",
        "price": 79.99,
        "unitPrice": 1.087
    },
    {
        "id": 50036,
        "groupId": 50036,
        "platform": "iOS",
        "productId": "com.sega.colorfulstage.en.campaign.9917",
        "price": 14.99,
        "unitPrice": 1.023
    },
    {
        "id": 50037,
        "groupId": 50036,
        "platform": "Android",
        "productId": "com.sega.colorfulstage.en.campaign.9917",
        "price": 14.99,
        "unitPrice": 1.023
    },
    {
        "id": 50038,
        "groupId": 50038,
        "platform": "iOS",
        "productId": "com.sega.colorfulstage.en.campaign.9918",
        "price": 39.99,
        "unitPrice": 0.98
    },
    {
        "id": 50039,
        "groupId": 50038,
        "platform": "Android",
        "productId": "com.sega.colorfulstage.en.campaign.9918",
        "price": 39.99,
        "unitPrice": 0.98
    },
    {
        "id": 50040,
        "groupId": 50040,
        "platform": "iOS",
        "productId": "com.sega.colorfulstage.en.campaign.9919",
        "price": 79.99,
        "unitPrice": 0.953
    },
    {
        "id": 50041,
        "groupId": 50040,
        "platform": "Android",
        "productId": "com.sega.colorfulstage.en.campaign.9919",
        "price": 79.99,
        "unitPrice": 0.953
    },
    {
        "id": 50042,
        "groupId": 50042,
        "platform": "iOS",
        "productId": "com.sega.colorfulstage.en.campaign.9920",
        "price": 0.99,
        "unitPrice": 1.091
    },
    {
        "id": 50043,
        "groupId": 50042,
        "platform": "Android",
        "productId": "com.sega.colorfulstage.en.campaign.9920",
        "price": 0.99,
        "unitPrice": 1.091
    },
    {
        "id": 50044,
        "groupId": 50044,
        "platform": "iOS",
        "productId": "com.sega.colorfulstage.en.campaign.9921",
        "price": 2.99,
        "unitPrice": 1.058
    },
    {
        "id": 50045,
        "groupId": 50044,
        "platform": "Android",
        "productId": "com.sega.colorfulstage.en.campaign.9921",
        "price": 2.99,
        "unitPrice": 1.058
    },
    {
        "id": 50046,
        "groupId": 50046,
        "platform": "iOS",
        "productId": "com.sega.colorfulstage.en.campaign.9922",
        "price": 7.99,
        "unitPrice": 1.032
    },
    {
        "id": 50047,
        "groupId": 50046,
        "platform": "Android",
        "productId": "com.sega.colorfulstage.en.campaign.9922",
        "price": 7.99,
        "unitPrice": 1.032
    },
    {
        "id": 50048,
        "groupId": 50048,
        "platform": "iOS",
        "productId": "com.sega.colorfulstage.en.campaign.9923",
        "price": 14.99,
        "unitPrice": 1.023
    },
    {
        "id": 50049,
        "groupId": 50048,
        "platform": "Android",
        "productId": "com.sega.colorfulstage.en.campaign.9923",
        "price": 14.99,
        "unitPrice": 1.023
    },
    {
        "id": 50050,
        "groupId": 50050,
        "platform": "iOS",
        "productId": "com.sega.colorfulstage.en.campaign.9924",
        "price": 24.99,
        "unitPrice": 1
    },
    {
        "id": 50051,
        "groupId": 50050,
        "platform": "Android",
        "productId": "com.sega.colorfulstage.en.campaign.9924",
        "price": 24.99,
        "unitPrice": 1
    },
    {
        "id": 50052,
        "groupId": 50052,
        "platform": "iOS",
        "productId": "com.sega.colorfulstage.en.campaign.9925",
        "price": 39.99,
        "unitPrice": 0.98
    },
    {
        "id": 50053,
        "groupId": 50052,
        "platform": "Android",
        "productId": "com.sega.colorfulstage.en.campaign.9925",
        "price": 39.99,
        "unitPrice": 0.98
    },
    {
        "id": 50054,
        "groupId": 50054,
        "platform": "iOS",
        "productId": "com.sega.colorfulstage.en.campaign.9926",
        "price": 79.99,
        "unitPrice": 0.953
    },
    {
        "id": 50055,
        "groupId": 50054,
        "platform": "Android",
        "productId": "com.sega.colorfulstage.en.campaign.9926",
        "price": 79.99,
        "unitPrice": 0.953
    },
    {
        "id": 50056,
        "groupId": 50056,
        "platform": "iOS",
        "productId": "com.sega.colorfulstage.en.campaign.0027",
        "price": 0.99,
        "unitPrice": 1.091
    },
    {
        "id": 50057,
        "groupId": 50056,
        "platform": "Android",
        "productId": "com.sega.colorfulstage.en.campaign.0027",
        "price": 0.99,
        "unitPrice": 1.091
    },
    {
        "id": 50058,
        "groupId": 50058,
        "platform": "iOS",
        "productId": "com.sega.colorfulstage.en.campaign.0028",
        "price": 2.99,
        "unitPrice": 1.058
    },
    {
        "id": 50059,
        "groupId": 50058,
        "platform": "Android",
        "productId": "com.sega.colorfulstage.en.campaign.0028",
        "price": 2.99,
        "unitPrice": 1.058
    },
    {
        "id": 50060,
        "groupId": 50060,
        "platform": "iOS",
        "productId": "com.sega.colorfulstage.en.campaign.0029",
        "price": 7.99,
        "unitPrice": 1.032
    },
    {
        "id": 50061,
        "groupId": 50060,
        "platform": "Android",
        "productId": "com.sega.colorfulstage.en.campaign.0029",
        "price": 7.99,
        "unitPrice": 1.032
    },
    {
        "id": 50062,
        "groupId": 50062,
        "platform": "iOS",
        "productId": "com.sega.colorfulstage.en.campaign.0030",
        "price": 14.99,
        "unitPrice": 1.023
    },
    {
        "id": 50063,
        "groupId": 50062,
        "platform": "Android",
        "productId": "com.sega.colorfulstage.en.campaign.0030",
        "price": 14.99,
        "unitPrice": 1.023
    },
    {
        "id": 50064,
        "groupId": 50064,
        "platform": "iOS",
        "productId": "com.sega.colorfulstage.en.campaign.0031",
        "price": 24.99,
        "unitPrice": 1
    },
    {
        "id": 50065,
        "groupId": 50064,
        "platform": "Android",
        "productId": "com.sega.colorfulstage.en.campaign.0031",
        "price": 24.99,
        "unitPrice": 1
    },
    {
        "id": 50066,
        "groupId": 50066,
        "platform": "iOS",
        "productId": "com.sega.colorfulstage.en.campaign.0032",
        "price": 39.99,
        "unitPrice": 0.98
    },
    {
        "id": 50067,
        "groupId": 50066,
        "platform": "Android",
        "productId": "com.sega.colorfulstage.en.campaign.0032",
        "price": 39.99,
        "unitPrice": 0.98
    },
    {
        "id": 50068,
        "groupId": 50068,
        "platform": "iOS",
        "productId": "com.sega.colorfulstage.en.campaign.0033",
        "price": 79.99,
        "unitPrice": 0.953
    },
    {
        "id": 50069,
        "groupId": 50068,
        "platform": "Android",
        "productId": "com.sega.colorfulstage.en.campaign.0033",
        "price": 79.99,
        "unitPrice": 0.953
    },
    {
        "id": 50070,
        "groupId": 50070,
        "platform": "iOS",
        "productId": "com.sega.colorfulstage.en.campaign.0037",
        "price": 0.99,
        "unitPrice": 1.091
    },
    {
        "id": 50071,
        "groupId": 50070,
        "platform": "Android",
        "productId": "com.sega.colorfulstage.en.campaign.0037",
        "price": 0.99,
        "unitPrice": 1.091
    },
    {
        "id": 50072,
        "groupId": 50072,
        "platform": "iOS",
        "productId": "com.sega.colorfulstage.en.campaign.0038",
        "price": 7.99,
        "unitPrice": 1.032
    },
    {
        "id": 50073,
        "groupId": 50072,
        "platform": "Android",
        "productId": "com.sega.colorfulstage.en.campaign.0038",
        "price": 7.99,
        "unitPrice": 1.032
    },
    {
        "id": 50076,
        "groupId": 50076,
        "platform": "iOS",
        "productId": "com.sega.colorfulstage.en.campaign.0040",
        "price": 4.99,
        "unitPrice": 1.089
    },
    {
        "id": 50077,
        "groupId": 50076,
        "platform": "Android",
        "productId": "com.sega.colorfulstage.en.campaign.0040",
        "price": 4.99,
        "unitPrice": 1.089
    },
    {
        "id": 50078,
        "groupId": 50078,
        "platform": "iOS",
        "productId": "com.sega.colorfulstage.en.campaign.0041",
        "price": 2.99,
        "unitPrice": 1.058
    },
    {
        "id": 50079,
        "groupId": 50078,
        "platform": "Android",
        "productId": "com.sega.colorfulstage.en.campaign.0041",
        "price": 2.99,
        "unitPrice": 1.058
    },
    {
        "id": 50080,
        "groupId": 50080,
        "platform": "iOS",
        "productId": "com.sega.colorfulstage.en.campaign.0042",
        "price": 24.99,
        "unitPrice": 1
    },
    {
        "id": 50081,
        "groupId": 50080,
        "platform": "Android",
        "productId": "com.sega.colorfulstage.en.campaign.0042",
        "price": 24.99,
        "unitPrice": 1
    },
    {
        "id": 50082,
        "groupId": 50082,
        "platform": "iOS",
        "productId": "com.sega.colorfulstage.en.campaign.0043",
        "price": 39.99,
        "unitPrice": 0.98
    },
    {
        "id": 50083,
        "groupId": 50082,
        "platform": "Android",
        "productId": "com.sega.colorfulstage.en.campaign.0043",
        "price": 39.99,
        "unitPrice": 0.98
    },
    {
        "id": 50084,
        "groupId": 50084,
        "platform": "iOS",
        "productId": "com.sega.colorfulstage.en.campaign.0044",
        "price": 79.99,
        "unitPrice": 0.953
    },
    {
        "id": 50085,
        "groupId": 50084,
        "platform": "Android",
        "productId": "com.sega.colorfulstage.en.campaign.0044",
        "price": 79.99,
        "unitPrice": 0.953
    },
    {
        "id": 50086,
        "groupId": 50086,
        "platform": "iOS",
        "productId": "com.sega.colorfulstage.en.campaign.0045",
        "price": 24.99,
        "unitPrice": 1
    },
    {
        "id": 50087,
        "groupId": 50086,
        "platform": "Android",
        "productId": "com.sega.colorfulstage.en.campaign.0045",
        "price": 24.99,
        "unitPrice": 1
    },
    {
        "id": 50088,
        "groupId": 50088,
        "platform": "iOS",
        "productId": "com.sega.colorfulstage.en.campaign.0046",
        "price": 39.99,
        "unitPrice": 0.98
    },
    {
        "id": 50089,
        "groupId": 50088,
        "platform": "Android",
        "productId": "com.sega.colorfulstage.en.campaign.0046",
        "price": 39.99,
        "unitPrice": 0.98
    },
    {
        "id": 50090,
        "groupId": 50090,
        "platform": "iOS",
        "productId": "com.sega.colorfulstage.en.campaign.0047",
        "price": 79.99,
        "unitPrice": 0.953
    },
    {
        "id": 50091,
        "groupId": 50090,
        "platform": "Android",
        "productId": "com.sega.colorfulstage.en.campaign.0047",
        "price": 79.99,
        "unitPrice": 0.953
    },
    {
        "id": 50092,
        "groupId": 50092,
        "platform": "iOS",
        "productId": "com.sega.colorfulstage.en.campaign.0048",
        "price": 4.99,
        "unitPrice": 1.089
    },
    {
        "id": 50093,
        "groupId": 50092,
        "platform": "Android",
        "productId": "com.sega.colorfulstage.en.campaign.0048",
        "price": 4.99,
        "unitPrice": 1.089
    },
    {
        "id": 50094,
        "groupId": 50094,
        "platform": "iOS",
        "productId": "com.sega.colorfulstage.en.campaign.0049",
        "price": 4.99,
        "unitPrice": 1.089
    },
    {
        "id": 50095,
        "groupId": 50094,
        "platform": "Android",
        "productId": "com.sega.colorfulstage.en.campaign.0049",
        "price": 4.99,
        "unitPrice": 1.089
    },
    {
        "id": 50096,
        "groupId": 50096,
        "platform": "iOS",
        "productId": "com.sega.colorfulstage.en.campaign.0050",
        "price": 12.99,
        "unitPrice": 1.023
    },
    {
        "id": 50097,
        "groupId": 50096,
        "platform": "Android",
        "productId": "com.sega.colorfulstage.en.campaign.0050",
        "price": 12.99,
        "unitPrice": 1.023
    },
    {
        "id": 50098,
        "groupId": 50098,
        "platform": "iOS",
        "productId": "com.sega.colorfulstage.en.campaign.0051",
        "price": 29.99,
        "unitPrice": 1
    },
    {
        "id": 50099,
        "groupId": 50098,
        "platform": "Android",
        "productId": "com.sega.colorfulstage.en.campaign.0051",
        "price": 29.99,
        "unitPrice": 1
    },
    {
        "id": 50100,
        "groupId": 50100,
        "platform": "iOS",
        "productId": "com.sega.colorfulstage.en.campaign.0052",
        "price": 2.99,
        "unitPrice": 1.058
    },
    {
        "id": 50101,
        "groupId": 50100,
        "platform": "Android",
        "productId": "com.sega.colorfulstage.en.campaign.0052",
        "price": 2.99,
        "unitPrice": 1.058
    },
    {
        "id": 50102,
        "groupId": 50102,
        "platform": "iOS",
        "productId": "com.sega.colorfulstage.en.campaign.0056",
        "price": 0.99,
        "unitPrice": 1.091
    },
    {
        "id": 50103,
        "groupId": 50102,
        "platform": "Android",
        "productId": "com.sega.colorfulstage.en.campaign.0056",
        "price": 0.99,
        "unitPrice": 1.091
    },
    {
        "id": 50104,
        "groupId": 50104,
        "platform": "iOS",
        "productId": "com.sega.colorfulstage.en.campaign.0057",
        "price": 4.99,
        "unitPrice": 1.089
    },
    {
        "id": 50105,
        "groupId": 50104,
        "platform": "Android",
        "productId": "com.sega.colorfulstage.en.campaign.0057",
        "price": 4.99,
        "unitPrice": 1.089
    },
    {
        "id": 50106,
        "groupId": 50106,
        "platform": "iOS",
        "productId": "com.sega.colorfulstage.en.campaign.0058",
        "price": 2.99,
        "unitPrice": 1.058
    },
    {
        "id": 50107,
        "groupId": 50106,
        "platform": "Android",
        "productId": "com.sega.colorfulstage.en.campaign.0058",
        "price": 2.99,
        "unitPrice": 1.058
    },
    {
        "id": 50116,
        "groupId": 50116,
        "platform": "iOS",
        "productId": "com.sega.colorfulstage.en.campaign.0063",
        "price": 24.99,
        "unitPrice": 1
    },
    {
        "id": 50117,
        "groupId": 50116,
        "platform": "Android",
        "productId": "com.sega.colorfulstage.en.campaign.0063",
        "price": 24.99,
        "unitPrice": 1
    },
    {
        "id": 50118,
        "groupId": 50118,
        "platform": "iOS",
        "productId": "com.sega.colorfulstage.en.campaign.0064",
        "price": 39.99,
        "unitPrice": 0.98
    },
    {
        "id": 50119,
        "groupId": 50118,
        "platform": "Android",
        "productId": "com.sega.colorfulstage.en.campaign.0064",
        "price": 39.99,
        "unitPrice": 0.98
    },
    {
        "id": 50120,
        "groupId": 50120,
        "platform": "iOS",
        "productId": "com.sega.colorfulstage.en.campaign.0065",
        "price": 79.99,
        "unitPrice": 0.953
    },
    {
        "id": 50121,
        "groupId": 50120,
        "platform": "Android",
        "productId": "com.sega.colorfulstage.en.campaign.0065",
        "price": 79.99,
        "unitPrice": 0.953
    },
    {
        "id": 50122,
        "groupId": 50122,
        "platform": "iOS",
        "productId": "com.sega.colorfulstage.en.campaign.0066",
        "price": 0.99,
        "unitPrice": 1.091
    },
    {
        "id": 50123,
        "groupId": 50122,
        "platform": "Android",
        "productId": "com.sega.colorfulstage.en.campaign.0066",
        "price": 0.99,
        "unitPrice": 1.091
    },
    {
        "id": 50124,
        "groupId": 50124,
        "platform": "iOS",
        "productId": "com.sega.colorfulstage.en.campaign.0067",
        "price": 2.99,
        "unitPrice": 1.058
    },
    {
        "id": 50125,
        "groupId": 50124,
        "platform": "Android",
        "productId": "com.sega.colorfulstage.en.campaign.0067",
        "price": 2.99,
        "unitPrice": 1.058
    },
    {
        "id": 50126,
        "groupId": 50126,
        "platform": "iOS",
        "productId": "com.sega.colorfulstage.en.campaign.0068",
        "price": 7.99,
        "unitPrice": 1.032
    },
    {
        "id": 50127,
        "groupId": 50126,
        "platform": "Android",
        "productId": "com.sega.colorfulstage.en.campaign.0068",
        "price": 7.99,
        "unitPrice": 1.032
    },
    {
        "id": 50128,
        "groupId": 50128,
        "platform": "iOS",
        "productId": "com.sega.colorfulstage.en.campaign.0069",
        "price": 14.99,
        "unitPrice": 1.023
    },
    {
        "id": 50129,
        "groupId": 50128,
        "platform": "Android",
        "productId": "com.sega.colorfulstage.en.campaign.0069",
        "price": 14.99,
        "unitPrice": 1.023
    },
    {
        "id": 50130,
        "groupId": 50130,
        "platform": "iOS",
        "productId": "com.sega.colorfulstage.en.campaign.0070",
        "price": 24.99,
        "unitPrice": 1
    },
    {
        "id": 50131,
        "groupId": 50130,
        "platform": "Android",
        "productId": "com.sega.colorfulstage.en.campaign.0070",
        "price": 24.99,
        "unitPrice": 1
    },
    {
        "id": 50132,
        "groupId": 50132,
        "platform": "iOS",
        "productId": "com.sega.colorfulstage.en.campaign.0071",
        "price": 39.99,
        "unitPrice": 0.98
    },
    {
        "id": 50133,
        "groupId": 50132,
        "platform": "Android",
        "productId": "com.sega.colorfulstage.en.campaign.0071",
        "price": 39.99,
        "unitPrice": 0.98
    },
    {
        "id": 50134,
        "groupId": 50134,
        "platform": "iOS",
        "productId": "com.sega.colorfulstage.en.campaign.0072",
        "price": 79.99,
        "unitPrice": 0.953
    },
    {
        "id": 50135,
        "groupId": 50134,
        "platform": "Android",
        "productId": "com.sega.colorfulstage.en.campaign.0072",
        "price": 79.99,
        "unitPrice": 0.953
    },
    {
        "id": 50136,
        "groupId": 50136,
        "platform": "iOS",
        "productId": "com.sega.colorfulstage.en.campaign.0073",
        "price": 4.99,
        "unitPrice": 1.089
    },
    {
        "id": 50137,
        "groupId": 50136,
        "platform": "Android",
        "productId": "com.sega.colorfulstage.en.campaign.0073",
        "price": 4.99,
        "unitPrice": 1.089
    },
    {
        "id": 50138,
        "groupId": 50138,
        "platform": "iOS",
        "productId": "com.sega.colorfulstage.en.campaign.0077",
        "price": 2.99,
        "unitPrice": 1.058
    },
    {
        "id": 50139,
        "groupId": 50138,
        "platform": "Android",
        "productId": "com.sega.colorfulstage.en.campaign.0077",
        "price": 2.99,
        "unitPrice": 1.058
    },
    {
        "id": 50140,
        "groupId": 50140,
        "platform": "iOS",
        "productId": "com.sega.colorfulstage.en.campaign.0078",
        "price": 2.99,
        "unitPrice": 1.058
    },
    {
        "id": 50141,
        "groupId": 50140,
        "platform": "Android",
        "productId": "com.sega.colorfulstage.en.campaign.0078",
        "price": 2.99,
        "unitPrice": 1.058
    },
    {
        "id": 80000,
        "groupId": 80000,
        "platform": "iOS",
        "productId": "com.sega.colorfulstage.en.monthlypack.0001",
        "price": 14.99,
        "unitPrice": 1.023
    },
    {
        "id": 80001,
        "groupId": 80000,
        "platform": "Android",
        "productId": "com.sega.colorfulstage.en.monthlypack.0001",
        "price": 14.99,
        "unitPrice": 1.023
    },
    {
        "id": 80002,
        "groupId": 80002,
        "platform": "iOS",
        "productId": "com.sega.colorfulstage.en.weeklypack.0001",
        "price": 7.99,
        "unitPrice": 1.032
    },
    {
        "id": 80003,
        "groupId": 80002,
        "platform": "Android",
        "productId": "com.sega.colorfulstage.en.weeklypack.0001",
        "price": 7.99,
        "unitPrice": 1.032
    },
    {
        "id": 80004,
        "groupId": 80004,
        "platform": "iOS",
        "productId": "com.sega.colorfulstage.en.dailypack.0001",
        "price": 0.99,
        "unitPrice": 1.091
    },
    {
        "id": 80005,
        "groupId": 80004,
        "platform": "Android",
        "productId": "com.sega.colorfulstage.en.dailypack.0001",
        "price": 0.99,
        "unitPrice": 1.091
    },
    {
        "id": 200001,
        "groupId": 1,
        "platform": "GlRazerGold",
        "productId": "com.sega.colorfulstage.en.razer.crystal.0001",
        "price": 0.99,
        "unitPrice": 1.091
    },
    {
        "id": 200002,
        "groupId": 2,
        "platform": "GlRazerGold",
        "productId": "com.sega.colorfulstage.en.razer.crystal.0002",
        "price": 2.99,
        "unitPrice": 1.089
    },
    {
        "id": 200003,
        "groupId": 3,
        "platform": "GlRazerGold",
        "productId": "com.sega.colorfulstage.en.razer.crystal.0003",
        "price": 7.99,
        "unitPrice": 1.032
    },
    {
        "id": 200004,
        "groupId": 4,
        "platform": "GlRazerGold",
        "productId": "com.sega.colorfulstage.en.razer.crystal.0004",
        "price": 14.99,
        "unitPrice": 1.023
    },
    {
        "id": 200005,
        "groupId": 5,
        "platform": "GlRazerGold",
        "productId": "com.sega.colorfulstage.en.razer.crystal.0005",
        "price": 24.99,
        "unitPrice": 1.089
    },
    {
        "id": 200006,
        "groupId": 6,
        "platform": "GlRazerGold",
        "productId": "com.sega.colorfulstage.en.razer.crystal.0006",
        "price": 39.99,
        "unitPrice": 0.98
    },
    {
        "id": 200007,
        "groupId": 7,
        "platform": "GlRazerGold",
        "productId": "com.sega.colorfulstage.en.razer.crystal.0007",
        "price": 79.99,
        "unitPrice": 0.953
    },
    {
        "id": 200008,
        "groupId": 200008,
        "platform": "GlRazerGold",
        "productId": "com.sega.colorfulstage.en.razer.crystal.0008",
        "price": 0.45,
        "unitPrice": 1.091
    },
    {
        "id": 3000003,
        "groupId": 3000003,
        "platform": "iOS",
        "productId": "com.sega.colorfulstage.en.goldticket.0002",
        "price": 4.99,
        "unitPrice": 1.089
    },
    {
        "id": 3000004,
        "groupId": 3000003,
        "platform": "Android",
        "productId": "com.sega.colorfulstage.en.goldticket.0002",
        "price": 4.99,
        "unitPrice": 1.089
    }
]