{
    "appVersion": "3.3.0",
    "appVersionStatus": "available",
    "assetHash": "e968b37b-d243-4e23-ab79-1600a4a38ec1",
    "assetVersion": "3.3.2.5",
    "backgroundMusics": [],
    "characterCostumes": [],
    "colorfulPassV2s": [],
    "colorfulPasses": [],
    "customProfileGachaTabs": [],
    "customProfileMemberResourceExcludeCards": [],
    "dataVersion": "3.3.2.10",
    "episodeBackgroundMusics": [],
    "isStreamingVirtualLiveForceOpenUser": false,
    "multiPlayVersion": "len",
    "offlineEvents": [],
    "removeAssetVersion": "1.3.1.0",
    "specialMissionGls": [],
    "specialMissionPeriodGls": [],
    "suiteMasterSplitPath": [
        "suitemasterfile/3.3.2.10/00",
        "suitemasterfile/3.3.2.10/01",
        "suitemasterfile/3.3.2.10/02",
        "suitemasterfile/3.3.2.10/03",
        "suitemasterfile/3.3.2.10/04",
        "suitemasterfile/3.3.2.10/05",
        "suitemasterfile/3.3.2.10/06"
    ],
    "updatedResources": {}
}