[
    {
        "attributeCount": 1,
        "bonusRate": 0
    },
    {
        "attributeCount": 2,
        "bonusRate": 0
    },
    {
        "attributeCount": 3,
        "bonusRate": 75
    },
    {
        "attributeCount": 4,
        "bonusRate": 100
    },
    {
        "attributeCount": 5,
        "bonusRate": 125
    }
]