TYPE,ACCOUNT_REF,NOMINAL_CODE,DATE,INV_REF,NET_AMOUNT,TAX_CODE,TAX_AMOUNT,EXTRA_REF,NAME
SI,,4000,2022-10-31,NR022380,30.000,T1,5.000,R02R2210311239009,shyam
SI,,4000,2022-10-31,NR022383,12.000,T1,2.000,R02R2210311731010,shrey
SI,,4000,2022-10-31,NR012385,1845.000,T1,300.000,,Al Babtain
SI,,4000,2022-10-31,NR012386,85.488,T1,4.738,,Yadnesh 
SI,,4000,2022-10-31,NR022387,51.000,T1,8.000,R02R2210311836009,shrey
SI,,4000,2022-11-01,NCour12426,94.693,T1,2.843,Cour1R2211011251004,Ram pvt ltd
SI,,4000,2022-11-02,NCour12435,86.400,T1,14.400,Cour1R2211021552004,priya m
SI,,4000,2022-11-02,NCour12436,24.000,T1,4.000,,shanks m
SI,,4000,2022-11-02,NCour12437,12.600,T1,0.600,,shanks m
SI,,4000,2022-11-02,NCour12438,0.000,T1,0.000,Cour1R2211021552004,priya m
