{
  "kind": "singleType",
  "collectionName": "requisites",
  "info": {
    "singularName": "requisite",
    "pluralName": "requisites",
    "displayName": "Requisite"
  },
  "options": {
    "draftAndPublish": false
  },
  "pluginOptions": {},
  "attributes": {
    "companyName": {
      "type": "string",
      "required": true
    },
    "ogrn": {
      "type": "string"
    },
    "inn": {
      "type": "string"
    }
  }
}
