%YAML 1.1
%TAG !u! tag:unity3d.com,2011:
--- !u!114 &11400000
MonoBehaviour:
  m_ObjectHideFlags: 0
  m_CorrespondingSourceObject: {fileID: 0}
  m_PrefabInstance: {fileID: 0}
  m_PrefabAsset: {fileID: 0}
  m_GameObject: {fileID: 0}
  m_Enabled: 1
  m_EditorHideFlags: 0
  m_Script: {fileID: 11500000, guid: 34acb6faa25ad2e449371f4f9f7e498c, type: 3}
  m_Name: Merge Outdoor Furnitures
  m_EditorClassIdentifier: 
  rules:
  - isCollapsed: 0
    isEnabled: 1
    name: Merge
    blocks:
    - isEnabled: 1
      actionId: 246456413
      serializedNames:
      - includeWholeHierarchy
      serializedValues:
      - True
    - isEnabled: 1
      actionId: 523752222
      serializedNames:
      - caseSensitive
      - propertyName.constrain
      - propertyName.value
      - propertyName
      - propertyValue.constrain
      - propertyValue.value
      - propertyValue
      serializedValues:
      - False
      - 0
      - 
      - 2
      - 0
      - outdoor_furniture_set
      - 2
    - isEnabled: 1
      actionId: 848484845
      serializedNames:
      - detailedLog
      serializedValues:
      - False
    - isEnabled: 1
      actionId: 511763496
      serializedNames:
      - keepParent
      serializedValues:
      - True
