<svg width="96" height="97" viewBox="0 0 96 97" fill="none" xmlns="http://www.w3.org/2000/svg">
<path d="M27.9426 55.379C27.7581 55.1946 27.7581 55.0101 27.9426 54.8257C28.3114 54.4568 28.7725 54.3185 29.3258 54.4107C29.8791 54.5029 30.2018 54.5952 30.2941 54.6874C30.9396 54.964 31.6543 55.5865 32.4381 56.5548C33.2219 57.5231 33.8444 58.1917 34.3056 58.5606C36.5188 60.4049 38.7781 60.5433 41.0836 58.9755C41.268 58.33 41.5678 57.7767 41.9827 57.3155C42.3976 56.8544 42.7896 56.5318 43.1585 56.3472C43.5275 56.1628 44.173 55.8862 45.0952 55.5173C42.0519 55.2406 39.5851 54.7103 37.6946 53.9265C35.8041 53.1426 34.3055 52.1513 33.1989 50.9524C31.7234 49.2925 30.8242 47.1254 30.5015 44.451C30.1786 41.7767 30.3861 39.3329 31.124 37.1196C31.6773 35.7364 32.4611 34.4915 33.4755 33.3848C32.7377 31.0793 32.8761 28.4511 33.8905 25.5001C36.8415 25.6845 39.5158 26.6989 41.9135 28.5433C46.5244 27.3444 51.3198 27.2983 56.2995 28.405C56.9451 27.9439 57.9365 27.3675 59.2736 26.6758C60.6107 25.9842 62.2938 25.5922 64.3226 25.5C64.6915 26.5144 64.9451 27.7132 65.0834 29.0965C65.2217 30.4798 65.1526 31.7709 64.876 32.9697C66.9969 35.183 68.1036 38.134 68.1958 41.8227C68.1958 44.7737 67.6886 47.2175 66.6742 49.1541C65.6598 51.0907 63.8616 52.7045 61.2794 53.9955C59.5273 54.8256 57.2218 55.3327 54.363 55.5171C55.6542 56.1627 56.5994 56.8313 57.1988 57.5229C57.7983 58.2146 58.1902 59.2981 58.3747 60.7736V65.131L58.5129 69.35C58.7896 69.8112 59.1124 70.2031 59.4813 70.5259C59.8502 70.8487 60.1729 71.0792 60.4496 71.2175C60.7262 71.3559 60.8185 71.5634 60.7262 71.8401C60.634 72.1167 60.2651 72.255 59.6196 72.255C58.0518 72.255 56.807 71.7017 55.8848 70.595C55.6081 70.1339 55.4698 69.5807 55.4698 68.9351V62.2953C55.4698 61.5576 55.2854 61.0273 54.9165 60.7045C54.5476 60.3817 54.1787 60.1743 53.8099 60.082V68.7967C53.8099 70.3644 53.9943 71.3788 54.3632 71.8399C54.732 72.301 54.9626 72.7622 55.0549 73.2232C55.1471 73.3154 55.0779 73.3846 54.8473 73.4307C54.6169 73.4767 54.2249 73.4076 53.6715 73.2232C52.4727 72.9465 51.6427 72.324 51.1816 71.3557C50.7205 70.3874 50.49 69.3499 50.49 68.2433V59.6672H48.6917V68.2435C48.6917 69.3502 48.4611 70.4107 48 71.4251C47.3545 72.7162 46.1556 73.4078 44.4035 73.5C44.1269 73.4078 43.9886 73.3156 43.9886 73.2234C44.0808 73.1311 44.3574 72.6701 44.8185 71.8401C44.9107 71.6557 45.0261 71.2868 45.1644 70.7335C45.3028 70.1802 45.3719 69.5347 45.3719 68.7969V60.0822C45.003 60.1744 44.6572 60.3818 44.3344 60.7047C44.0116 61.0275 43.8502 61.5577 43.8502 62.2955V68.9352C43.8502 69.5807 43.7119 70.1341 43.4352 70.5952C42.6053 71.7018 41.3603 72.2552 39.7005 72.2552C39.0549 72.2552 38.686 72.1169 38.5938 71.8402C38.5015 71.6558 38.5246 71.4944 38.663 71.356C38.8014 71.2177 39.0089 71.0563 39.2855 70.8718C39.5622 70.6874 39.7466 70.549 39.8389 70.4569C40.2077 70.1802 40.4843 69.8113 40.6688 69.3502C40.9455 68.9814 41.0146 68.0131 40.8763 66.4453C40.7379 64.8776 40.7149 63.8632 40.8071 63.4021C38.4093 64.2321 35.9656 63.817 33.4756 62.1572C32.7379 61.4194 32.0001 60.3588 31.2624 58.9756C30.7091 57.9611 29.6024 56.7623 27.9426 55.379Z" fill="#0F0D1A"/>
</svg>
