{
  "PiveauHubConnectorJob": {
    "hubUrl": "<HUB URL>",
    "hubApiKey": "<API KEY>",
    "connectorUrl": "http://datastore-connector:8080",
    "externalConnectorUrl": "<External URL>",
    "dayRange": 3,
    "uploadSettings": {
      "OpenData.OpenWeather": {
        "frequencies": [
          "daily",
          "monthly"
        ],
        "replacements": {
          "title": "Wetter Wiesbaden",
          "distributionTitle": "Aggregierte Wetterdaten",
          "description": "Aggregierte Wetterdaten für Wiesbaden.",
          "keyword1": "Real-time",
          "keyword2": "Wetter"
        },
        "dataset": {
          "template": "@prefix schema: <http://schema.org/> .\n@prefix dcatap: <http://data.europa.eu/r5r/> .\n@prefix adms:  <http://www.w3.org/ns/adms#> .\n@prefix spdx:  <https://spdx.org/rdf/terms/#> .\n@prefix gsp:   <http://www.opengis.net/ont/geosparql#> .\n@prefix owl:   <http://www.w3.org/2002/07/owl#> .\n@prefix org:   <http://www.w3.org/ns/org#> .\n@prefix xsd:   <http://www.w3.org/2001/XMLSchema#> .\n@prefix skos:  <http://www.w3.org/2004/02/skos/core#> .\n@prefix rdfs:  <http://www.w3.org/2000/01/rdf-schema#> .\n@prefix hydra: <http://www.w3.org/ns/hydra/core#> .\n@prefix dct:   <http://purl.org/dc/terms/> .\n@prefix v:     <http://www.w3.org/2006/vcard/ns#> .\n@prefix time:  <http://www.w3.org/2006/time#> .\n@prefix dcat:  <http://www.w3.org/ns/dcat#> .\n@prefix odrl:  <https://www.w3.org/TR/odrl-vocab/#> .\n@prefix locn:  <http://www.w3.org/ns/locn#> .\n@prefix prov:  <http://www.w3.org/ns/prov#> .\n@prefix foaf:  <http://xmlns.com/foaf/0.1/> .\n@prefix gmd:   <http://www.isotc211.org/2005/gmd#> .\n\n<http://www.piveau.eu/set/distribution/${distributionId}>\n        a                dcat:Distribution ;\n        dct:description  \"${distributionDescription}\"@de ;\n        dct:format       <http://publications.europa.eu/resource/authority/file-type/JSON> ;\n        dct:license      <http://publications.europa.eu/resource/authority/licence/CC_BY> ;\n        dct:title        \"${distributionTitle} für ${distributionDate}\"@de ;\n        dcat:accessURL   <${datastreamUrl}> .\n\n<http://www.piveau.eu/set/data/${datasetId}>\n        a                  dcat:Dataset ;\n        dct:accessRights   [ a           dct:accessRights ;\n                             rdfs:label  \"public\"\n                           ] ;\n        dct:description    \"${description}\"@de ;\n        dct:issued         \"${timestamp}\"^^xsd:dateTime ;\n        dct:modified        \"${timestamp}\"^^xsd:dateTime ;\n        dct:publisher      [ a              foaf:Organization ;\n                             foaf:homepage  \"https://www.fokus.fraunhofer.de\" ;\n                             foaf:name      \"Fraunhofer FOKUS\"\n                           ] ;\n        dct:title          \"${title} für ${datasetDate}\"@de ;\n        dcat:contactPoint  [ a           v:Organization ;\n                             v:fn        \"Fabian Kirstein\" ;\n                             v:hasEmail  \"fabian.kirstein@fokus.fraunhofer.de\"\n                           ] ;\n        dcat:distribution  <http://www.piveau.eu/set/distribution/${distributionId}> ;\n        dcat:keyword       \"${keyword1}\" , \"${keyword2}\" ;\n        dcat:theme         <http://publications.europa.eu/resource/authority/data-theme/REGI> , <http://publications.europa.eu/resource/authority/data-theme/ENER> ;\n        foaf:page          <http://datastore.k2dev.fokus.fraunhofer.de/> ."
        },
        "distribution": {
          "template": "@prefix schema: <http://schema.org/> .\n@prefix dcatap: <http://data.europa.eu/r5r/> .\n@prefix adms:  <http://www.w3.org/ns/adms#> .\n@prefix spdx:  <https://spdx.org/rdf/terms/#> .\n@prefix gsp:   <http://www.opengis.net/ont/geosparql#> .\n@prefix owl:   <http://www.w3.org/2002/07/owl#> .\n@prefix org:   <http://www.w3.org/ns/org#> .\n@prefix xsd:   <http://www.w3.org/2001/XMLSchema#> .\n@prefix skos:  <http://www.w3.org/2004/02/skos/core#> .\n@prefix rdfs:  <http://www.w3.org/2000/01/rdf-schema#> .\n@prefix hydra: <http://www.w3.org/ns/hydra/core#> .\n@prefix dct:   <http://purl.org/dc/terms/> .\n@prefix v:     <http://www.w3.org/2006/vcard/ns#> .\n@prefix time:  <http://www.w3.org/2006/time#> .\n@prefix dcat:  <http://www.w3.org/ns/dcat#> .\n@prefix odrl:  <https://www.w3.org/TR/odrl-vocab/#> .\n@prefix locn:  <http://www.w3.org/ns/locn#> .\n@prefix prov:  <http://www.w3.org/ns/prov#> .\n@prefix foaf:  <http://xmlns.com/foaf/0.1/> .\n@prefix gmd:   <http://www.isotc211.org/2005/gmd#> .\n\n<http://www.piveau.eu/set/distribution/${distributionId}>\n        a                dcat:Distribution ;\n        dct:description  \"${distributionDescription}\"@de ;\n        dct:format       <http://publications.europa.eu/resource/authority/file-type/JSON> ;\n        dct:license      <http://publications.europa.eu/resource/authority/licence/CC_BY> ;\n        dct:title        \"${distributionTitle} für ${distributionDate}\"@de ;\n        dcat:accessURL   <${datastreamUrl}> ."
        }
      }
    }
  },
  "RestartSparkJob": {
    "hdfsHost": "namenode",
    "hdfsPort": 9870,
    "hdfsRootDirectory": "/Piveau/DataStore",
    "fileLimit": 100000
  },
  "PIVEAU_DATASTORE_SCHEDULER_SCHEDULE": {
    "PiveauHubConnectorJob": "0 0 0/4 ? * * *",
    "RestartSparkJob": "0 0 0 ? * MON"
  }
}
