{
  "PIVEAU_DATASTORE_CONNECTOR_APIKEY":"123-456",
  "PIVEAU_DATASTORE_CONNECTOR_HOST":"0.0.0.0",
  "PIVEAU_DATASTORE_CONNECTOR_HDFS_HOST":"hdfs://namenode:9000",
  "PIVEAU_DATASTORE_CONNECTOR_FS_TEMPFILES_MAX_AGE_MINUTES":120,
  "PIVEAU_DATASTORE_CONNECTOR_STREAMING_UPDATE_TOPICLIST_SECONDS":60,
  "PIVEAU_DATASTORE_CONNECTOR_HDFS_CLIENT_HEALTHCHECK_MS":60000,
  "PIVEAU_DATASTORE_CONNECTOR_HDFS_CLIENT_CONNECTION_THRESHOLD_MS":3000,
  "PIVEAU_DATASTORE_CONNECTOR_KAFKA_BOOTSTRAP_SERVER":"kafka:9092",
  "PIVEAU_DATASTORE_CONNECTOR_KAFKA_METADATA_MAX_AGE_MS":2000

}
