{
  "$schema": "http://json-schema.org/draft-07/schema#",
  "$id": "http://io.piveau/resources/exporting-hub/config.schema.json",
  "title": "exporting-hub configuration",
  "description": "piveau pipe segment config object schema",
  "type": "object",
  "properties": {
    "hub": {
      "type": "object",
      "title": "Hub configuration",
      "properties": {
        "endpoint": {
          "type": "object",
          "title": "Hub endpoint configuration",
          "properties": {
            "address": {
              "type": "string",
              "title": "Address of the hub repo"
            },
            "apiKey": {
              "type": "string",
              "title": "API key for the hub repo"
            }
          }
        }
      }
    }
  }
}
