/home/piotr/Documents/Projects/TimeLogger/classic/src/main/java/pl/pmajewski/timelogger/classic/service/RecordService.java
/home/piotr/Documents/Projects/TimeLogger/classic/src/main/java/pl/pmajewski/timelogger/classic/dto/RecordUpdateDTO.java
/home/piotr/Documents/Projects/TimeLogger/classic/src/main/java/pl/pmajewski/timelogger/classic/service/impl/UserServiceImpl.java
/home/piotr/Documents/Projects/TimeLogger/classic/src/main/java/pl/pmajewski/timelogger/classic/dto/UserDTO.java
/home/piotr/Documents/Projects/TimeLogger/classic/src/main/java/pl/pmajewski/timelogger/classic/repository/UserRepository.java
/home/piotr/Documents/Projects/TimeLogger/classic/src/main/java/pl/pmajewski/timelogger/classic/model/Record.java
/home/piotr/Documents/Projects/TimeLogger/classic/src/main/java/pl/pmajewski/timelogger/classic/dto/UserCreateDTO.java
/home/piotr/Documents/Projects/TimeLogger/classic/src/main/java/pl/pmajewski/timelogger/classic/exception/UserNotFoundException.java
/home/piotr/Documents/Projects/TimeLogger/classic/src/main/java/pl/pmajewski/timelogger/classic/dto/RecordCreateDTO.java
/home/piotr/Documents/Projects/TimeLogger/classic/src/main/java/pl/pmajewski/timelogger/classic/repository/RecordsRepository.java
/home/piotr/Documents/Projects/TimeLogger/classic/src/main/java/pl/pmajewski/timelogger/classic/model/User.java
/home/piotr/Documents/Projects/TimeLogger/classic/src/main/java/pl/pmajewski/timelogger/classic/TimeloggerClassicApplication.java
/home/piotr/Documents/Projects/TimeLogger/classic/src/main/java/pl/pmajewski/timelogger/classic/exception/TimeLoggerException.java
/home/piotr/Documents/Projects/TimeLogger/classic/src/main/java/pl/pmajewski/timelogger/classic/dto/UserUpdateDTO.java
/home/piotr/Documents/Projects/TimeLogger/classic/src/main/java/pl/pmajewski/timelogger/classic/dto/RecordDTO.java
/home/piotr/Documents/Projects/TimeLogger/classic/src/main/java/pl/pmajewski/timelogger/classic/service/UserService.java
