<?xml version="1.0" standalone="no"?>
<!DOCTYPE svg PUBLIC "-//W3C//DTD SVG 1.1//EN" "http://www.w3.org/Graphics/SVG/1.1/DTD/svg11.dtd" >
<svg xmlns="http://www.w3.org/2000/svg">
<defs>
  <font id="wulpdal" horiz-adv-x="256">
    <font-face font-family="wulpdal"
      units-per-em="256" ascent="256"
      descent="0" />
    <missing-glyph horiz-adv-x="0" />
    <glyph glyph-name="brochure"
      unicode="&#xEA01;"
      horiz-adv-x="256" d="M0 119.63L0 31.259L41.75 17.114C64.713 9.334 84.833 2.976 86.463 2.984C88.093 2.993 105.678 8.4 125.541 15C153.939 24.436 162.814 26.999 167.078 26.995C171.373 26.991 180.876 24.186 212.81 13.495C234.98 6.073 253.317 0 253.56 0C253.802 0 254 39.788 254 88.417L254 176.833L211.75 190.917C188.512 198.663 168.204 205 166.62 205C165.036 205 147.559 199.542 127.783 192.872C93.009 181.142 91.608 180.76 85.164 181.243C80.144 181.619 68.901 184.98 39.581 194.871C18.175 202.092 0.513 208 0.331 208C0.149 208 0 168.233 0 119.63M45.516 178.473C66.522 171.335 77.064 167.274 78.25 165.862C79.881 163.92 80 158.898 80 91.948C80 49.638 79.624 19.886 79.086 19.553C78.583 19.242 64.296 23.71 47.336 29.482C25.957 36.758 15.963 40.628 14.75 42.099C13.119 44.077 13 49.112 13 115.944C13 176.226 13.25 189 14.432 189C14.487 189 28.474 184.263 45.516 178.473M160 116.155C160 43.955 159.982 43.294 157.947 41.452C155.85 39.554 94.907 18.808 94 19.684C93.725 19.949 93.5 52.737 93.5 92.547C93.5 158.127 93.653 165.081 95.131 166.559C96.381 167.809 155.705 188.49 159.25 188.911C159.662 188.96 160 156.22 160 116.155M239.249 165.661C240.182 164.013 240.476 146.472 240.486 91.834C240.494 52.418 240.233 19.9 239.906 19.573C238.933 18.599 176.609 39.977 175.25 41.751C174.277 43.021 174 59.347 174 115.524C174 155.203 174.254 187.921 174.565 188.232C174.876 188.543 189.282 184.078 206.578 178.309C231.268 170.075 238.288 167.357 239.249 165.661M120.073 136.365C118.157 133.929 118 132.419 118 116.365L118 99L115.223 99C110.697 99 108 96.448 108 92.166C108 88.894 108.813 87.649 114.75 81.826C118.463 78.186 122.49 74.912 123.7 74.552C126.87 73.608 130.681 75.935 137.25 82.823C141.542 87.323 143 89.587 143 91.751C143 95.584 139.317 99 135.186 99L132 99L132 117.345C132 133.847 131.816 135.856 130.171 137.345C127.32 139.925 122.506 139.458 120.073 136.365" />
    <glyph glyph-name="close"
      unicode="&#xEA02;"
      horiz-adv-x="256" d="M12.239 244.74C6.608 239.089 2 234.025 2 233.486C2 232.948 25.511 208.993 54.246 180.254L106.493 128L54.246 75.746C25.511 47.007 2 23.036 2 22.478C2 21.178 21.212 2 22.514 2C23.053 2 47.007 25.511 75.746 54.246L128 106.493L180.761 53.739L233.521 0.986L243.761 11.26C249.392 16.911 254 21.975 254 22.514C254 23.052 230.489 47.007 201.754 75.746L149.507 128L201.754 180.254C230.489 208.993 254 232.948 254 233.486C254 234.025 249.392 239.089 243.761 244.74L233.521 255.014L180.761 202.261L128 149.507L75.239 202.261L22.479 255.014L12.239 244.74" />
    <glyph glyph-name="complete"
      unicode="&#xEA03;"
      horiz-adv-x="256" d="M84.32 1.6576L1.664 84.2432A5.651200000000001 5.651200000000001 0 0 0 1.664 92.2432L33.3184 123.872A5.6640000000000015 5.6640000000000015 0 0 0 41.3312 123.872L88.3328 76.9216L214.6688 203.136A5.6640000000000015 5.6640000000000015 0 0 0 222.6816 203.136L254.3360000000001 171.5072A5.651200000000001 5.651200000000001 0 0 0 254.3360000000001 163.5008L92.3392 1.6448A5.676800000000001 5.676800000000001 0 0 0 84.32 1.6448z" />
    <glyph glyph-name="download"
      unicode="&#xEA04;"
      horiz-adv-x="256" d="M108.409 250.022C84.356 246.602 60.679 230.888 46.232 208.758C40.244 199.585 36.793 191.235 34.413 180.163L32.626 171.844L27.569 169.282C20.804 165.854 10.21 154.953 6.175 147.27C-1.878 131.932 -1.84 112.925 6.275 97.593C10.618 89.387 20.84 79.333 29 75.24C38.754 70.347 46.806 69.037 67.25 69.017L85 69L85 79.926L85 90.853L64.75 91.176C45.07 91.491 44.359 91.575 39.5 94.15C28.024 100.234 21.763 110.193 21.779 122.341C21.799 137.957 30.281 148.951 46.029 153.773L52.5 155.754L53.697 165.627C55.845 183.34 60.739 194.806 71.008 206.184C80.864 217.105 91.785 223.98 105.017 227.596C113.766 229.986 131.162 229.997 140 227.617C160.296 222.152 178.907 205.83 186.738 186.63C189.577 179.668 191.914 167.941 191.965 160.397L192 155.294L201.413 154.732C212.228 154.087 217.672 152.098 223.815 146.548C234.457 136.934 237.563 120.756 231.15 108.342C228.606 103.418 221.753 96.865 216 93.855C211.78 91.647 210.239 91.48 191.25 91.176L171 90.853L171 79.926L171 69L188.75 69.017C209.194 69.037 217.246 70.347 227 75.24C235.164 79.334 245.382 89.388 249.73 97.603C258.674 114.5 257.609 137.114 247.156 152.26C239.764 162.972 226.282 172.543 215.821 174.506C212.329 175.161 212.179 175.377 210.552 182.072C206.815 197.448 199.913 209.775 188.029 222.298C175.422 235.585 163.916 242.715 147.324 247.523C137.484 250.374 119.161 251.551 108.409 250.022M117 98.802L117 42.536L106.495 53.005L95.99 63.474L88.25 55.734L80.511 47.995L104.142 24.363L127.773 0.732L151.637 24.313L175.5 47.894L167.755 55.684L160.01 63.474L149.513 53.013L139.017 42.553L138.758 98.526L138.5 154.5L127.75 154.784L117 155.068L117 98.802" />
    <glyph glyph-name="facebook"
      unicode="&#xEA05;"
      horiz-adv-x="119.46666666666667" d="M114.7562666666667 128.5632H80.4010666666667V0H21.9306666666667V128.5632H0V171.4176H21.9306666666667V202.8885333333333C21.9306666666667 223.616 32.384 256 76.672 256L116.9493333333333 255.8464V214.272H89.8304C85.12 214.272 80.4010666666667 210.1162666666667 80.4010666666667 200.2517333333333V171.4176H119.4666666666667L114.7562666666667 128.5632z" />
    <glyph glyph-name="faciliteiten"
      unicode="&#xEA07;"
      horiz-adv-x="256" d="M240.32 99.0613333333334C243.8933333333333 97.7173333333334 246.848 96.608 249.7813333333333 95.472C250.6506666666667 95.136 252.1013333333333 94.992 251.7226666666667 93.7546666666667A2.3893333333333335 2.3893333333333335 0 0 0 248.8693333333334 92.016A266.8586666666667 266.8586666666667 0 0 1 239.376 93.5893333333334C225.744 95.5306666666667 212.032 96.6826666666667 198.5226666666667 93.4186666666667C188.9226666666667 91.1146666666667 179.4613333333334 88.2186666666667 169.5413333333334 87.488C164.752 87.1253333333334 159.9253333333334 87.2266666666667 155.12 87.0186666666667C148.6613333333334 86.7306666666667 146.5173333333334 82.9493333333334 150.08 77.5786666666667C152.016 74.656 152.5386666666667 72.0106666666667 151.4453333333334 68.7413333333334C150.112 64.784 150.1706666666667 60.672 150.4853333333333 56.5173333333334C151.136 47.9306666666667 150.272 39.2906666666667 151.2533333333333 30.704C151.5146666666667 28.3786666666667 151.8773333333333 26.7786666666667 154.592 26.4053333333334C155.7333333333333 26.256 157.392 25.6000000000001 157.136 24.2346666666667C156.8906666666667 22.9226666666667 155.2533333333333 23.52 154.2453333333333 23.6106666666667C152.272 23.792 151.1893333333333 23.0773333333334 150.9173333333333 21.1306666666667C150.6346666666667 19.0506666666667 149.232 18.7413333333334 147.2906666666667 18.3573333333334C144.3626666666667 17.7706666666667 140.7093333333333 19.4453333333334 138.5653333333333 16.0426666666667C133.4613333333333 17.3013333333334 132.8373333333333 12.2293333333334 130.2613333333333 10.1066666666667C125.664 6.3093333333334 120.384 3.68 115.424 0.5120000000001C114.8213333333333 0.1386666666667 114.0906666666667 -0.4906666666666 113.4506666666667 0.1920000000001C112.6506666666667 1.0720000000001 113.4026666666667 1.8453333333334 114.08 2.3360000000001C116.16 3.8400000000001 118.3306666666667 5.2533333333334 120.4746666666667 6.6880000000001C122.912 8.3200000000001 125.2746666666667 10.0213333333334 126.7306666666667 12.9493333333334C116.928 11.0186666666667 107.232 9.9040000000001 97.6106666666667 12.7146666666667C99.1733333333333 15.1680000000001 99.168 15.0346666666667 105.744 14.7040000000001C108.7466666666666 14.5493333333334 111.76 13.0400000000001 114.9546666666667 14.4693333333334C113.8293333333333 15.5360000000001 112 15.0346666666667 110.8746666666666 16.9653333333334C115.9146666666667 17.4773333333334 120.928 14.4213333333334 125.6853333333333 17.5840000000001C122.7626666666666 18.4746666666667 119.9093333333333 18.3466666666667 117.1146666666666 18.6506666666667C116.1973333333333 18.7466666666667 114.816 18.6133333333334 114.8533333333333 19.9306666666667C114.8906666666666 21.1893333333334 116.2933333333333 21.1200000000001 117.2 21.2266666666667C119.68 21.4986666666667 122.1493333333333 21.0773333333334 124.544 20.5226666666667C127.8933333333333 19.76 129.92 20.9173333333334 131.1146666666666 24.096A389.1839999999999 389.1839999999999 0 0 1 142.6879999999999 60.5546666666667C143.3279999999999 62.9546666666667 143.4026666666666 65.3866666666667 142.9013333333333 67.7706666666667C141.9946666666666 72.1066666666667 144.1973333333333 76.352 142.9546666666666 80.7413333333334C141.5253333333333 85.76 141.2959999999999 85.664 136.0746666666666 86.4053333333334C126.144 87.8133333333334 116.528 90.4266666666667 108.112 96.1813333333334C107.712 96.4586666666667 107.3173333333333 96.784 106.8693333333333 96.96C90.1546666666666 103.4986666666667 80.6133333333333 116.1386666666667 76.7253333333333 132.7733333333334C74.4746666666666 142.4053333333334 76.832 152.0586666666667 80.2773333333333 161.28C81.888 165.616 83.8773333333333 169.8133333333333 83.3066666666666 174.6133333333334C83.2426666666666 175.0773333333334 83.3813333333333 175.584 83.4773333333333 176.0533333333334C83.936 178.4106666666667 86.4959999999999 180.7573333333334 84.0533333333333 183.1626666666667C80.9973333333333 186.1546666666667 77.7599999999999 189.3386666666667 73.1893333333333 189.6693333333333C56.3999999999999 190.88 39.7599999999999 190.4266666666667 24.0586666666666 183.4933333333334C17.8826666666666 180.7626666666667 11.7173333333333 177.824 7.7919999999999 171.936C7.2373333333333 171.1093333333333 6.4159999999999 169.7493333333334 5.2053333333333 170.6666666666667C4.1546666666666 171.4506666666667 4.8639999999999 172.7466666666667 5.4719999999999 173.6426666666667C8.2666666666666 177.7226666666667 12.0213333333333 180.8426666666667 16.1279999999999 183.6213333333333C26.8479999999999 190.88 39.1146666666666 193.4346666666667 51.7119999999999 195.1893333333333C59.1786666666666 196.2346666666667 66.7253333333333 196.6826666666667 74.0746666666666 198.4853333333333C76.6666666666666 199.1253333333334 78.9866666666666 200.112 81.0399999999999 201.744C83.6533333333333 203.824 86.5653333333333 205.344 89.6213333333333 206.6826666666667C94.2453333333333 208.6986666666667 104.8746666666666 207.6693333333333 107.1413333333333 203.7546666666667C109.5146666666666 199.648 113.2586666666666 195.9466666666667 113.2799999999999 190.6346666666667C113.3119999999999 182.0746666666667 113.4719999999999 173.5146666666667 111.8666666666666 165.0346666666667C111.0453333333333 160.7093333333334 112.7306666666666 158.9386666666667 117.2373333333333 159.36C127.6213333333333 160.3466666666667 137.5733333333333 157.856 147.6959999999999 156.2133333333334C157.1253333333332 154.688 165.5306666666666 151.0453333333333 172.1333333333333 144.9653333333333C179.7759999999999 137.9253333333333 188.5119999999999 132.816 197.1786666666666 127.4133333333333C199.1519999999999 126.1866666666667 201.8026666666666 125.4026666666667 202.1066666666666 122.4053333333333C202.1546666666666 122.016 203.2639999999999 121.6266666666667 203.9359999999999 121.392C212.6186666666666 118.2453333333333 221.3119999999999 115.1253333333333 229.9999999999999 111.9786666666667C231.7386666666666 111.36 233.2799999999999 110.736 234.4586666666666 109.0346666666667C236.3999999999999 106.2346666666667 240.0106666666666 106.88 242.8853333333332 106.0746666666667C244.9759999999999 105.4933333333333 247.2959999999999 105.6906666666667 249.5093333333332 105.4506666666667C250.8853333333332 105.3066666666667 252.4586666666666 104.9973333333334 252.6826666666666 103.44C252.9599999999999 101.6 251.1679999999999 101.4186666666667 249.9359999999999 101.1093333333333C246.9919999999999 100.3893333333333 243.9999999999999 99.84 240.3199999999999 99.0613333333333zM141.5093333333333 27.1733333333333C140.6026666666667 24.2133333333333 139.5893333333334 21.2853333333333 138.8213333333334 18.2933333333334C138.3573333333334 16.4693333333333 138.8586666666667 15.6586666666667 141.328 16.1333333333334C145.4986666666667 16.9333333333334 147.4506666666667 19.136 148.3733333333333 22.96C150.4053333333334 31.3173333333334 148.704 39.584 147.8986666666667 48C145.776 41.0613333333333 143.6373333333333 34.112 141.5093333333333 27.1733333333333" />
    <glyph glyph-name="fiets"
      unicode="&#xEA08;"
      horiz-adv-x="256" d="M186.7052698412699 76.7065396825397C177.9890793650794 71.4361904761905 169.6060952380952 55.6535873015873 171.4671746031746 48.1320634920635L201.488253968254 50.3507301587301L186.7052698412699 76.7065396825397M172.808126984127 101.2134603174603C172.4749206349207 100.7624126984127 172.279873015873 100.5551746031746 172.1539047619048 100.3113650793651A60849.777777777774 60849.777777777774 0 0 1 146.9886984126984 51.9233015873016C146.176 50.3507301587302 148.6953650793651 46.5188571428571 150.5239365079365 46.6204444444444C153.9088253968254 46.8073650793651 157.2815238095238 47.1893333333333 160.6664126984127 47.3274920634921C162.1292698412699 47.3884444444444 162.5071746031746 47.9776507936508 162.5965714285715 49.3104761904762C163.5555555555556 63.4392380952381 169.8539682539683 74.7398095238095 181.024507936508 83.431619047619C181.4633650793651 83.7770158730159 181.8534603174604 84.1833650793651 182.2841904761905 84.5693968253968C179.2893968253969 89.9088253968254 176.3880634920635 95.0897777777778 173.4786031746032 100.2666666666667C173.336380952381 100.5145396825397 173.1494603174603 100.7380317460317 172.808126984127 101.2134603174603M165.1768888888889 105.5857777777778C164.2991746031746 105.6467301587302 163.7912380952381 105.7076825396825 163.2873650793651 105.7076825396825C135.4930793650794 105.7158095238095 107.7069206349206 105.6873650793651 79.9166984126984 105.7686349206349C77.9743492063492 105.7686349206349 77.7183492063492 104.6714920634921 77.1006984126984 103.399619047619C76.4220952380953 101.9977142857143 76.808126984127 101.1850158730159 77.8971428571429 100.2138412698413C94.9475555555556 85.000126984127 111.9735873015873 69.7579682539682 128.9671111111111 54.4792380952381C130.3365079365079 53.2520634920635 131.4946031746032 52.496253968254 133.3313015873016 53.5893333333333C134.0993015873016 54.0444444444444 135.2045714285714 54.2029206349206 136.1107301587302 54.0932063492063C137.9961904761905 53.8656507936508 138.8251428571429 54.792126984127 139.6093968253969 56.3159365079365C145.1723174603175 67.1329523809524 150.8124444444445 77.9093333333333 156.424126984127 88.7019682539682C159.2888888888889 94.2120634920635 162.1414603174604 99.7302857142857 165.1768888888889 105.5857777777778M194.2024126984127 81.0788571428571C194.6290793650794 80.2661587301587 194.9785396825397 79.5550476190476 195.368634920635 78.8642539682539C199.960380952381 70.6763174603174 204.5196190476191 62.4680634920635 209.184507936508 54.3207619047619C209.7533968253969 53.3414603174603 210.7611428571429 52.4596825396825 211.7688888888889 51.9070476190476C214.6255238095238 50.3466666666666 215.9989841269842 47.1365079365079 214.8246349206349 44.2758095238095C213.5161904761905 41.0859682539682 210.0581587301588 39.2533333333333 207.095873015873 40.8055873015873C204.4911746031746 42.1749841269841 202.000253968254 41.8133333333333 199.4036825396826 41.6507936507936C196.0187936507937 41.4435555555555 192.6420317460318 41.1631746031746 189.2571428571429 40.9071746031746L171.8775873015873 39.5784126984127C173.072253968254 29.1880634920635 182.2516825396826 14.1125079365079 199.8425396825397 9.6954920634921A38.221206349206355 38.221206349206355 0 0 1 241.8062222222223 26.9165714285714C250.4248888888889 41.1509841269841 248.6613333333334 59.4813968253968 237.4989206349207 71.6271746031746C226.3649523809524 83.7363809523809 208.3149206349207 87.7714285714286 194.2024126984127 81.0788571428571M67.1695238095238 78.0149841269841C64.4063492063492 70.8916825396825 61.8057142857143 63.8902857142857 58.9653333333334 56.9864126984127C57.8316190476191 54.2313650793651 56.1615238095238 51.695746031746 54.7555555555556 49.0504126984127C53.9834920634921 47.5956825396825 53.1017142857143 46.1734603174603 52.5450158730159 44.6415238095238C51.5169523809524 41.8052063492063 49.1113650793651 40.1310476190476 46.0921904761905 40.415492063492C43.1380317460318 40.6999365079365 40.9478095238095 42.8617142857143 40.6064761904762 45.8361904761905C40.2976507936508 48.4937142857143 42.0693333333334 51.4600634920635 44.791873015873 52.0777142857143C46.4579047619048 52.455619047619 47.3884444444445 53.3414603174603 48.1239365079365 54.6173968253968C49.1154285714286 56.3240634920635 50.1475555555556 58.0347936507936 50.8911746031746 59.8511746031746C52.6709841269841 64.1869206349206 54.2923174603175 68.5876825396825 55.9786666666667 72.9559365079365L59.4326349206349 81.903746031746C42.8129523809524 88.2996825396825 20.7806984126984 81.4323809523809 11.8491428571429 61.696C3.2711111111111 42.7235555555556 11.9060317460317 20.5531428571428 31.1751111111111 11.8450793650794C49.9890793650794 3.344253968254 72.3139047619048 11.6012698412698 81.2373333333333 30.439619047619C90.2339047619048 49.4486349206349 81.2495238095238 69.8676825396825 67.1695238095238 78.0149841269841M256 48.8431746031746V44.0035555555556C255.8740317460318 43.3655873015873 255.6911746031746 42.727619047619 255.6220952380953 42.0815238095238C253.6309841269841 22.519873015873 240.2377142857143 6.7169523809524 221.2449523809524 1.6172698412698C218.7052698412699 0.9346031746032 216.088380952381 0.5363809523809 213.5080634920635 0.0040634920635H204.6577777777778C204.2433015873016 0.1340952380952 203.8369523809524 0.3291428571429 203.4143492063492 0.3900952380952C187.3066666666667 2.6331428571428 175.36 10.9551746031746 167.7287619047619 25.1286349206349C165.4694603174603 29.3262222222222 164.2341587301587 34.0683174603174 162.4137142857143 38.8673015873016C159.0897777777778 38.639746031746 155.3554285714286 38.3553015873016 151.6210793650794 38.144C150.3695238095238 38.0749206349206 149.751873015873 37.5588571428571 149.239873015873 36.3763809523809C146.4888888888889 29.9804444444444 139.7394285714286 26.9490793650793 133.1890793650794 29.0417777777778C126.7606349206349 31.0938412698413 123.0425396825397 37.6035555555555 124.663873015873 44.3895873015873C125.0580317460318 46.0353015873016 124.6679365079365 46.8926984126984 123.5139047619048 47.9207619047619C108.2148571428571 61.5740952380952 92.952380952381 75.264 77.6777142857143 88.9417142857143C76.2189206349206 90.2420317460317 74.735746031746 91.5179682539682 73.0615873015873 92.9808253968254L70.4853333333333 86.3979682539682C71.3467936507936 85.8250158730159 72.0863492063492 85.3577142857143 72.8015238095238 84.8538412698413C85.776253968254 75.784126984127 92.8345396825397 63.3620317460317 93.3912380952381 47.616C94.0982857142857 27.5017142857143 81.3307936507937 9.2606984126984 62.1754920634921 2.6900317460317C58.5914920634921 1.4628571428571 54.7799365079365 0.8817777777778 51.0699682539683 0.0040634920635H42.2196825396825C41.2932063492063 0.1869206349206 40.3707936507937 0.3941587301587 39.4361904761905 0.5404444444445C16.2417777777778 4.2057142857143 -2.3568253968254 25.071746031746 0.2438095238095 51.191873015873C2.5274920634921 74.0937142857143 21.768126984127 92.5175873015873 46.2019047619048 92.7004444444444C51.6347936507937 92.7410793650794 57.0758095238095 91.4570158730159 62.8866031746032 90.7377777777778C62.9556825396825 90.9003174603175 63.2645079365079 91.6236190476191 63.5489523809524 92.3509841269841C68.9615238095238 106.1059047619048 74.3293968253968 119.8770793650794 79.8313650793651 133.5954285714286C80.5018412698413 135.2614603174603 81.8874920634921 136.6430476190476 82.9399365079365 138.1587301587302H106.3984761904762C106.5813333333333 137.9555555555556 106.7316825396825 137.711746031746 106.9511111111111 137.5573333333333C108.7106031746032 136.3179682539683 109.4542222222222 134.6763174603175 108.7634285714286 132.599873015873C108.0726349206349 130.5234285714286 106.4756825396825 129.6538412698413 104.3342222222222 129.6497777777778C99.3239365079365 129.6497777777778 94.3095873015873 129.6010158730159 89.2952380952381 129.6741587301588C87.8933333333333 129.6944761904762 87.2228571428571 129.2434285714286 86.7474285714285 127.9065396825397C85.5974603174603 124.663873015873 84.2402539682539 121.4943492063492 82.9846349206349 118.288253968254C82.4970158730158 117.0448253968254 82.0500317460317 115.7810793650794 81.4973968253968 114.2816507936508H166.3593650793651C170.1871746031746 114.2816507936508 170.4634920634921 114.5010793650794 171.6500317460318 118.6417777777778C168.3342222222222 118.6417777777778 165.0387301587302 118.5117460317461 161.7635555555556 118.6824126984127C159.215746031746 118.816507936508 156.6273015873016 119.1009523809524 154.1648253968254 119.7307936507937C151.9217777777778 120.2996825396826 152.0152380952381 122.4817777777778 152.0030476190476 124.2981587301587C151.9908571428571 125.984507936508 153.360253968254 126.472126984127 154.7012063492063 126.6874920634921C157.0255238095238 127.0572698412699 159.3701587301587 127.3092063492064 161.7107301587302 127.5692698412699C167.1964444444445 128.1706666666667 172.7390476190476 128.4510476190476 178.151619047619 129.4425396825397C181.4918095238095 130.056126984127 184.6166349206349 131.7993650793651 187.8714920634921 132.9330793650794C190.1795555555556 133.7335873015873 193.8529523809524 132.5958095238095 195.3239365079365 130.7713015873016C196.6933333333333 129.0768253968254 196.5958095238095 126.4924444444445 194.9826031746032 123.9974603174603C192.6623492063492 120.4134603174603 189.3221587301587 117.5161904761905 185.1286349206349 117.8615873015873C180.9716825396825 118.2069841269842 180.0980317460317 115.8704761904762 178.8546031746032 113.2170158730159C178.6676825396826 112.8187936507937 178.3100952380953 112.4449523809524 178.2816507936508 112.0386031746032C178.2125714285714 111.1161904761905 177.9768888888889 110.0149841269841 178.3710476190476 109.2794920634921C180.992 104.3667301587302 183.7633015873016 99.5271111111111 186.4899047619048 94.6712380952381C187.5911111111111 92.7045079365079 188.7045079365079 90.7459047619048 189.8382222222222 88.7385396825397C190.6387301587301 89.0351746031746 191.2604444444444 89.2464761904762 191.8699682539682 89.4862222222222C217.5024761904762 99.559619047619 246.2313650793651 85.6665396825397 253.9398095238095 59.3676190476191C254.9394285714285 55.9502222222222 255.3254603174603 52.3540317460317 255.9959365079365 48.8431746031746" />
    <glyph glyph-name="grid"
      unicode="&#xEA06;"
      horiz-adv-x="256" d="M53.3333333333333 256H10.6666666666667C4.7644444444444 256 0 251.2355555555556 0 245.3333333333334V202.6666666666667C0 196.7644444444445 4.7644444444444 192 10.6666666666667 192H53.3333333333333C59.2355555555556 192 64 196.7644444444445 64 202.6666666666667V245.3333333333334C64 251.2355555555556 59.2355555555556 256 53.3333333333333 256zM53.3333333333333 156.4444444444445H10.6666666666667C4.7644444444444 156.4444444444445 0 151.68 0 145.7777777777778V103.1111111111111C0 97.2088888888889 4.7644444444444 92.4444444444445 10.6666666666667 92.4444444444445H53.3333333333333C59.2355555555556 92.4444444444445 64 97.2088888888889 64 103.1111111111111V145.7777777777778C64 151.68 59.2355555555556 156.4444444444445 53.3333333333333 156.4444444444445zM53.3333333333333 64H10.6666666666667C4.7644444444444 64 0 59.2355555555556 0 53.3333333333333V10.6666666666667C0 4.7644444444445 4.7644444444444 0 10.6666666666667 0H53.3333333333333C59.2355555555556 0 64 4.7644444444445 64 10.6666666666667V53.3333333333333C64 59.2355555555556 59.2355555555556 64 53.3333333333333 64zM152.8888888888889 256H110.2222222222222C104.32 256 99.5555555555555 251.2355555555556 99.5555555555555 245.3333333333334V202.6666666666667C99.5555555555555 196.7644444444445 104.32 192 110.2222222222222 192H152.8888888888889C158.7911111111111 192 163.5555555555555 196.7644444444445 163.5555555555555 202.6666666666667V245.3333333333334C163.5555555555555 251.2355555555556 158.7911111111111 256 152.8888888888889 256zM152.8888888888889 156.4444444444445H110.2222222222222C104.32 156.4444444444445 99.5555555555555 151.68 99.5555555555555 145.7777777777778V103.1111111111111C99.5555555555555 97.2088888888889 104.32 92.4444444444445 110.2222222222222 92.4444444444445H152.8888888888889C158.7911111111111 92.4444444444445 163.5555555555555 97.2088888888889 163.5555555555555 103.1111111111111V145.7777777777778C163.5555555555555 151.68 158.7911111111111 156.4444444444445 152.8888888888889 156.4444444444445zM152.8888888888889 64H110.2222222222222C104.32 64 99.5555555555555 59.2355555555556 99.5555555555555 53.3333333333333V10.6666666666667C99.5555555555555 4.7644444444445 104.32 0 110.2222222222222 0H152.8888888888889C158.7911111111111 0 163.5555555555555 4.7644444444445 163.5555555555555 10.6666666666667V53.3333333333333C163.5555555555555 59.2355555555556 158.7911111111111 64 152.8888888888889 64zM245.3333333333333 256H202.6666666666667C196.7644444444444 256 192 251.2355555555556 192 245.3333333333334V202.6666666666667C192 196.7644444444445 196.7644444444445 192 202.6666666666667 192H245.3333333333333C251.2355555555556 192 256 196.7644444444445 256 202.6666666666667V245.3333333333334C256 251.2355555555556 251.2355555555555 256 245.3333333333333 256zM245.3333333333333 156.4444444444445H202.6666666666667C196.7644444444444 156.4444444444445 192 151.68 192 145.7777777777778V103.1111111111111C192 97.2088888888889 196.7644444444445 92.4444444444445 202.6666666666667 92.4444444444445H245.3333333333333C251.2355555555556 92.4444444444445 256 97.2088888888889 256 103.1111111111111V145.7777777777778C256 151.68 251.2355555555555 156.4444444444445 245.3333333333333 156.4444444444445zM245.3333333333333 64H202.6666666666667C196.7644444444444 64 192 59.2355555555556 192 53.3333333333333V10.6666666666667C192 4.7644444444445 196.7644444444445 0 202.6666666666667 0H245.3333333333333C251.2355555555556 0 256 4.7644444444445 256 10.6666666666667V53.3333333333333C256 59.2355555555556 251.2355555555555 64 245.3333333333333 64z" />
    <glyph glyph-name="next"
      unicode="&#xEA09;"
      horiz-adv-x="256" d="M146.244 192.76L137.998 184.513L173.744 148.756L209.49 113L104.745 113L0 113L0 101L0 89L104.745 89L209.49 89L173.736 53.236L137.983 17.473L146.254 9.245L154.525 1.017L204.51 51.01L254.495 101.003L204.493 151.004L154.491 201.006L146.244 192.76" />
    <glyph glyph-name="plattegrond"
      unicode="&#xEA0A;"
      horiz-adv-x="256" d="M230.4853333333333 25.5431111111111V102.0231111111111H205.1697777777778V127.7368888888889H230.4V230.3004444444445H179.4844444444444V255.8008888888889H256V0H0V255.8222222222222C1.0311111111111 255.8577777777778 2.0835555555556 255.9573333333334 3.136 255.9573333333334C35.7973333333333 255.9573333333334 68.4515555555555 255.9431111111111 101.1057777777778 256A6.755555555555555 6.755555555555555 0 0 0 106.1404444444444 254.0231111111111C124.1955555555556 237.1128888888889 142.3075555555556 220.2666666666667 160.4124444444444 203.4204444444445C161.1377777777778 202.752 161.9626666666667 202.1973333333334 163.0648888888889 201.3297777777778L140.8853333333333 182.7697777777778C139.9893333333333 183.5733333333334 139.1786666666666 184.2773333333333 138.3822222222222 185.0097777777778C122.752 199.5164444444445 107.136 214.0515555555556 91.4488888888889 228.4942222222222C90.3822222222222 229.4684444444445 88.7182222222222 230.3288888888889 87.3244444444444 230.336C67.5982222222222 230.4568888888889 47.8577777777778 230.4213333333334 28.1315555555555 230.4071111111111C27.3493333333333 230.4071111111111 26.5671111111111 230.3004444444445 25.5857777777777 230.2293333333334V25.536H102.0515555555555V102.1653333333333H76.9635555555555V127.6871111111111H153.4577777777778V102.3004444444445H128.1777777777778V25.5431111111111H230.4782222222222z" />
    <glyph glyph-name="prev"
      unicode="&#xEA0B;"
      horiz-adv-x="256" d="M51.491 150.991L1.508 101L51.491 51.009L101.475 1.017L109.746 9.245L118.017 17.473L82.264 53.236L46.51 89L151.255 89L256 89L256 101L256 113L151.255 113L46.51 113L82.264 148.764L118.017 184.527L109.746 192.755L101.475 200.983L51.491 150.991" />
    <glyph glyph-name="receptie"
      unicode="&#xEA0C;"
      horiz-adv-x="256" d="M125.0792727272728 109.9287272727273C124.1018181818182 109.9287272727273 123.1185454545455 109.9927272727273 122.1410909090909 109.9112727272727C119.9883636363637 109.7309090909091 118.6909090909091 108.3927272727273 118.5047272727273 106.0014545454545C118.3185454545455 103.5229090909091 119.6043636363637 102.1207272727273 121.6523636363637 101.6087272727273C122.5949090909091 101.376 123.6014545454546 101.4690909090909 124.5789090909091 101.3934545454546C149.3410909090909 99.5083636363636 167.4647272727273 86.3127272727273 178.6007272727273 61.6552727272727C180.7767272727273 56.8436363636364 181.8589090909091 51.4152727272727 183.3367272727273 46.2370909090909C184.0232727272728 43.84 185.2450909090909 42.3854545454545 187.5607272727273 42.6298181818182C189.5854545454545 42.8509090909091 190.7549090909091 44.3112727272728 190.8538181818182 46.5454545454546C190.912 47.7090909090909 190.6036363636364 48.9192727272728 190.3534545454546 50.0770909090909C187.7934545454546 61.8181818181818 183.1156363636364 72.3607272727273 176.1163636363637 81.6349090909091C162.7810909090909 99.2989090909091 145.6465454545455 108.4101818181818 125.0792727272727 109.9287272727273M118.4756363636364 142.4814545454546V155.0545454545455H111.6567272727273C109.2130909090909 155.0545454545455 107.5898181818182 156.288 107.6421818181818 159.104C107.7003636363636 161.7221818181818 109.2712727272727 162.9032727272727 111.5810909090909 162.9032727272727H132.7883636363637C135.0923636363637 162.9032727272727 136.6690909090909 161.728 136.7214545454546 159.104C136.7738181818182 156.288 135.1505454545455 155.0545454545455 132.7069090909091 155.0545454545455H125.9927272727273V142.4581818181818C128.0756363636364 142.4581818181818 130.1061818181819 142.4872727272728 132.1309090909091 142.4581818181818C135.6043636363637 142.4 136.7447272727273 141.1665454545455 136.7912727272728 137.3847272727273C136.8378181818182 134.2138181818182 136.9250909090909 131.0429090909091 136.7563636363637 127.8836363636364C136.64 125.4981818181818 137.3032727272728 124.5498181818182 139.5316363636364 124.0087272727273C160.3025454545455 118.9701818181818 177.1578181818182 107.008 190.0043636363637 88.1396363636364C197.6494545454546 76.9105454545455 202.5716363636364 64.2967272727273 205.1374545454546 50.5250909090909C207.3658181818182 38.592 212.2123636363637 28.1832727272727 219.6363636363636 19.1825454545455C220.6370909090909 17.9723636363637 221.44 15.4065454545455 220.9396363636364 14.1381818181818C220.4392727272727 12.8581818181818 218.2167272727273 11.7236363636364 216.7389090909091 11.7178181818182C153.6989090909091 11.6014545454545 90.6589090909091 11.6014545454545 27.6189090909091 11.7178181818182C26.1469090909091 11.7236363636364 23.9185454545454 12.864 23.424 14.144C22.9294545454545 15.4123636363636 23.7265454545454 17.9723636363636 24.7272727272727 19.1825454545454C32.0930909090909 28.096 36.7243636363636 38.4581818181818 39.2087272727272 50.1934545454545C47.6101818181818 89.9316363636364 69.7832727272727 114.5425454545455 105.4138181818182 124.1425454545455C107.1127272727273 124.6021818181818 107.6538181818182 125.3818181818182 107.5898181818182 127.2261818181818C107.4850909090909 130.2865454545454 107.5549090909091 133.3469090909091 107.5549090909091 136.4072727272727C107.5665454545454 141.44 108.4858181818182 142.4465454545455 113.1229090909091 142.4698181818182C114.7810909090909 142.4814545454546 116.4392727272727 142.4698181818182 118.4756363636364 142.4698181818182M127.8836363636364 0.0116363636364H12.7301818181818C6.4989090909091 0.0232727272727 1.9316363636364 3.1941818181818 0.4421818181818 8.4363636363636C-1.5709090909091 15.552 3.4967272727273 22.5163636363637 11.0894545454545 22.9410909090909C13.6378181818182 23.0865454545455 16.2036363636364 22.9992727272727 18.7636363636364 22.9992727272727L241.7047272727273 23.0050909090909C248.6865454545455 23.0050909090909 252.9163636363637 20.6894545454545 254.9236363636364 15.7905454545455C258.0305454545455 8.192 252.3112727272727 0.064 243.6712727272727 0.0349090909091C221.0676363636364 -0.0232727272727 198.464 0.0116363636363 175.8603636363636 0.0116363636363H127.8836363636364M46.5454545454545 146.3214545454545C46.5745454545455 141.5214545454545 43.5549090909091 138.3563636363636 40.9658181818182 140.1367272727273C35.2349090909091 144.0349090909091 29.7425454545455 148.2821818181818 24.5236363636364 152.8378181818182C23.4356363636364 153.792 22.9992727272727 157.6552727272727 23.4472727272727 159.7207272727273C24.128 162.8741818181818 26.6298181818182 163.6712727272727 28.7069090909091 162.1934545454545A303.0690909090909 303.0690909090909 0 0 0 44.8698181818182 149.7425454545455C45.8123636363636 148.9687272727273 46.2138181818182 147.0254545454545 46.5454545454546 146.3214545454545zM186.1818181818182 146.5192727272727C186.6123636363637 147.2756363636364 187.2465454545455 149.312 188.3694545454546 150.2603636363636A311.65672727272727 311.65672727272727 0 0 0 203.2581818181818 162.0538181818182C205.4516363636364 163.6887272727273 207.5752727272727 162.9963636363637 208.8436363636364 159.8138181818182C210.112 156.6254545454546 209.3323636363636 153.8967272727273 207.1912727272727 152.1338181818182A352.6574545454545 352.6574545454545 0 0 0 192.2967272727273 140.3636363636364C189.3701818181818 138.2109090909091 186.1701818181818 141.0036363636364 186.1818181818182 146.5192727272727zM104.7272727272727 189.2829090909091C103.8545454545455 188.5090909090909 102.7665454545455 186.6647272727273 101.1258181818182 186.3272727272727C99.2174545454546 185.9374545454545 95.6974545454546 186.3447272727273 94.8130909090909 187.3454545454545A162.99636363636364 162.99636363636364 0 0 0 81.6349090909091 204.2356363636363C80.8901818181818 205.3527272727272 82.5890909090909 208.2676363636364 84.2938181818182 209.1229090909091C85.7076363636364 209.8327272727273 90.0072727272727 209.3323636363636 90.9032727272727 208.3258181818182C95.7323636363637 202.8974545454545 99.9156363636364 197.1549090909091 104.2734545454546 191.4996363636364C104.5643636363637 191.1156363636363 104.4770909090909 190.5687272727273 104.7272727272727 189.2829090909091zM169.7338181818182 186.1818181818182C164.4101818181818 186.0421818181818 161.472 189.1374545454546 163.6189090909091 192.2385454545454A159.4647272727273 159.4647272727273 0 0 0 175.9534545454546 208.0465454545455C176.9658181818182 209.1810909090909 180.736 209.7221818181818 182.8247272727273 209.3265454545455C186.0072727272727 208.7214545454546 186.9730909090909 206.1672727272727 185.5243636363636 204.1192727272727C181.568 198.528 177.2043636363637 193.088 172.7941818181818 187.6829090909091C172.1018181818182 186.8276363636364 170.3330909090909 186.4669090909091 169.7338181818182 186.1876363636364V186.1818181818182zM34.9323636363636 116.4218181818182C32.3141818181818 116.4218181818182 29.696 116.3461818181818 27.0836363636364 116.4392727272727C24.704 116.5149090909091 23.2901818181818 118.6152727272727 23.2727272727273 122.1236363636364C23.2494545454545 125.6494545454546 24.7214545454545 127.8254545454546 27.0370909090909 127.8952727272727C32.2734545454545 128.0407272727273 37.504 128.0232727272728 42.7403636363636 127.9010909090909C45.0676363636364 127.8487272727273 46.5512727272727 125.7309090909091 46.5454545454545 122.1992727272727C46.5396363636364 118.72 45.1607272727273 116.5265454545455 42.7810909090909 116.4218181818182C40.1629090909091 116.3054545454546 37.5447272727273 116.3985454545455 34.9323636363636 116.3985454545455V116.4218181818182zM209.024 116.3810909090909C206.6210909090909 116.3810909090909 204.2123636363637 116.3345454545455 201.8036363636364 116.3927272727273C199.2843636363637 116.4509090909091 197.7774545454546 118.5105454545455 197.8181818181818 122.3098181818182C197.8589090909091 125.8647272727273 199.3774545454546 127.8836363636364 201.6989090909091 127.9243636363636A436.34036363636363 436.34036363636363 0 0 0 217.0938181818182 127.936C219.5781818181818 127.8952727272728 221.1316363636364 125.7716363636364 221.0909090909091 122.0014545454546C221.0501818181818 118.4814545454546 219.5665454545455 116.4741818181818 217.1927272727273 116.416C214.4698181818182 116.3578181818182 211.7469090909091 116.4043636363637 209.024 116.4043636363637V116.3810909090909zM137.8327272727273 220.7418181818182C137.8327272727273 218.368 137.8269090909091 216 137.8385454545455 213.632C137.856 211.1709090909091 136.4770909090909 209.5883636363636 133.7541818181818 209.5418181818182C131.0487272727273 209.4952727272727 129.5127272727273 210.9847272727273 129.5069090909091 213.4690909090909C129.4661818181818 218.5192727272727 129.4254545454546 223.5636363636364 129.4952727272727 228.608C129.5301818181818 230.9003636363637 130.9381818181818 232.3432727272728 133.5738181818182 232.3781818181818C136.4014545454546 232.4130909090909 137.7745454545455 230.9003636363637 137.8385454545455 228.4683636363636C137.9025454545455 225.8967272727273 137.856 223.3192727272727 137.856 220.7418181818182H137.8327272727273z" />
    <glyph glyph-name="restaurant"
      unicode="&#xEA0D;"
      horiz-adv-x="179.2" d="M15.2512 229.2608C11.2448 225.344 6.4 207.072 9.9584 196.0128C12.992 186.5792 18.3616 178.6176 26.3872 172.5888C25.024 175.9808 23.36 179.1872 21.8752 182.4768C18.3744 190.24 14.9248 198.0352 15.0272 206.8032L15.2512 226.6304V229.2608zM33.888 2.4768C31.9808 3.6032 29.824 4.4608 28.2176 5.9136C25.7216 8.1728 25.1712 11.2896 25.1776 14.6112C25.2224 45.728 25.3184 76.8448 25.1072 107.9552C25.0624 114.5344 26.1184 120.7424 27.9744 126.9888C30.5792 135.7696 31.9296 144.7808 30.9952 153.9648C30.752 156.352 29.9904 158.7008 29.2672 161.0112C28.7168 162.8032 27.5072 163.9296 25.5936 164.704C18.56 167.552 13.2288 172.5632 9.2416 178.8352C-2.1248 196.704 -2.5984 215.4624 5.5808 234.5344C9.1008 242.7392 14.9248 249.2864 23.3792 252.9408C26.5856 254.336 30.0992 255.0016 33.4784 256H40.4224C44.0448 254.88 47.8208 254.112 51.2384 252.5632C59.2832 248.9344 64.6784 242.5344 68.2496 234.7136C74.9696 219.9872 75.6928 204.8256 70.2016 189.6128C66.5152 179.3728 60.2624 170.944 50.3872 165.5808C50.0288 165.3888 49.6832 165.0944 49.3056 165.024C45.5552 164.3392 44.4928 161.3888 43.7248 158.3424C42.048 151.7376 42.3168 145.0368 43.552 138.4512C44.7232 132.1792 46.5472 126.016 48.0192 119.7888C48.384 118.2336 48.7232 116.6208 48.7232 115.0336C48.7616 82.1696 48.6592 49.3056 48.8256 16.4352C48.8576 9.6512 46.8032 4.7488 40.0192 2.4768H33.888zM110.848 177.7792V243.1552C112.96 243.1552 114.8288 243.2192 116.6848 243.1104C117.0944 243.0912 117.664 242.5536 117.8048 242.1632C117.9968 241.6128 117.8688 240.9792 117.8688 240.384C117.8688 220.352 117.9136 200.32 117.8176 180.2944C117.8048 178.2464 118.464 177.6448 120.8512 177.7344C125.9584 177.9328 125.2928 177.2032 125.2928 181.4336C125.3184 201.1328 125.2928 220.8256 125.3376 240.5248C125.3376 241.376 125.6128 242.8928 126.0224 242.9568C127.6864 243.232 129.4656 243.1488 131.168 242.9568C131.4496 242.9248 131.6928 241.6832 131.6928 241.0048C131.7248 230.0928 131.7184 219.1808 131.7184 208.2624V178.4128H140.5376L138.4896 243.1552000000001C140.6208 243.1552000000001 142.592 243.296 144.5056 243.0720000000001C145.0816 243.0016 145.8112 241.9392000000001 145.9136 241.2672000000001C146.9824 234.08 147.936 226.8672000000001 148.9216 219.6736C150.3936 209.0368 151.808 198.3936 153.344 187.7696C154.5792 179.232 151.2576 172.0320000000001 144.3456 165.9776C132.8192 155.872 128.6208 143.8272 130.5216 130.0992C130.9696 126.8672 131.4175999999999 123.6096 132.3264 120.4544C133.9648 114.7072 134.272 108.9088 134.2591999999999 103.0336C134.1759999999999 72.4864 134.2208 41.9456 134.2015999999999 11.4048C134.2015999999999 4.224 128.3135999999999 -0.5952 120.4095999999999 0.0576C114.5407999999999 0.544 109.8687999999999 4.4992 109.3567999999999 9.4528A31.302400000000002 31.302400000000002 0 0 0 109.2415999999999 12.6464C109.2223999999999 44.4544 109.2927999999999 76.2624 109.1391999999999 108.0704C109.1135999999999 112.9984 110.9759999999999 117.4784 112.3967999999999 122.0864C114.8287999999999 130.0032 115.6799999999999 137.9584000000001 113.2095999999999 145.9456C110.8543999999999 153.5616 106.1759999999999 160.064 99.4239999999999 165.5680000000001C91.9231999999999 171.6864 88.6335999999999 179.2832 89.8431999999999 188C92.3391999999999 205.9648 95.0911999999999 223.904 97.7471999999999 241.856C97.8111999999999 242.24 97.9583999999999 242.624 98.0863999999999 243.0720000000001H104.4479999999999C104.4479999999999 242.2464 104.4671999999999 241.5360000000001 104.4415999999999 240.832L102.6303999999999 191.3472C102.4831999999999 187.4944 102.3871999999999 183.6352 102.1055999999999 179.7888C101.9903999999999 178.1504 102.7007999999999 177.6768 104.5183999999999 177.7536C106.5407999999999 177.8496 108.5695999999999 177.7792 110.8543999999999 177.7792M179.0208 255.7312V253.5552C179.0784 173.2224 179.1232 92.896 179.2 12.5632C179.2 8.5312 178.6368 4.896 176.0128 2.304C173.3696 -0.3072 170.432 -0.6656 167.4752 1.0624C164.6784000000001 2.7008 162.944 5.7024 162.8672 9.7536C162.688 19.6544 162.6688 29.5616 162.6048 39.4624C162.5216 51.84 162.5152 64.224 162.3616 76.5952A33.1072 33.1072 0 0 0 163.6416 86.2272C164.8448 90.4768 165.1328 94.9312 164.8384 99.424C164.3264 107.2384 161.0496 112.352 155.4752 114.9824C154.0608 115.6544 153.5424 116.5056 153.6064 118.5024C154.0928 133.344 154.2592 148.1984 154.9696 163.0208C155.8336 181.2224000000001 157.7664 199.2704000000001 161.2864 216.9664000000001C163.3408 227.2960000000001 165.8944 237.4208000000001 170.2144 246.5984000000001C171.4752 249.2672000000001 173.1136 251.6416000000001 174.5792 254.1504000000001C175.6864 256.0448000000001 177.1648 256.3008000000001 179.0208 255.7312000000001" />
    <glyph glyph-name="speeltuin"
      unicode="&#xEA0E;"
      horiz-adv-x="256" d="M256 78.5545365853659L147.2249756097561 48.4183414634146C154.2087804878049 43.6885853658537 159.0040975609756 37.9254634146341 160.2247804878049 29.8583414634146C161.420487804878 21.9317073170731 159.5785365853659 14.7793170731707 154.3055609756098 8.697756097561C146.1603902439025 -0.6930731707317 132.9295609756098 -2.7036097560976 122.3492682926829 3.7650731707317C110.9447804878049 10.7301463414634 107.7229268292683 23.0961951219512 113.6078048780488 39.0899512195122L5.0731707317073 9.0599024390244L0 27.5918048780488C10.7800975609756 30.6076097560976 21.3166829268293 33.5547317073171 32.2716097560976 36.614243902439L27.5918048780488 54.540487804878L33.6858536585366 56.3637073170732L38.7371707317073 38.3625365853658L212.2739512195122 86.4156097560976L207.5785365853659 104.4042926829268L213.7162926829269 106.1463414634146L218.6895609756098 88.2357073170732L250.9642926829269 97.0864390243903L256 78.5545365853659" />
    <glyph glyph-name="tour"
      unicode="&#xEA0F;"
      horiz-adv-x="256" d="M232.3692307692308 102.0521025641026C232.1657435897436 101.9470769230769 231.8966153846154 101.888 231.7718974358974 101.7238974358974C221.059282051282 87.3550769230769 206.3885128205128 78.460717948718 190.0438974358974 71.9622564102564C187.713641025641 71.0432820512821 186.499282051282 69.7895384615385 185.6459487179487 67.452717948718C180.4603076923077 53.2283076923077 173.6139487179487 39.936 162.9735384615385 28.8754871794872C161.1093333333333 26.939076923077 159.297641025641 24.9370256410257 157.6041025641026 23.1187692307693C190.9891282051282 31.7243076923077 223.9081025641026 63.3961025641026 232.3692307692308 102.0521025641026M155.4707692307692 234.9095384615385C170.4763076923077 222.8644102564103 179.265641025641 207.0252307692308 185.6 189.6237948717949C186.4402051282051 187.3001025641026 187.6348717948718 186.0135384615385 189.9585641025641 185.0945641025641C206.4082051282051 178.5107692307693 221.184 169.537641025641 231.9688205128205 155.0637948717949C232.0213333333333 154.9915897435898 232.3298461538461 155.1031794871795 232.513641025641 155.1294358974359C227.3476923076923 189.184 183.9524102564102 234.3384615384616 155.4707692307692 234.9095384615385M20.4340512820513 100.4110769230769C23.0596923076923 68.8114871794872 71.3058461538462 21.7993846153846 101.0609230769231 21.6221538461539C98.9604102564103 23.4929230769231 96.958358974359 25.1667692307693 95.0875897435898 26.9718974358975C83.6988717948718 37.9076923076923 76.5571282051282 51.456 70.8791794871795 65.9364102564103C70.3015384615385 67.4067692307693 68.7130256410256 68.8443076923077 67.2295384615385 69.5335384615385C61.7813333333333 72.0738461538462 56.064 74.0430769230769 50.6683076923077 76.6818461538462C39.0564102564103 82.3597948717949 28.8295384615385 89.9282051282052 20.4340512820513 100.4045128205129M20.1321025641026 156.2781538461539C21.6877948717949 158.0570256410257 23.1844102564103 159.8949743589744 24.8123076923077 161.6082051282052C36.4307692307692 173.7977435897436 50.7930256410256 181.5302564102565 66.5206153846154 187.0112820512821C68.9362051282051 187.8514871794872 70.2884102564103 189.052717948718 71.2664615384615 191.6061538461539C77.9290256410257 209.0404102564103 86.908717948718 224.9517948717949 102.524717948718 236.1961025641026C102.7282051282051 236.347076923077 102.7872820512821 236.7081025641026 103.1745641025641 237.5286153846154C59.6808205128205 226.0020512820513 32.256 198.9579487179488 20.1321025641026 156.2781538461538M189.761641025641 176.5415384615385A201.91179487179485 201.91179487179485 0 0 0 195.649641025641 128.6170256410256C195.6824615384615 112.574358974359 193.6935384615385 96.7811282051282 189.8075897435898 80.5021538461539C205.1872820512821 87.4929230769231 218.7290256410256 95.6061538461539 227.2886153846154 109.889641025641C234.3515897435898 121.6918974358974 234.6797948717949 133.9076923076923 227.9450256410257 145.9331282051282C219.5626666666667 160.8992820512821 205.6402051282052 169.216 189.761641025641 176.5415384615384M79.7013333333333 191.1597948717949C112.6137435897436 198.9579487179487 144.6334358974359 198.4787692307692 176.7581538461539 189.7878974358974C172.4455384615385 202.6404102564103 163.6299487179487 216.6153846153846 154.88 224.7220512820513C138.3450256410257 240.062358974359 118.974358974359 240.3971282051282 102.1111794871795 225.4769230769231C91.7267692307692 216.2740512820513 85.1954871794872 204.5046153846154 79.7013333333333 191.1597948717949M79.740717948718 65.7394871794872C85.4317948717949 51.9154871794872 92.3109743589744 39.5027692307692 103.6931282051282 30.208C120.2871794871795 16.6465641025641 139.008 17.4539487179487 154.7093333333334 32.1312820512821C163.4921025641026 40.3364102564103 169.5901538461539 50.3401025641026 174.4475897435898 61.184C175.2746666666667 63.041641025641 176.0229743589744 64.9255384615385 176.961641025641 67.1704615384615C143.6750769230769 58.302358974359 111.4715897435898 58.368 79.740717948718 65.7394871794872M66.8882051282051 78.3622564102564C58.236717948718 111.8916923076923 58.3614358974359 144.8828717948718 66.816 178.5829743589743C50.1037948717949 171.9269743589743 35.5577435897436 163.971282051282 25.6262564102564 149.7009230769231C16.0689230769231 135.9688205128205 16.2002051282051 120.510358974359 25.8756923076923 106.9029743589744C35.9384615384616 92.7507692307692 50.5107692307692 84.8935384615384 66.8882051282051 78.3622564102564M187.5626666666667 123.6676923076923C187.7333333333334 144.2658461538462 185.3833846153847 161.7132307692308 181.3202051282052 176.7187692307692C180.6572307692308 179.1671794871795 179.5216410256411 180.3815384615385 177.020717948718 181.1232820512821C144.252717948718 190.8184615384615 111.3796923076924 190.9431794871795 78.4278974358975 182.2654358974359C77.246358974359 181.9569230769231 75.9269743589744 180.2633846153846 75.5593846153847 178.9636923076923C66.1792820512821 145.6443076923077 66.0676923076924 112.2789743589744 75.198358974359 78.8611282051282C75.9794871794872 76.0123076923077 77.3251282051283 74.5944615384615 80.0951794871795 74.1349743589744C89.4949743589744 72.5530256410256 98.8356923076924 70.3737435897436 108.3011282051283 69.4153846153846C131.6693333333334 67.0523076923077 154.7290256410257 69.0084102564102 177.2898461538462 75.9138461538461C179.6397948717949 76.6358974358974 180.6900512820514 77.8568205128205 181.3136410256411 80.1673846153846C185.6000000000001 95.9868717948718 187.5757948717949 112.0820512820513 187.5626666666667 123.6676923076923M126.1554871794872 256C195.8990769230769 255.6849230769231 252.4882051282051 198.2884102564103 252.0549743589744 128.3085128205128C251.6217435897436 57.8953846153846 194.816 1.5228717948718 124.5997948717949 1.8379487179487C55.8539487179487 2.1530256410257 -0.4594871794872 60.1009230769231 0 130.0348717948718C0.4594871794872 199.3124102564103 57.5409230769231 256.3085128205128 126.1620512820513 256" />
    <glyph glyph-name="vers"
      unicode="&#xEA10;"
      horiz-adv-x="204.8" d="M101.2352 21.1968C111.5008 35.4944 120.2688 49.1328 126.6176 64.2368C129.2608 70.5344 130.2656 76.9792 128.576 83.328C124.2752 99.5264 107.9936 107.8464 92.0128 102.5536C76.8064 97.5168 69.2672 80.3968 75.872 65.2672C79.0912 57.8943999999999 82.528 50.5727999999999 86.56 43.6095999999999C90.8672 36.1536 95.9808 29.1455999999999 101.2352 21.1967999999999M0.0448 127.9808H202.9696C201.6 121.1904 200.3968 114.7392 198.9888 108.3328C191.5392 74.3616 183.9744 40.4096 176.6336 6.4128C175.6992 2.0928 174.3296 0.2816 169.2608 0.3072C123.4496 0.5632 77.632 0.4992 31.8208 0.3712C28.096 0.3584 26.816 1.5744 26.0928 5.0432C20.4416 32 14.592 58.9184 8.7808 85.8368C5.9008 99.1424 2.9568 112.4288 0.0576 125.728C-0.064 126.304 0.0448 126.9184 0.0448 127.9808M137.92 140.8H0.6272C-2.3488 150.656 5.536 165.9392 17.7472 174.208C34.2784 185.3952 52.48 183.9296 74.5536 169.1072C73.7344 172.8 73.1648 175.8144 72.3904 178.7776C68.6912 192.9472 64.7104 207.0528 61.2864 221.2736C58.688 232.0448 60.3072 242.2336 69.0944 250.1888C78.5344 258.7456 93.6704 257.6384 104.0896 248.2944C117.6 236.1792 123.1872 220.4416 126.7968 203.7632C127.5392 200.3072 128.0448 196.8064 128.6272 193.3248C128.6656 193.0688 128.416 192.768 128.2368 192.3328C124.128 195.52 120.1536 198.7968 115.9552 201.7728A19.3792 19.3792 0 0 1 109.536 204.8192C108.0768 205.1776 106.2848 204.3072 104.6464 203.9872C105.1904 202.3424 105.3504 200.416 106.3744 199.136C107.5072 197.7472 109.4336 196.9408 111.0336 195.904C123.5648 187.7888 134.1376 178.048 138.9568 163.872C140.1664 160.32 140.2176 156.4096 140.8 152.6592L139.552 151.968C137.3888 153.6192 135.36 155.4624 133.0496 156.8896C128.0576 159.9616 123.0208 163.0144 117.76 165.632C116.4416 166.2848 114.208 165.2608 112.3968 165.0048C112.9984 163.0272 112.9408 160.3136 114.3104 159.2C121.2864 153.5296 128.6464 148.2816 135.8528 142.8672C136.3456 142.5024 136.7296 142.0032 137.92 140.8M172.9088 140.8448C163.6864 140.8448 154.4576 140.928 145.2352 140.8C142.0992 140.7616 140.9088 141.4784 140.8192 144.192C140.5376 153.504 142.7712 162.2208 149.3312 169.9712C153.9584 175.4368 156.8128000000001 181.3376 157.3888 187.9808C157.5808000000001 190.2336 157.6448 191.7696 154.3296 193.0816C152.064 193.984 149.888 197.0496 149.8496000000001 199.1616C149.8112000000001 202.016 152.2496000000001 204.6656 156.6336 204.6912C167.808 204.7488 178.9952000000001 204.9984 190.1248 204.4672C192.608 204.3456 196.416 201.5104 196.8064 199.552C197.2032000000001 197.5744 194.7520000000001 194.1056 192.4032 193.152C188.9088 191.744 188.3136 189.8752 189.1264 187.68C191.2448 181.9648 193.0304 176 196.4864 170.816C202.0736 162.4576 204.6784 153.792 204.8 144.3968C204.8384 141.376 203.3152 140.7744 200.0576 140.8128C191.008 140.9408 181.9584 140.8576 172.9088 140.8576V140.8448zM38.4 205.056C14.784 202.9696 -2.368 213.9968 0.2688 229.344C24.256 234.3808 35.4048 220.5888 38.4 205.056M108.7168 102.2528C118.3744 103.552 127.3792 94.3616 127.9744 83.7184C128.5632 73.1456 119.2 63.9744 108.5824 64C98.2144 64.0256 89.2992 73.0688 89.6064 83.5904C89.9264 94.4704 99.8848 103.6672 108.7168 102.2528" />
    <glyph glyph-name="youtube"
      unicode="&#xEA11;"
      horiz-adv-x="256" d="M176.384 87.6942222222222L95.0328888888889 128.3413333333333V47.3102222222222L176.384 87.7013333333333M0 65.3582222222222V105.3084444444444C0.1066666666667 105.9484444444444 0.2844444444444 106.5742222222222 0.32 107.2142222222222C0.6328888888889 112.0995555555556 0.8106666666667 116.9848888888889 1.2302222222222 121.8631111111111C1.9626666666667 130.3111111111111 2.7946666666667 138.8017777777778 5.7813333333333 146.8373333333333C9.7564444444444 157.5751111111111 17.7066666666667 164.4231111111111 29.4186666666667 166.784C34.1973333333333 167.744 39.1324444444444 168.1635555555556 44.0177777777778 168.3982222222222C61.1555555555556 169.2444444444445 78.2933333333333 170.2755555555556 95.4453333333333 170.5244444444445C118.3217777777778 170.8515555555555 141.2124444444444 170.5671111111111 164.096 170.4177777777778C183.4453333333334 170.2968888888889 202.752 169.3937777777778 222.0231111111111 167.5662222222222C236.416 166.2008888888889 248.1208888888889 157.3262222222222 251.2924444444445 143.872C253.2124444444445 135.7013333333333 254.0088888888889 127.2746666666667 255.0826666666667 118.9404444444445C255.6444444444445 114.56 255.7084444444445 110.1226666666667 256 105.7066666666667V65.3724444444445C255.8862222222222 64.6044444444445 255.7226666666667 63.8435555555556 255.6728888888889 63.0755555555556C255.36 58.1333333333333 255.1893333333333 53.1768888888889 254.7484444444445 48.2417777777778C253.9875555555556 39.9217777777778 253.1982222222222 31.5662222222223 250.1973333333333 23.6657777777778C246.144 13.0275555555556 238.2293333333334 6.2648888888889 226.6097777777778 3.8897777777778C222.3715555555556 3.0151111111111 217.984 2.624 213.6462222222222 2.4106666666667C195.968 1.5502222222222 178.2826666666667 0.4408888888889 160.5973333333333 0.1706666666667C137.7137777777778 -0.1848888888889 114.8231111111111 0.1208888888889 91.9395555555556 0.2702222222222A657.5644444444445 657.5644444444445 0 0 0 34.0195555555556 3.1217777777778C18.9155555555556 4.5511111111111 7.1111111111111 14.1866666666667 4.3377777777778 28.5155555555556C2.7022222222222 36.8924444444444 1.8346666666667 45.4044444444444 0.7822222222222 53.8808888888889C0.32 57.6853333333333 0.2488888888889 61.5324444444444 0 65.3653333333333" />
  </font>
</defs>
</svg>
