id,description,newID,newDescription,testCase,url,output
TEST 2,TEST2 | THIS IS A TEST STATUS 2,-,-,create,/shipmentMaster,บันทึกข้อมูลสำเร็จ
TEST 3,TEST3 | THIS IS A TEST STATUS 3,-,-,create,/shipmentMaster,บันทึกข้อมูลสำเร็จ
ARV,ARV | Test Error,-,-,create,/shipmentMaster,พบข้อมูลซ้ำในระบบ กรุณาแก้ไขรายการก่อนบันทึก
TEST 3,TEST3 | THIS IS A TEST STATUS 3,TEST 3U,TEST 3U | THIS IS A TEST STATUS 3,update,/shipmentMaster,แก้ไขข้อมูลสำเร็จ
TEST 2,TEST2 | THIS IS A TEST STATUS 2,ARV,TEST2 | THIS IS A TEST STATUS 2,update,/shipmentMaster,พบข้อมูลซ้ำในระบบ กรุณาแก้ไขรายการก่อนบันทึก
TEST 2,TEST2 | THIS IS A TEST STATUS 2,-,-,deactivate,/shipmentMaster,แก้ไขข้อมูลสำเร็จ
TEST 2,TEST2 | THIS IS A TEST STATUS 2,-,-,activate,/shipmentMaster,แก้ไขข้อมูลสำเร็จ
TEST 2,TEST2 | THIS IS A TEST STATUS 2,,,delete,/shipmentMaster,ลบข้อมูลสำเร็จ
TEST 3,TEST3 | THIS IS A TEST STATUS 3,,,delete,/shipmentMaster,ลบข้อมูลสำเร็จ