<svg width="36" height="36" viewBox="0 0 36 36" fill="none" xmlns="http://www.w3.org/2000/svg">
<path d="M36 18C36 27.9425 27.9425 36 18 36C8.05749 36 0 27.9385 0 18C0 8.05749 8.05749 0 18 0C27.9425 0 36 8.05749 36 18Z" fill="#979797"/>
<path fill-rule="evenodd" clip-rule="evenodd" d="M17.3179 25.8932H18.7297C18.7297 25.8932 19.1548 25.8451 19.3754 25.6125C19.5759 25.3959 19.5679 24.9908 19.5679 24.9908C19.5679 24.9908 19.5398 23.0938 20.4182 22.817C21.2845 22.5403 22.3994 24.6499 23.5786 25.4601C24.473 26.0737 25.1508 25.9414 25.1508 25.9414L28.3072 25.8972C28.3072 25.8972 29.9596 25.797 29.1735 24.4975C29.1093 24.3892 28.7163 23.5389 26.8272 21.7823C24.85 19.9454 25.1147 20.2422 27.497 17.0657C28.9489 15.1325 29.5305 13.9494 29.35 13.444C29.1775 12.9627 28.1107 13.0911 28.1107 13.0911L24.5572 13.1151C24.5572 13.1151 24.2925 13.0791 24.1 13.1954C23.9075 13.3117 23.7871 13.5764 23.7871 13.5764C23.7871 13.5764 23.2256 15.0764 22.4756 16.3478C20.8954 19.0349 20.2617 19.1753 20.001 19.0109C19.3994 18.6218 19.5518 17.4467 19.5518 16.6125C19.5518 14.0095 19.9449 12.9226 18.7818 12.6419C18.3968 12.5496 18.112 12.4855 17.1254 12.4774C15.858 12.4654 14.7831 12.4815 14.1735 12.7783C13.7684 12.9748 13.4556 13.416 13.6481 13.444C13.8847 13.4761 14.4182 13.5884 14.6989 13.9734C15.0639 14.4668 15.0518 15.5817 15.0518 15.5817C15.0518 15.5817 15.2604 18.6459 14.5625 19.0269C14.0813 19.2876 13.4275 18.7542 12.0157 16.3157C11.2938 15.0684 10.7484 13.6887 10.7484 13.6887C10.7484 13.6887 10.6441 13.432 10.4556 13.2916C10.227 13.1232 9.91013 13.071 9.91013 13.071L6.53313 13.0911C6.53313 13.0911 6.02377 13.1071 5.83928 13.3277C5.67484 13.5242 5.82725 13.9293 5.82725 13.9293C5.82725 13.9293 8.46227 20.1058 11.4583 23.2221C14.2016 26.0817 17.3179 25.8932 17.3179 25.8932Z" fill="white"/>
</svg>
