v 83.032516 98.392151 0.000000
v 83.032516 98.392151 2.000000
v 83.032516 110.892151 2.000000
v 86.032516 98.392151 0.000000
v 86.032516 110.892151 2.000000
v 83.032516 110.892151 0.000000
v 86.032516 110.892151 0.000000
v 117.032516 105.892151 0.000000
v 117.032516 115.892151 0.000000
v 117.032516 95.892151 0.000000
v 117.032516 95.892151 2.000000
v 98.032516 85.892151 0.000000
v 86.032516 85.892151 0.000000
v 108.032516 85.892151 0.000000
v 98.032516 82.892151 0.000000
v 120.032516 95.892151 0.000000
v 138.032516 85.892151 0.000000
v 134.617508 95.926147 0.000000
v 138.032516 85.892151 2.000000
v 138.032516 82.892151 2.000000
v 108.032516 85.892151 2.000000
v 108.032516 82.892151 2.000000
v 120.032516 95.892151 2.000000
v 134.617508 95.926147 2.000000
v 98.032516 85.892151 2.000000
v 120.032516 105.892151 2.000000
v 132.707504 98.866150 2.000000
v 120.032516 105.892151 0.000000
v 132.707504 98.866150 0.000000
v 117.032516 105.892151 2.000000
v 120.032516 115.892151 0.000000
v 117.032516 115.892151 2.000000
v 133.196518 100.412148 0.000000
v 134.617508 101.807152 0.000000
v 133.196518 100.412148 2.000000
v 133.196518 97.320152 2.000000
v 133.196518 97.320152 0.000000
v 136.830521 94.819153 0.000000
v 136.830521 94.819153 2.000000
v 139.618515 94.109154 2.000000
v 142.709518 93.864151 2.000000
v 142.709518 93.864151 0.000000
v 148.032516 85.892151 2.000000
v 148.032516 82.892151 2.000000
v 145.800522 94.109154 2.000000
v 148.588516 94.819153 2.000000
v 145.800522 94.109154 0.000000
v 160.032516 85.892151 2.000000
v 148.032516 85.892151 0.000000
v 150.801514 95.926147 2.000000
v 152.222519 97.320152 2.000000
v 150.801514 95.926147 0.000000
v 148.588516 94.819153 0.000000
v 152.222519 97.320152 0.000000
v 160.032516 85.892151 0.000000
v 160.032516 98.392151 0.000000
v 152.712509 98.866150 0.000000
v 160.032516 98.392151 2.000000
v 163.032516 98.392151 0.000000
v 160.032516 110.892151 0.000000
v 163.032516 98.392151 2.000000
v 163.032516 110.892151 0.000000
v 163.032516 110.892151 2.000000
v 160.032516 110.892151 2.000000
v 160.032516 123.392151 2.000000
v 160.032516 123.392151 0.000000
v 150.349518 123.055153 2.000000
v 150.349518 124.018150 2.000000
v 149.006516 120.892151 2.000000
v 148.588516 102.913155 2.000000
v 149.006516 123.055153 2.000000
v 149.006516 123.055153 1.000000
v 150.349518 123.055153 1.000000
v 150.349518 124.018150 1.000000
v 149.006516 124.018150 1.000000
v 149.006516 124.018150 2.000000
v 149.006516 130.447144 2.000000
v 149.006516 130.447144 1.000000
v 147.853516 129.070145 1.000000
v 147.725510 130.447144 1.000000
v 147.725510 130.447144 2.000000
v 147.770508 128.906143 1.000000
v 147.545517 128.501144 1.000000
v 147.853516 129.070145 2.000000
v 147.853516 124.018150 1.000000
v 147.742508 128.853149 2.000000
v 147.853516 124.018150 2.000000
v 147.545517 128.501144 2.000000
v 147.399521 128.263153 1.000000
v 147.399521 128.263153 2.000000
v 144.951508 124.656151 2.000000
v 144.585510 124.154152 2.000000
v 144.951508 124.656151 1.000000
v 144.476517 124.018150 2.000000
v 144.476517 124.018150 1.000000
v 144.585510 124.154152 1.000000
v 143.351517 124.005150 1.000000
v 143.351517 123.055153 1.000000
v 147.853516 123.055153 1.000000
v 143.351517 124.005150 2.000000
v 143.351517 123.055153 2.000000
v 120.032516 125.892151 2.000000
v 83.032516 135.892151 2.000000
v 120.032516 115.892151 2.000000
v 136.830521 102.913155 2.000000
v 134.617508 101.807152 2.000000
v 139.618515 103.624153 2.000000
v 142.709518 103.869148 2.000000
v 139.618515 103.624153 0.000000
v 142.709518 103.869148 0.000000
v 136.830521 102.913155 0.000000
v 120.032516 125.892151 0.000000
v 145.800522 103.624153 0.000000
v 145.800522 103.624153 2.000000
v 148.588516 102.913155 0.000000
v 147.853516 120.892151 2.000000
v 147.853516 123.055153 2.000000
v 147.853516 120.892151 1.000000
v 149.006516 120.892151 1.000000
v 150.801514 101.807152 0.000000
v 150.801514 101.807152 2.000000
v 152.222519 100.412148 0.000000
v 152.222519 100.412148 2.000000
v 152.712509 98.866150 2.000000
v 163.032516 135.892151 0.000000
v 163.032516 123.392151 0.000000
v 83.032516 135.892151 0.000000
v 117.032516 125.892151 0.000000
v 163.032516 135.892151 2.000000
v 163.032516 123.392151 2.000000
v 83.032516 123.392151 0.000000
v 83.032516 123.392151 2.000000
v 86.032516 123.392151 0.000000
v 86.032516 123.392151 2.000000
v 117.032516 125.892151 2.000000
v 86.032516 98.392151 2.000000
v 86.032516 85.892151 2.000000
v 98.032516 82.892151 2.000000
v 108.032516 82.892151 0.000000
v 138.032516 82.892151 0.000000
v 139.618515 94.109154 0.000000
v 148.032516 82.892151 0.000000
f 1 2 3
f 2 1 4
f 2 5 3
f 1 3 6
f 7 6 3
f 6 4 1
f 6 7 4
f 4 7 8
f 9 8 7
f 8 10 4
f 11 10 8
f 12 4 10
f 12 13 4
f 14 12 10
f 15 12 14
f 10 16 14
f 10 11 16
f 14 16 17
f 18 17 16
f 17 19 14
f 17 20 19
f 21 14 19
f 22 14 21
f 21 19 23
f 24 23 19
f 11 21 23
f 21 11 25
f 23 16 11
f 16 23 26
f 26 23 27
f 28 16 26
f 16 28 29
f 28 26 8
f 30 8 26
f 8 9 28
f 9 31 28
f 9 32 31
f 31 33 28
f 34 33 31
f 33 29 28
f 33 27 29
f 33 35 27
f 36 29 27
f 36 37 29
f 36 27 23
f 24 36 23
f 24 37 36
f 24 18 37
f 38 18 24
f 16 37 18
f 29 37 16
f 18 38 17
f 39 38 24
f 40 38 39
f 24 19 39
f 39 19 40
f 41 40 19
f 42 40 41
f 19 43 41
f 44 43 19
f 45 41 43
f 45 42 41
f 46 45 43
f 46 47 45
f 46 43 48
f 48 43 49
f 46 48 50
f 50 48 51
f 52 46 50
f 52 53 46
f 52 50 54
f 51 54 50
f 55 52 54
f 52 55 53
f 55 54 56
f 57 56 54
f 58 55 56
f 58 48 55
f 58 56 59
f 59 56 60
f 58 59 61
f 62 61 59
f 63 58 61
f 63 64 58
f 62 63 61
f 62 64 63
f 62 60 64
f 59 60 62
f 60 65 64
f 60 66 65
f 65 67 64
f 67 65 68
f 69 64 67
f 64 69 70
f 71 69 67
f 72 69 71
f 71 67 73
f 68 73 67
f 71 73 72
f 74 72 73
f 74 75 72
f 68 74 73
f 68 75 74
f 68 76 75
f 76 68 77
f 76 77 75
f 78 75 77
f 78 79 75
f 77 80 78
f 80 77 81
f 80 79 78
f 80 82 79
f 80 83 82
f 84 79 82
f 79 84 85
f 86 84 82
f 84 86 87
f 86 82 83
f 83 88 86
f 88 83 89
f 88 87 86
f 87 88 90
f 88 89 90
f 90 91 87
f 90 89 91
f 91 92 87
f 93 92 91
f 94 87 92
f 87 94 95
f 92 95 94
f 92 96 95
f 93 96 92
f 95 96 97
f 93 97 96
f 98 95 97
f 98 99 95
f 100 98 97
f 100 101 98
f 100 97 80
f 80 97 89
f 81 100 80
f 81 102 100
f 102 81 103
f 100 102 101
f 102 104 101
f 104 102 31
f 104 105 101
f 106 105 104
f 107 101 105
f 107 108 101
f 109 107 105
f 107 109 110
f 109 105 111
f 111 105 34
f 109 111 112
f 31 112 111
f 110 109 112
f 110 112 113
f 112 60 113
f 113 108 110
f 113 114 108
f 107 110 108
f 115 114 113
f 108 114 116
f 116 114 69
f 116 101 108
f 117 101 116
f 117 98 101
f 99 117 116
f 117 99 98
f 116 118 99
f 116 119 118
f 72 99 118
f 99 72 85
f 72 118 119
f 72 119 69
f 116 69 119
f 72 75 85
f 85 95 99
f 95 85 87
f 87 85 84
f 79 85 75
f 114 70 69
f 115 70 114
f 120 70 115
f 120 121 70
f 120 115 60
f 115 113 60
f 122 120 60
f 120 122 121
f 56 122 60
f 57 122 56
f 123 122 57
f 123 121 122
f 123 57 124
f 54 124 57
f 124 58 123
f 51 58 124
f 123 58 64
f 121 123 64
f 64 70 121
f 58 51 48
f 54 51 124
f 60 112 66
f 125 66 112
f 126 66 125
f 125 112 127
f 128 127 112
f 125 127 129
f 103 129 127
f 129 126 125
f 129 130 126
f 129 65 130
f 66 126 130
f 66 130 65
f 65 129 68
f 77 68 129
f 77 129 81
f 129 103 81
f 131 103 127
f 131 132 103
f 131 127 133
f 128 133 127
f 132 131 133
f 132 133 134
f 133 5 134
f 134 103 132
f 103 134 135
f 32 135 134
f 135 102 103
f 135 128 102
f 32 128 135
f 112 102 128
f 112 31 102
f 32 9 128
f 128 9 133
f 133 9 7
f 133 7 5
f 7 3 5
f 134 5 32
f 30 32 5
f 32 30 104
f 5 136 30
f 2 136 5
f 11 30 136
f 11 8 30
f 136 25 11
f 137 25 136
f 25 137 12
f 136 13 137
f 136 4 13
f 13 12 137
f 2 4 136
f 12 138 25
f 12 15 138
f 22 25 138
f 22 21 25
f 139 22 138
f 22 139 14
f 139 138 15
f 15 14 139
f 30 26 104
f 104 31 32
f 26 35 104
f 26 27 35
f 106 104 35
f 35 33 106
f 34 106 33
f 106 34 105
f 111 34 31
f 93 89 97
f 80 89 83
f 89 93 91
f 49 55 48
f 49 53 55
f 47 53 49
f 46 53 47
f 42 47 49
f 45 47 42
f 49 17 42
f 140 17 49
f 141 42 17
f 42 141 40
f 141 17 38
f 40 141 38
f 17 140 20
f 140 49 142
f 44 142 49
f 142 20 140
f 142 44 20
f 44 19 20
f 44 49 43
