﻿category,ODi Luminance (Visible),ODi Luminance Blank (Visible)
Mon Feb 10 2025,20671,20353
Mon Feb 10 2025,19611,20353
Mon Feb 10 2025,19318,20353
Mon Feb 10 2025,19152,20353
Mon Feb 10 2025,19038,20353
Mon Feb 10 2025,18949,20353
Mon Feb 10 2025,18879,20353
Mon Feb 10 2025,18823,20353
Mon Feb 10 2025,18772,20353
Mon Feb 10 2025,18733,20353
Mon Feb 10 2025,18694,20353
Mon Feb 10 2025,18676,20353
Mon Feb 10 2025,18656,20353
Mon Feb 10 2025,18633,20353
Mon Feb 10 2025,18633,20353
Mon Feb 10 2025,18623,20353
Mon Feb 10 2025,18618,20353
Mon Feb 10 2025,18622,20353
Mon Feb 10 2025,18612,20353
Mon Feb 10 2025,18613,20353
Mon Feb 10 2025,18602,20353
Mon Feb 10 2025,18582,20353
Mon Feb 10 2025,18566,20353
Mon Feb 10 2025,18551,20353
Mon Feb 10 2025,18535,20353
Mon Feb 10 2025,18529,20353
Mon Feb 10 2025,18526,20353
Mon Feb 10 2025,18511,20353
Mon Feb 10 2025,18510,20353
Mon Feb 10 2025,18503,20353
Mon Feb 10 2025,18500,20353
Mon Feb 10 2025,18504,20353
Mon Feb 10 2025,18506,20353
Mon Feb 10 2025,18519,20353
Mon Feb 10 2025,18529,20353
Mon Feb 10 2025,18536,20353
Mon Feb 10 2025,18539,20353
Mon Feb 10 2025,18543,20353
Mon Feb 10 2025,18533,20353
Mon Feb 10 2025,18524,20353
Mon Feb 10 2025,18512,20353
Mon Feb 10 2025,18504,20353
Mon Feb 10 2025,18496,20353
Mon Feb 10 2025,18489,20353
Mon Feb 10 2025,18490,20353
Mon Feb 10 2025,18485,20353
Mon Feb 10 2025,18484,20353