# Blender v2.73 (sub 0) OBJ File: 'mesh.blend'
# www.blender.org
mtllib mesh_lig.mtl
o lig_Torus.001
v 0.132388 0.456316 -0.005178
v 0.133067 0.461160 -0.005385
v 0.132721 0.461243 -0.001635
v 0.132060 0.456528 -0.001434
v 0.131498 0.451506 -0.004974
v 0.131194 0.451847 -0.001234
v 0.132055 0.456210 -0.008927
v 0.132716 0.460925 -0.009128
v 0.133523 0.465955 -0.005589
v 0.133165 0.465910 -0.001833
v 0.131770 0.461151 0.001118
v 0.130412 0.446812 -0.004773
v 0.130137 0.447280 -0.001040
v 0.131188 0.451529 -0.008728
v 0.131159 0.456792 0.001303
v 0.131150 0.456240 -0.011675
v 0.133160 0.465592 -0.009326
v 0.133749 0.470620 -0.005787
v 0.133385 0.470450 -0.002026
v 0.132180 0.465467 0.000934
v 0.129148 0.442316 -0.004582
v 0.128907 0.442904 -0.000853
v 0.130131 0.446962 -0.008533
v 0.130357 0.452463 0.001488
v 0.129380 0.448239 0.001668
v 0.130348 0.451911 -0.011491
v 0.131761 0.460600 -0.011861
v 0.132172 0.464916 -0.012045
v 0.133741 0.475075 -0.005976
v 0.133376 0.474785 -0.002210
v 0.132384 0.469666 0.000756
v 0.130469 0.460910 0.002135
v 0.129925 0.457034 0.002299
v 0.130834 0.464746 0.001971
v 0.127729 0.438093 -0.004401
v 0.127526 0.438794 -0.000678
v 0.128902 0.442585 -0.008346
v 0.128243 0.444192 0.001840
v 0.129371 0.447687 -0.011311
v 0.129213 0.453186 0.002463
v 0.128344 0.449432 0.002623
v 0.129203 0.452550 -0.012523
v 0.129915 0.456398 -0.012687
v 0.130458 0.460273 -0.012852
v 0.132375 0.469114 -0.012223
v 0.133380 0.470132 -0.009519
v 0.133498 0.479242 -0.006153
v 0.133140 0.478841 -0.002382
v 0.132376 0.473675 0.000585
v 0.131014 0.468478 0.001813
v 0.129166 0.460583 0.001144
v 0.126179 0.434217 -0.004236
v 0.126017 0.435021 -0.000516
v 0.127521 0.438476 -0.008171
v 0.128234 0.443640 -0.011138
v 0.128334 0.448795 -0.012363
v 0.128068 0.453825 0.001431
v 0.130823 0.464110 -0.013015
v 0.131004 0.467842 -0.013174
v 0.133371 0.474467 -0.009703
v 0.132680 0.482548 -0.002539
v 0.132157 0.477426 0.000426
v 0.131008 0.472042 0.001661
v 0.129644 0.467205 0.000862
v 0.129486 0.463940 0.001001
v 0.128691 0.457192 0.001288
v 0.124523 0.430752 -0.004087
v 0.124406 0.431650 -0.000372
v 0.126012 0.434703 -0.008010
v 0.126966 0.440391 0.002003
v 0.126957 0.439840 -0.010976
v 0.127323 0.445198 -0.012210
v 0.127299 0.449989 -0.011407
v 0.127308 0.450540 0.001571
v 0.127334 0.445835 0.002777
v 0.128059 0.453274 -0.011547
v 0.128682 0.456641 -0.011691
v 0.129157 0.460032 -0.011835
v 0.129477 0.463389 -0.011978
v 0.129635 0.466654 -0.012117
v 0.130997 0.471405 -0.013325
v 0.132367 0.473123 -0.012393
v 0.133135 0.478523 -0.009876
v 0.133025 0.483052 -0.006314
v 0.131732 0.480854 0.000281
v 0.130813 0.475376 0.001520
v 0.129638 0.470323 0.000730
v 0.128497 0.463264 -0.001718
v 0.128211 0.460258 -0.001590
v 0.127786 0.457222 -0.001460
v 0.122792 0.427760 -0.003959
v 0.124401 0.431332 -0.007865
v 0.125570 0.436902 0.002152
v 0.124081 0.433784 0.002285
v 0.125561 0.436351 -0.010827
v 0.126188 0.441820 -0.012065
v 0.126414 0.446841 -0.011273
v 0.126423 0.447392 0.001706
v 0.127228 0.454207 -0.001332
v 0.127781 0.456904 -0.008954
v 0.128206 0.459940 -0.009083
v 0.128492 0.462946 -0.009211
v 0.129629 0.469772 -0.012249
v 0.130803 0.474739 -0.013467
v 0.132148 0.476874 -0.012552
v 0.132675 0.482230 -0.010033
v 0.132003 0.485844 -0.002679
v 0.131106 0.483902 0.000152
v 0.130435 0.478423 0.001391
v 0.129468 0.473241 0.000606
v 0.128634 0.468980 -0.001960
v 0.128639 0.466188 -0.001842
v 0.128134 0.462900 -0.005455
v 0.127860 0.460023 -0.005333
v 0.122721 0.428738 -0.000247
v 0.122716 0.428419 -0.007740
v 0.124072 0.433233 -0.010693
v 0.122522 0.431091 0.002401
v 0.124958 0.439355 0.003054
v 0.126198 0.442456 0.002921
v 0.124948 0.438719 -0.011933
v 0.125421 0.443885 -0.011147
v 0.125750 0.448129 -0.008580
v 0.126542 0.450947 -0.008700
v 0.127223 0.453889 -0.008825
v 0.125430 0.444436 0.001832
v 0.126547 0.451265 -0.001207
v 0.125755 0.448447 -0.001086
v 0.127453 0.457117 -0.005209
v 0.126918 0.454231 -0.005086
v 0.128634 0.465870 -0.009335
v 0.128628 0.468662 -0.009454
v 0.131723 0.480303 -0.012698
v 0.131998 0.485526 -0.010172
v 0.132330 0.486438 -0.006458
v 0.129879 0.481133 0.001276
v 0.128481 0.471592 -0.002071
v 0.128264 0.468372 -0.005688
v 0.128269 0.465699 -0.005574
v 0.121013 0.425290 -0.003853
v 0.120990 0.426334 -0.000144
v 0.122513 0.430540 -0.010578
v 0.120921 0.428868 0.002496
v 0.123634 0.436584 0.003172
v 0.124336 0.441171 -0.011031
v 0.124861 0.445482 -0.008467
v 0.125509 0.448717 -0.004851
v 0.126267 0.451415 -0.004966
v 0.129459 0.472689 -0.012373
v 0.130425 0.477787 -0.013596
v 0.131097 0.483351 -0.012827
v 0.131117 0.488353 -0.010292
v 0.131425 0.489344 -0.006581
v 0.131123 0.488672 -0.002798
v 0.130292 0.486517 0.000041
v 0.129155 0.483457 0.001178
v 0.128650 0.478278 0.000392
v 0.129137 0.475907 0.000493
v 0.128185 0.473980 -0.002172
v 0.128119 0.470873 -0.005794
v 0.119217 0.423385 -0.003771
v 0.120984 0.426016 -0.007637
v 0.123624 0.435947 -0.011814
v 0.120825 0.432214 0.003360
v 0.122248 0.434190 0.003275
v 0.123186 0.439298 0.002052
v 0.124345 0.441723 0.001948
v 0.123177 0.438746 -0.010927
v 0.123889 0.443052 -0.008363
v 0.124657 0.446183 -0.004743
v 0.124866 0.445800 -0.000973
v 0.128476 0.471274 -0.009564
v 0.129869 0.480496 -0.013710
v 0.130573 0.485033 -0.012898
v 0.131024 0.485927 -0.011666
v 0.131085 0.486732 -0.011159
v 0.130840 0.487559 -0.011171
v 0.130325 0.491718 -0.006681
v 0.128017 0.480312 0.000306
v 0.127750 0.476103 -0.002261
v 0.127835 0.473158 -0.005891
v 0.119242 0.424480 -0.000064
v 0.119237 0.424162 -0.007557
v 0.119305 0.427154 0.002570
v 0.120912 0.428317 -0.010482
v 0.122238 0.433553 -0.011711
v 0.123894 0.443370 -0.000869
v 0.122724 0.437963 -0.010893
v 0.122089 0.435240 -0.011235
v 0.122412 0.435643 -0.011296
v 0.122609 0.436454 -0.011199
v 0.123727 0.443857 -0.004643
v 0.127877 0.473220 -0.006355
v 0.128345 0.472127 -0.009366
v 0.128344 0.472339 -0.009610
v 0.128561 0.474343 -0.010800
v 0.129128 0.475356 -0.012486
v 0.129137 0.478845 -0.013040
v 0.128801 0.476948 -0.012553
v 0.129582 0.481416 -0.013749
v 0.129817 0.482261 -0.013549
v 0.130845 0.479173 -0.005036
v 0.130137 0.489938 -0.010708
v 0.131318 0.485954 -0.001945
v 0.129134 0.493332 -0.006516
v 0.129099 0.493451 -0.006753
v 0.129724 0.491335 -0.009863
v 0.129944 0.490314 -0.010749
v 0.130047 0.490664 -0.010389
v 0.130052 0.490982 -0.002896
v 0.129302 0.488654 -0.000049
v 0.128275 0.485356 0.001098
v 0.127434 0.481571 0.000253
v 0.127606 0.483155 0.000537
v 0.127738 0.479514 -0.000577
v 0.127799 0.478808 -0.000825
v 0.127786 0.478070 -0.001216
v 0.127750 0.476105 -0.002259
v 0.127750 0.476100 -0.002262
v 0.127822 0.475395 -0.002759
v 0.127793 0.473362 -0.005899
v 0.117436 0.422078 -0.003714
v 0.117504 0.422890 -0.007502
v 0.117702 0.425978 0.002621
v 0.117509 0.423209 -0.000009
v 0.119296 0.426603 -0.010409
v 0.120815 0.431577 -0.011627
v 0.120728 0.435474 0.002216
v 0.119389 0.430690 0.003426
v 0.121973 0.437203 0.002141
v 0.122856 0.441199 -0.000777
v 0.122687 0.438836 -0.009976
v 0.121514 0.434661 -0.011147
v 0.121830 0.434907 -0.011214
v 0.122851 0.440881 -0.008270
v 0.122734 0.441779 -0.004554
v 0.128036 0.489991 -0.000013
v 0.127701 0.490657 -0.000133
v 0.127209 0.492932 -0.001927
v 0.127078 0.494032 -0.003023
v 0.127469 0.494105 -0.003943
v 0.129030 0.493458 -0.006453
v 0.128811 0.492737 -0.002969
v 0.129521 0.491408 -0.010420
v 0.128154 0.490276 -0.000117
v 0.128037 0.489824 0.000033
v 0.128203 0.486304 0.000878
v 0.127865 0.485936 0.001073
v 0.127652 0.480096 -0.000342
v 0.117693 0.425427 -0.010358
v 0.117964 0.429644 0.003471
v 0.115819 0.422540 0.000021
v 0.116140 0.425360 0.002649
v 0.119379 0.430054 -0.011561
v 0.121771 0.439323 -0.000696
v 0.122617 0.440476 -0.008252
v 0.120744 0.434065 -0.010984
v 0.121695 0.439983 -0.004477
v 0.122343 0.440611 -0.006185
v 0.121696 0.439971 -0.004524
v 0.127420 0.493906 -0.003018
v 0.115700 0.421392 -0.003684
v 0.116131 0.424809 -0.010330
v 0.117954 0.429008 -0.011516
v 0.116575 0.429095 0.003495
v 0.114202 0.422487 0.000024
v 0.119688 0.433254 -0.010859
v 0.119450 0.433071 -0.010831
v 0.120656 0.437775 -0.000630
v 0.119472 0.434141 0.002273
v 0.118225 0.433226 0.002313
v 0.121688 0.439967 -0.004501
v 0.115814 0.422222 -0.007472
v 0.118422 0.432211 -0.010824
v 0.118163 0.431939 -0.010836
v 0.114644 0.425310 0.002652
v 0.115246 0.429051 0.003498
v 0.117009 0.432745 0.002334
v 0.118682 0.432484 -0.010812
v 0.120641 0.438150 -0.002583
v 0.121680 0.439962 -0.004477
v 0.119526 0.436396 -0.000362
v 0.119687 0.436747 -0.000585
v 0.114038 0.421337 -0.003680
v 0.114635 0.424759 -0.010327
v 0.116565 0.428459 -0.011491
v 0.117763 0.431517 -0.010892
v 0.113241 0.425830 0.002631
v 0.119410 0.436162 -0.000180
v 0.118356 0.434977 0.000342
v 0.117342 0.433940 0.001096
v 0.117130 0.433733 0.001243
v 0.112685 0.423049 0.000001
v 0.114197 0.422168 -0.007469
v 0.115235 0.428415 -0.011488
v 0.116804 0.430508 -0.011027
v 0.113998 0.429513 0.003479
v 0.115819 0.432543 0.002389
v 0.115969 0.432711 0.002336
v 0.112479 0.421914 -0.003704
v 0.113616 0.425137 -0.010342
v 0.112686 0.422728 -0.007492
v 0.115127 0.428455 -0.011490
v 0.114341 0.426630 -0.010863
v 0.114370 0.426690 -0.010884
v 0.116272 0.429947 -0.011149
v 0.115270 0.428627 -0.011440
v 0.115461 0.428871 -0.011387
v 0.115755 0.429401 -0.011269
v 0.112578 0.426386 0.002607
v 0.112902 0.428118 0.003000
v 0.112729 0.426766 0.002709
v 0.114284 0.430872 0.003042
v 0.112310 0.425029 0.001326
v 0.112028 0.423600 -0.000022
v 0.112187 0.422847 -0.001769
v 0.112140 0.422572 -0.002659
v 0.112641 0.422576 -0.006772
v 0.112684 0.422607 -0.006973
v 0.115218 0.428564 -0.011458
v 0.113442 0.429980 0.003460
v 0.113072 0.429443 0.003285
v 0.112085 0.422245 -0.003717
v 0.117352 0.431182 -0.005760
vt 0.000000 0.000000
vt 0.639033 0.542803
vt 0.636961 0.546271
vt 0.638462 0.549071
vt 0.635633 0.540079
vt 0.639054 0.542712
vt 0.635215 0.551038
vt 0.630586 0.544871
vt 0.634435 0.542724
vt 0.641168 0.550214
vt 0.631694 0.549630
vt 0.869446 0.458862
vt 0.874318 0.462513
vt 0.876881 0.462336
vt 0.876879 0.462356
vt 0.874386 0.470816
vt 0.865728 0.465807
vt 0.873880 0.473419
vt 0.864965 0.469043
vt 0.868203 0.472954
vt 0.867945 0.477093
vt 0.867953 0.477084
vt 0.870393 0.481315
vn 0.986500 -0.134300 0.094000
vn 0.979500 -0.177200 0.095900
vn 0.986300 -0.141800 -0.083700
vn 0.991500 -0.090400 0.093500
vn 0.939800 -0.118100 0.320800
vn 0.970400 -0.220300 0.099100
vn 0.979400 -0.184700 -0.081900
vn 0.933100 -0.159000 0.322500
vn 0.939300 -0.144900 -0.310900
vn 0.991400 -0.098000 -0.086900
vn 0.994600 -0.044100 0.094400
vn 0.943200 -0.076000 0.323400
vn 0.958700 -0.264900 0.103800
vn 0.970300 -0.228000 -0.081400
vn 0.923100 -0.199600 0.328700
vn 0.932700 -0.185800 -0.309200
vn 0.942800 -0.103200 -0.317100
vn 0.994400 -0.052000 -0.091700
vn 0.995300 0.006000 0.096700
vn 0.943300 -0.031600 0.330500
vn 0.621100 -0.053800 0.781900
vn 0.943500 -0.312400 0.110300
vn 0.958500 -0.272800 -0.082300
vn 0.909200 -0.241000 0.339400
vn 0.922700 -0.226800 -0.311800
vn 0.605400 -0.106500 0.788800
vn 0.616700 -0.080800 0.783000
vn 0.620000 -0.119900 -0.775400
vn 0.617500 -0.092000 -0.781200
vn 0.942800 -0.059600 -0.328000
vn 0.995200 -0.002200 -0.098300
vn 0.993000 0.062100 0.100800
vn 0.939300 0.016400 0.342600
vn 0.608800 0.004300 0.793300
vn 0.618500 -0.025500 0.785300
vn 0.923600 -0.364300 0.119000
vn 0.943400 -0.320700 -0.084700
vn 0.890500 -0.284100 0.355400
vn 0.908800 -0.268900 -0.319000
vn 0.604300 -0.173000 -0.777800
vn 0.586800 -0.130800 0.799100
vn 0.615600 -0.146900 -0.774200
vn 0.607700 -0.063100 -0.791700
vn 0.938900 -0.012800 -0.344100
vn 0.992800 0.053300 -0.107100
vn 0.986100 0.127000 0.107100
vn 0.930200 0.069500 0.360500
vn 0.591300 0.035400 0.805700
vn -0.607700 0.063100 0.791700
vn -0.617400 0.092000 0.781200
vn -0.620000 0.119900 0.775400
vn 0.896700 -0.422900 0.130500
vn 0.923500 -0.373200 -0.088900
vn 0.865300 -0.329900 0.377500
vn 0.890000 -0.313200 -0.331300
vn 0.585700 -0.198100 -0.785900
vn -0.605400 0.106500 -0.788800
vn -0.615600 0.146900 0.774200
vn -0.604300 0.173000 0.777800
vn -0.616700 0.080800 -0.783000
vn -0.621100 0.053800 -0.781900
vn -0.618500 0.025500 -0.785300
vn -0.608800 -0.004200 -0.793300
vn 0.590200 -0.033100 -0.806600
vn 0.913700 0.129800 0.385100
vn 0.565400 0.067800 0.822000
vn -0.590200 0.033100 0.806600
vn -0.942800 0.103200 0.317100
vn -0.939300 0.144900 0.310900
vn 0.859000 -0.490900 0.145700
vn 0.896600 -0.432500 -0.095400
vn 0.830900 -0.379600 0.406800
vn 0.864800 -0.360800 -0.349300
vn 0.560600 -0.153600 0.813700
vn 0.559500 -0.222100 -0.798500
vn -0.586800 0.130800 -0.799100
vn -0.585700 0.198100 0.785900
vn -0.922700 0.226800 0.311800
vn -0.932700 0.185800 0.309200
vn -0.939800 0.118100 -0.320800
vn -0.943300 0.031600 -0.330500
vn -0.591300 -0.035400 -0.805700
vn 0.564300 -0.002200 -0.825600
vn 0.929700 0.038600 -0.366300
vn 0.986000 0.117400 -0.118800
vn 0.530200 0.101500 0.841800
vn -0.564300 0.002100 0.825600
vn -0.938800 0.012800 0.344100
vn 0.858800 -0.501500 -0.104800
vn 0.830400 -0.412800 -0.374300
vn 0.783300 -0.434200 0.444800
vn 0.526000 -0.174800 0.832300
vn 0.524800 -0.244800 -0.815200
vn -0.560600 0.153600 -0.813700
vn -0.909200 0.241000 -0.339400
vn -0.923100 0.199600 -0.328700
vn -0.559500 0.222100 0.798500
vn -0.908800 0.268900 0.319000
vn -0.979400 0.184700 0.081900
vn -0.933100 0.159000 -0.322600
vn -0.986500 0.134300 -0.094000
vn -0.943200 0.076000 -0.323400
vn -0.939300 -0.016400 -0.342600
vn 0.913200 0.096600 -0.395900
vn 0.971800 0.193700 -0.134400
vn 0.972000 0.204400 0.116100
vn 0.886300 0.199600 0.417800
vn 0.484600 0.136000 0.864100
vn -0.929700 -0.038600 0.366300
vn -0.995200 0.002300 0.098300
vn -0.942800 0.059600 0.328000
vn -0.991400 0.098000 0.086900
vn -0.986300 0.141800 0.083700
vn 0.803600 -0.571600 0.165900
vn 0.782700 -0.470400 -0.407500
vn 0.715800 -0.494400 0.493200
vn 0.482200 -0.193800 0.854400
vn -0.526000 0.174800 -0.832300
vn -0.890500 0.284100 -0.355400
vn -0.958700 0.264900 -0.103800
vn -0.970400 0.220300 -0.099100
vn -0.958500 0.272800 0.082300
vn -0.979500 0.177200 -0.095900
vn -0.995300 -0.006000 -0.096700
vn -0.565400 -0.067800 -0.822000
vn 0.529000 0.029700 -0.848100
vn 0.885800 0.163400 -0.434400
vn 0.945000 0.287800 -0.155100
vn 0.842000 0.281700 0.460100
vn -0.483400 -0.062200 0.873200
vn -0.529000 -0.029700 0.848100
vn -0.913200 -0.096600 0.395900
vn -0.992800 -0.053300 0.107100
vn -0.994400 0.052000 0.091700
vn -0.991500 0.090400 -0.093500
vn 0.718200 -0.668600 0.192700
vn 0.803400 -0.583700 -0.118000
vn 0.427100 -0.284000 -0.858500
vn 0.481000 -0.265600 -0.835500
vn 0.428300 -0.210200 0.878900
vn -0.524900 0.244800 0.815200
vn -0.482200 0.193800 -0.854400
vn -0.865300 0.329900 -0.377500
vn -0.943500 0.312400 -0.110300
vn -0.970300 0.228000 0.081400
vn -0.890000 0.313200 0.331300
vn -0.943400 0.320700 0.084700
vn -0.994600 0.044100 -0.094400
vn -0.993000 -0.062100 -0.100800
vn -0.930200 -0.069500 -0.360500
vn 0.841300 0.241700 -0.483500
vn 0.895100 0.406800 -0.182700
vn 0.945200 0.299900 0.128800
vn 0.427700 0.170700 0.887600
vn -0.426500 -0.094900 0.899500
vn -0.885800 -0.163400 0.434400
vn -0.986000 -0.117400 0.118800
vn 0.618200 -0.558900 0.552600
vn 0.717900 -0.682600 -0.136300
vn 0.715200 -0.534400 -0.450500
vn 0.363700 -0.223100 0.904400
vn 0.288200 -0.231600 0.929100
vn -0.427100 0.284000 0.858500
vn -0.481000 0.265600 0.835500
vn -0.864800 0.360800 0.349300
vn -0.428300 0.210200 -0.878900
vn -0.830900 0.379600 -0.406800
vn -0.923600 0.364300 -0.119000
vn -0.923500 0.373200 0.088900
vn -0.986100 -0.127000 -0.107100
vn -0.913700 -0.129700 -0.385100
vn -0.530200 -0.101500 -0.841800
vn 0.483400 0.062200 -0.873200
vn -0.484600 -0.136000 -0.864100
vn 0.426500 0.094900 -0.899500
vn -0.957000 0.215700 0.193900
vn -0.998000 0.055900 0.030000
vn -0.958900 -0.283600 0.000300
vn 0.769900 0.333600 -0.544000
vn 0.895300 0.420800 0.146300
vn 0.770600 0.378500 0.512700
vn 0.359200 0.204700 0.910500
vn -0.357900 -0.126800 0.925100
vn -0.841300 -0.241700 0.483500
vn -0.971800 -0.193700 0.134400
vn 0.580900 -0.781700 0.227100
vn 0.476600 -0.622600 0.620600
vn 0.617500 -0.603800 -0.504100
vn 0.362500 -0.299000 -0.882700
vn -0.830400 0.412800 0.374300
vn -0.783300 0.434300 -0.444800
vn -0.363700 0.223100 -0.904400
vn -0.896700 0.422900 -0.130500
vn -0.972000 -0.204400 -0.116100
vn -0.824800 0.478100 -0.301800
vn -0.956000 0.219300 0.195000
vn -0.886300 -0.199600 -0.417800
vn -0.427700 -0.170800 -0.887600
vn -0.798800 -0.469500 -0.376100
vn 0.801200 0.573900 0.169300
vn 0.800900 0.557500 -0.218500
vn 0.656500 0.438700 -0.613600
vn 0.279200 0.236600 0.930600
vn -0.645100 0.202200 -0.736800
vn -0.769900 -0.333700 0.544000
vn -0.277900 -0.156800 0.947700
vn -0.841300 -0.241600 0.483500
vn -0.770000 -0.333600 0.543900
vn -0.784800 0.301600 -0.541500
vn 0.580600 -0.798200 -0.160700
vn 0.475800 -0.673000 -0.566300
vn 0.277700 -0.671600 0.686900
vn 0.287000 -0.309600 -0.906500
vn -0.362500 0.299000 0.882700
vn 0.202600 -0.234800 0.950700
vn -0.782700 0.470400 0.407500
vn -0.783300 0.434200 -0.444800
vn -0.859000 0.490900 -0.145700
vn -0.896600 0.432500 0.095400
vn -0.870600 -0.416000 0.262500
vn -0.670000 -0.203000 -0.714000
vn 0.485000 0.603800 0.632500
vn 0.248600 0.698400 0.671200
vn 0.336400 0.916800 0.215300
vn 0.657300 0.489100 0.573300
vn 0.189300 0.264800 0.945500
vn 0.358600 -0.894800 0.265900
vn 0.201300 -0.314600 -0.927600
vn 0.108600 -0.231800 0.966700
vn -0.288200 0.231600 -0.929100
vn -0.715200 0.534400 0.450500
vn -0.287000 0.309600 0.906500
vn -0.858800 0.501500 0.104800
vn -0.288300 0.231600 -0.929100
vn -0.802400 0.573200 -0.166400
vn 0.626700 0.754300 0.195700
vn 0.358300 -0.914200 -0.189600
vn 0.276800 -0.727500 -0.627800
vn -0.202600 0.234800 -0.950700
vn 0.009400 -0.222100 0.975000
vn 0.024200 -0.683000 0.730000
vn -0.803400 0.583700 0.118000
vn -0.617500 0.603800 0.504100
vn -0.201300 0.314600 0.927600
vn -0.107300 0.312900 0.943700
vn -0.803700 0.572000 -0.164200
vn 0.032200 -0.954900 0.295000
vn 0.107300 -0.312900 -0.943700
vn -0.108600 0.231800 -0.966700
vn -0.718000 0.682600 0.136300
vn -0.475800 0.673000 0.566200
vn -0.276800 0.727500 0.627800
vn 0.031900 -0.976500 -0.213000
vn 0.023200 -0.742500 -0.669500
vn 0.008100 -0.304000 -0.952600
vn -0.090900 -0.205800 0.974400
vn -0.008100 0.304000 0.952600
vn -0.247700 -0.638900 0.728300
vn -0.023200 0.742500 0.669500
vn -0.336100 -0.895200 0.292800
vn -0.248700 -0.698300 -0.671200
vn -0.092300 -0.287700 -0.953300
vn -0.009400 0.222100 -0.975000
vn -0.188000 -0.183700 0.964800
vn 0.092300 0.287700 0.953300
vn -0.484100 -0.548000 0.682200
vn -0.626400 -0.735000 0.259800
vn -0.336500 -0.916700 -0.215300
vn 0.091100 0.205900 -0.974300
vn 0.090900 0.205900 -0.974300
vn -0.484100 -0.548000 0.682100
vn -0.626400 -0.734900 0.259800
vn -0.626700 -0.754300 -0.195700
vn -0.867100 0.487000 -0.105200
vn -0.879600 0.464000 0.105000
vn -0.871600 0.416300 -0.258700
vn -0.742000 0.479000 0.469000
vn -0.724200 0.689500 -0.012900
vn -0.900100 0.198600 -0.387800
vn -0.605500 0.794500 0.045400
vn -0.759800 0.602800 -0.243600
vn -0.775300 0.585600 -0.236700
vn -0.929700 0.257900 -0.263100
vn -0.985300 0.102300 -0.137100
usemtl None
s off
f 1/1/1 2/1/1 3/1/1 4/1/1
f 5/1/2 1/1/2 4/1/2 6/1/2
f 1/1/3 7/1/3 8/1/3 2/1/3
f 2/1/4 9/1/4 10/1/4 3/1/4
f 3/1/5 11/1/5 15/1/5 4/1/5
f 12/1/6 5/1/6 6/1/6 13/1/6
f 14/1/7 7/1/7 1/1/7 5/1/7
f 4/1/8 15/1/8 24/1/8 6/1/8
f 7/1/9 16/1/9 27/1/9 8/1/9
f 8/1/10 17/1/10 9/1/10 2/1/10
f 9/1/11 18/1/11 19/1/11 10/1/11
f 10/1/12 20/1/12 11/1/12 3/1/12
f 21/1/13 12/1/13 13/1/13 22/1/13
f 23/1/14 14/1/14 5/1/14 12/1/14
f 6/1/15 24/1/15 25/1/15 13/1/15
f 14/1/16 26/1/16 16/1/16 7/1/16
f 27/1/17 28/1/17 17/1/17 8/1/17
f 9/1/18 17/1/18 46/1/18 18/1/18
f 18/1/19 29/1/19 30/1/19 19/1/19
f 10/1/20 19/1/20 31/1/20 20/1/20
f 15/1/21 11/1/21 32/1/21 33/1/21
f 35/1/22 21/1/22 22/1/22 36/1/22
f 37/1/23 23/1/23 12/1/23 21/1/23
f 22/1/24 13/1/24 25/1/24 38/1/24
f 39/1/25 26/1/25 14/1/25 23/1/25
f 24/1/26 40/1/26 41/1/26 25/1/26
f 15/1/27 33/1/27 40/1/27 24/1/27
f 16/1/28 43/1/28 44/1/28 27/1/28
f 27/1/29 44/1/29 58/1/29 28/1/29
f 28/1/30 45/1/30 46/1/30 17/1/30
f 18/1/31 46/1/31 60/1/31 29/1/31
f 29/1/32 47/1/32 48/1/32 30/1/32
f 19/1/33 30/1/33 49/1/33 31/1/33
f 20/1/34 31/1/34 50/1/34 34/1/34
f 32/1/35 11/1/35 20/1/35 34/1/35
f 52/1/36 35/1/36 36/1/36 53/1/36
f 54/1/37 37/1/37 21/1/37 35/1/37
f 22/1/38 38/1/38 70/1/38 36/1/38
f 55/1/39 39/1/39 23/1/39 37/1/39
f 56/1/40 42/1/40 26/1/40 39/1/40
f 25/1/41 41/1/41 75/1/41 38/1/41
f 43/1/42 16/1/42 26/1/42 42/1/42
f 58/1/43 59/1/43 45/1/43 28/1/43
f 46/1/44 45/1/44 82/1/44 60/1/44
f 29/1/45 60/1/45 83/1/45 47/1/45
f 48/1/46 47/1/46 84/1/46 61/1/46
f 30/1/47 48/1/47 62/1/47 49/1/47
f 49/1/48 63/1/48 50/1/48 31/1/48
f 50/1/49 64/1/49 65/1/49 34/1/49
f 32/1/50 34/1/50 65/1/50 51/1/50
f 66/1/51 33/1/51 32/1/51 51/1/51
f 67/1/52 52/1/52 53/1/52 68/1/52
f 69/1/53 54/1/53 35/1/53 52/1/53
f 36/1/54 70/1/54 93/1/54 53/1/54
f 54/1/55 71/1/55 55/1/55 37/1/55
f 72/1/56 56/1/56 39/1/56 55/1/56
f 56/1/57 73/1/57 76/1/57 42/1/57
f 33/1/58 66/1/58 57/1/58 40/1/58
f 74/1/59 41/1/59 40/1/59 57/1/59
f 42/1/60 76/1/60 77/1/60 43/1/60
f 77/1/61 78/1/61 44/1/61 43/1/61
f 44/1/62 78/1/62 79/1/62 58/1/62
f 79/1/63 80/1/63 59/1/63 58/1/63
f 45/1/64 59/1/64 81/1/64 82/1/64
f 48/1/65 61/1/65 85/1/65 62/1/65
f 62/1/66 86/1/66 63/1/66 49/1/66
f 50/1/67 63/1/67 87/1/67 64/1/67
f 51/1/68 65/1/68 88/1/68 89/1/68
f 66/1/69 51/1/69 89/1/69 90/1/69
f 67/1/70 68/1/70 115/1/70 91/1/70
f 92/1/71 69/1/71 52/1/71 67/1/71
f 68/1/72 53/1/72 93/1/72 94/1/72
f 69/1/73 95/1/73 71/1/73 54/1/73
f 38/1/74 75/1/74 120/1/74 70/1/74
f 71/1/75 96/1/75 72/1/75 55/1/75
f 72/1/76 97/1/76 73/1/76 56/1/76
f 75/1/77 41/1/77 74/1/77 98/1/77
f 57/1/78 99/1/78 127/1/78 74/1/78
f 57/1/79 66/1/79 90/1/79 99/1/79
f 100/1/80 101/1/80 78/1/80 77/1/80
f 79/1/81 102/1/81 131/1/81 80/1/81
f 80/1/82 103/1/82 81/1/82 59/1/82
f 82/1/83 81/1/83 104/1/83 105/1/83
f 60/1/84 82/1/84 105/1/84 83/1/84
f 83/1/85 106/1/85 84/1/85 47/1/85
f 62/1/86 85/1/86 109/1/86 86/1/86
f 86/1/87 110/1/87 87/1/87 63/1/87
f 87/1/88 111/1/88 112/1/88 64/1/88
f 91/1/89 116/1/89 92/1/89 67/1/89
f 117/1/90 95/1/90 69/1/90 92/1/90
f 115/1/91 68/1/91 94/1/91 118/1/91
f 93/1/92 70/1/92 120/1/92 119/1/92
f 95/1/93 121/1/93 96/1/93 71/1/93
f 122/1/94 97/1/94 72/1/94 96/1/94
f 123/1/95 124/1/95 73/1/95 97/1/95
f 124/1/96 125/1/96 76/1/96 73/1/96
f 120/1/97 75/1/97 98/1/97 126/1/97
f 98/1/98 74/1/98 127/1/98 128/1/98
f 99/1/99 90/1/99 129/1/99 130/1/99
f 76/1/100 125/1/100 100/1/100 77/1/100
f 129/1/101 114/1/101 101/1/101 100/1/101
f 78/1/102 101/1/102 102/1/102 79/1/102
f 131/1/103 132/1/103 103/1/103 80/1/103
f 83/1/104 105/1/104 133/1/104 106/1/104
f 106/1/105 134/1/105 135/1/105 84/1/105
f 135/1/106 107/1/106 61/1/106 84/1/106
f 107/1/107 108/1/107 85/1/107 61/1/107
f 85/1/108 108/1/108 136/1/108 109/1/108
f 110/1/109 137/1/109 111/1/109 87/1/109
f 112/1/110 111/1/110 138/1/110 139/1/110
f 112/1/111 88/1/111 65/1/111 64/1/111
f 114/1/112 89/1/112 88/1/112 113/1/112
f 129/1/113 90/1/113 89/1/113 114/1/113
f 140/1/114 91/1/114 115/1/114 141/1/114
f 116/1/115 142/1/115 117/1/115 92/1/115
f 118/1/116 143/1/116 141/1/116 115/1/116
f 144/1/117 94/1/117 93/1/117 119/1/117
f 122/1/118 96/1/118 121/1/118 145/1/118
f 146/1/119 123/1/119 97/1/119 122/1/119
f 123/1/120 147/1/120 148/1/120 124/1/120
f 124/1/121 148/1/121 130/1/121 125/1/121
f 127/1/122 148/1/122 147/1/122 128/1/122
f 129/1/123 100/1/123 125/1/123 130/1/123
f 139/1/124 138/1/124 132/1/124 131/1/124
f 149/1/125 104/1/125 81/1/125 103/1/125
f 150/1/126 133/1/126 105/1/126 104/1/126
f 134/1/127 106/1/127 133/1/127 151/1/127
f 134/1/128 152/1/128 153/1/128 135/1/128
f 108/1/129 107/1/129 154/1/129 155/1/129
f 109/1/130 136/1/130 157/1/130 158/1/130
f 158/1/131 110/1/131 86/1/131 109/1/131
f 137/1/132 110/1/132 158/1/132 159/1/132
f 111/1/133 137/1/133 160/1/133 138/1/133
f 139/1/134 113/1/134 88/1/134 112/1/134
f 113/1/135 102/1/135 101/1/135 114/1/135
f 140/1/136 141/1/136 182/1/136 161/1/136
f 162/1/137 116/1/137 91/1/137 140/1/137
f 117/1/138 142/1/138 186/1/138 163/1/138
f 163/1/139 121/1/139 95/1/139 117/1/139
f 165/1/140 118/1/140 94/1/140 144/1/140
f 167/1/141 119/1/141 120/1/141 126/1/141
f 168/1/142 145/1/142 121/1/142 163/1/142
f 169/1/143 146/1/143 122/1/143 145/1/143
f 146/1/144 170/1/144 147/1/144 123/1/144
f 148/1/145 127/1/145 99/1/145 130/1/145
f 171/1/146 126/1/146 98/1/146 128/1/146
f 171/1/147 128/1/147 147/1/147 170/1/147
f 139/1/148 131/1/148 102/1/148 113/1/148
f 138/1/149 160/1/149 172/1/149 132/1/149
f 172/1/150 149/1/150 103/1/150 132/1/150
f 134/1/151 151/1/151 174/1/151 175/1/151 176/1/151 177/1/151 152/1/151
f 153/1/152 152/1/152 209/1/152 178/1/152
f 153/1/153 154/1/153 107/1/153 135/1/153
f 155/1/154 156/1/154 136/1/154 108/1/154
f 136/1/155 156/1/155 179/1/155 157/1/155
f 158/1/156 157/1/156 218/1/156 180/1/156
f 159/1/157 181/1/157 160/1/157 137/1/157
f 182/1/158 141/1/158 143/1/158 184/1/158
f 162/1/159 140/1/159 161/1/159 183/1/159
f 185/1/160 142/1/160 116/1/160 162/1/160
f 165/1/161 164/1/161 143/1/161 118/1/161
f 143/1/162 164/1/162 229/1/162 184/1/162
f 144/1/163 166/1/163 230/1/163 165/1/163
f 167/1/164 166/1/164 144/1/164 119/1/164
f 167/1/165 126/1/165 171/1/165 187/1/165
f 188/1/166 168/1/166 163/1/166 186/1/166 189/1/166 190/1/166 191/1/166
f 145/1/167 168/1/167 235/1/167 169/1/167
f 169/1/168 192/1/168 170/1/168 146/1/168
f 171/1/169 170/1/169 192/1/169 187/1/169
f 160/1/170 181/1/170 193/1/170 194/1/170 195/1/170 172/1/170
f 149/1/171 172/1/171 195/1/171 196/1/171 197/1/171
f 197/1/172 150/1/172 104/1/172 149/1/172
f 151/1/173 133/1/173 150/1/173 173/1/173
f 198/1/174 173/1/174 150/1/174 197/1/174 199/1/174
f 173/1/175 200/1/175 201/1/175 174/1/175 151/1/175
f 202/2/176 175/2/176 174/2/176 201/2/176
f 175/3/177 202/3/177 204/3/177 176/3/177
f 203/4/178 177/4/178 176/4/178 204/4/178 205/4/178 206/4/178 207/4/178
f 208/1/179 209/1/179 152/1/179 177/1/179 203/1/179
f 153/1/180 178/1/180 210/1/180 154/1/180
f 155/1/181 154/1/181 210/1/181 211/1/181
f 155/1/182 211/1/182 212/1/182 156/1/182
f 213/1/183 179/1/183 156/1/183 212/1/183 214/1/183
f 157/1/184 179/1/184 215/1/184 216/1/184 217/1/184
f 180/1/156 219/1/156 159/1/156 158/1/156
f 159/1/185 219/1/185 220/1/185 221/1/185 181/1/185
f 161/1/186 182/1/186 225/1/186 222/1/186
f 182/1/187 184/1/187 224/1/187 225/1/187
f 183/1/188 226/1/188 185/1/188 162/1/188
f 185/1/189 227/1/189 186/1/189 142/1/189
f 187/1/190 231/1/190 166/1/190 167/1/190
f 232/1/191 168/1/191 188/1/191
f 227/1/192 233/1/192 234/1/192 189/1/192 186/1/192
f 236/1/193 192/1/193 169/1/193 235/1/193
f 193/1/194 181/1/194 221/1/194
f 194/5/195 193/5/195 221/5/195 220/5/195 202/5/195
f 202/2/196 201/2/196 200/2/196 198/2/196 199/2/196 196/2/196 195/6/196 194/2/196
f 199/1/197 197/1/197 196/1/197
f 200/1/198 173/1/198 198/1/198
f 237/7/199 238/7/199 239/7/199 240/7/199 241/7/199 242/7/199 205/7/199 204/7/199
f 210/1/200 178/1/200 206/1/200 205/1/200 242/1/200 243/1/200
f 209/1/201 244/1/201 207/1/201 206/1/201 178/1/201
f 244/1/202 209/1/202 208/1/202
f 211/1/203 245/1/203 246/1/203 247/1/203 248/1/203 212/1/203
f 216/8/204 215/8/204 249/8/204 213/8/204 214/8/204 248/8/204 247/8/204 204/8/204
f 249/1/205 179/1/205 213/1/205
f 214/1/206 212/1/206 248/1/206
f 218/1/207 157/1/207 217/1/207
f 215/1/208 179/1/208 249/1/208
f 202/9/209 220/9/209 219/9/209 180/9/209 218/9/209 217/9/209 216/9/209 204/9/209
f 222/1/210 223/1/210 183/1/210 161/1/210
f 250/1/211 226/1/211 183/1/211 223/1/211
f 252/1/212 225/1/212 224/1/212 253/1/212
f 226/1/213 254/1/213 227/1/213 185/1/213
f 230/1/214 228/1/214 164/1/214 165/1/214
f 229/1/215 251/1/215 224/1/215 184/1/215
f 166/1/216 231/1/216 255/1/216 230/1/216
f 256/1/217 235/1/217 168/1/217 232/1/217
f 233/1/192 227/1/192 257/1/192
f 258/1/218 236/1/218 235/1/218 256/1/218 259/1/218 260/1/218
f 236/1/219 231/1/219 187/1/219 192/1/219
f 244/10/220 208/10/220 203/10/220 207/10/220
f 204/11/221 247/11/221 246/11/221 237/11/221
f 238/1/222 245/1/222 243/1/222 261/1/222 239/1/222
f 239/1/223 261/1/223 240/1/223
f 240/1/224 261/1/224 241/1/224
f 211/1/225 210/1/225 243/1/225 245/1/225
f 246/1/226 245/1/226 238/1/226 237/1/226
f 222/1/227 225/1/227 252/1/227 262/1/227
f 250/1/228 264/1/228 254/1/228 226/1/228
f 253/1/229 224/1/229 251/1/229 265/1/229
f 267/1/230 227/1/230 254/1/230 268/1/230
f 230/1/231 255/1/231 269/1/231 228/1/231
f 270/1/232 229/1/232 164/1/232 228/1/232
f 231/1/233 236/1/233 258/1/233 255/1/233
f 257/1/234 227/1/234 267/1/234
f 272/1/235 258/1/235 260/1/235
f 261/1/236 243/1/236 242/1/236 241/1/236
f 273/1/237 223/1/237 222/1/237 262/1/237
f 273/1/238 263/1/238 250/1/238 223/1/238
f 274/1/239 254/1/239 264/1/239 275/1/239
f 276/1/240 253/1/240 265/1/240 277/1/240
f 276/1/241 266/1/241 252/1/241 253/1/241
f 268/1/239 254/1/239 274/1/239 279/1/239
f 280/1/242 269/1/242 255/1/242 258/1/242 281/1/242
f 282/1/243 270/1/243 228/1/243 269/1/243 283/1/243
f 270/1/244 271/1/244 251/1/244 229/1/244
f 271/1/245 278/1/245 265/1/245 251/1/245
f 281/1/246 258/1/246 272/1/246
f 284/1/247 262/1/247 252/1/247 266/1/247
f 286/1/248 264/1/248 250/1/248 263/1/248
f 275/1/249 264/1/249 286/1/249 287/1/249
f 283/1/250 269/1/250 280/1/250
f 270/1/251 282/1/251 289/1/251 290/1/251 271/1/251
f 271/1/252 290/1/252 291/1/252 292/1/252 278/1/252
f 294/1/253 273/1/253 262/1/253 284/1/253
f 294/1/254 285/1/254 263/1/254 273/1/254
f 286/1/255 263/1/255 285/1/255 295/1/255
f 287/1/249 286/1/249 296/1/249
f 297/1/256 288/1/256 276/1/256 277/1/256
f 298/1/257 277/1/257 265/1/257 278/1/257 299/1/257
f 293/1/258 266/1/258 276/1/258 288/1/258
f 299/1/259 278/1/259 292/1/259
f 300/1/260 284/1/260 266/1/260 293/1/260
f 301/1/261 285/1/261 294/1/261 302/1/261
f 303/1/262 295/1/262 285/1/262 304/1/262 305/1/262
f 306/1/263 286/1/263 295/1/263 307/1/263 308/1/263 309/1/263
f 296/1/263 286/1/263 306/1/263
f 310/1/264 288/1/264 297/1/264 311/1/264 312/1/264
f 313/1/265 297/1/265 277/1/265 298/1/265
f 314/1/266 293/1/266 288/1/266 310/1/266
f 300/1/267 293/1/267 315/1/267 316/1/267 317/1/267
f 302/1/268 294/1/268 284/1/268 300/1/268 318/1/268 319/1/268
f 304/1/262 285/1/262 301/1/262
f 320/1/269 295/1/269 303/1/269
f 307/1/270 295/1/270 320/1/270
f 311/1/264 297/1/264 321/1/264 322/1/264
f 321/1/226 297/1/226 313/1/226
f 315/1/271 293/1/271 314/1/271
f 323/1/272 300/1/272 317/1/272
f 318/1/273 300/1/273 323/1/273
f 319/12/274 318/12/274 323/12/274 317/12/274 316/12/274 324/12/274
f 305/13/275 304/13/275 301/13/275 302/13/275 319/13/275 324/13/275 309/13/275 308/13/275
f 316/12/276 315/12/276 314/12/276 310/12/276 312/12/276 324/12/276
f 308/14/277 307/14/277 320/14/277 303/14/277 305/15/277
f 279/16/278 274/16/278 275/16/278 287/16/278 296/16/278 306/16/278 309/16/278 324/16/278
f 312/17/279 311/17/279 322/17/279 324/17/279
f 324/18/280 234/18/280 233/18/280 257/18/280 267/18/280 268/18/280 279/18/280
f 322/19/281 321/19/281 313/19/281 298/19/281 299/19/281 292/19/281 291/19/281 324/19/281
f 324/20/282 291/20/282 290/20/282 289/20/282 190/20/282 189/20/282 234/20/282
f 289/21/283 282/21/283 283/21/283 280/21/283 281/21/283 272/21/283 260/21/283 259/21/283 191/22/283 190/22/283
f 259/23/284 256/23/284 232/23/284 188/23/284 191/23/284
