# Blender v2.69 (sub 0) OBJ File: 'cylinder.blend'
# www.blender.org
o Cylinder_Cylinder.004
v 0.000000 1.200000 0.000000
v 0.000000 0.200000 -0.200000
v 0.000000 1.200000 -0.200000
v 0.039018 0.200000 -0.196157
v 0.039018 1.200000 -0.196157
v 0.076537 0.200000 -0.184776
v 0.076537 1.200000 -0.184776
v 0.111114 0.200000 -0.166294
v 0.111114 1.200000 -0.166294
v 0.141421 0.200000 -0.141421
v 0.141421 1.200000 -0.141421
v 0.166294 0.200000 -0.111114
v 0.166294 1.200000 -0.111114
v 0.184776 0.200000 -0.076537
v 0.184776 1.200000 -0.076537
v 0.196157 0.200000 -0.039018
v 0.196157 1.200000 -0.039018
v 0.200000 0.200000 -0.000000
v 0.200000 1.200000 -0.000000
v 0.196157 0.200000 0.039018
v 0.196157 1.200000 0.039018
v 0.184776 0.200000 0.076537
v 0.184776 1.200000 0.076537
v 0.166294 0.200000 0.111114
v 0.166294 1.200000 0.111114
v 0.141421 0.200000 0.141421
v 0.141421 1.200000 0.141421
v 0.111114 0.200000 0.166294
v 0.111114 1.200000 0.166294
v 0.076537 0.200000 0.184776
v 0.076537 1.200000 0.184776
v 0.039018 0.200000 0.196157
v 0.039018 1.200000 0.196157
v -0.000000 0.200000 0.200000
v -0.000000 1.200000 0.200000
v -0.039018 0.200000 0.196157
v -0.039018 1.200000 0.196157
v -0.076537 0.200000 0.184776
v -0.076537 1.200000 0.184776
v -0.111114 0.200000 0.166294
v -0.111114 1.200000 0.166294
v -0.141421 0.200000 0.141421
v -0.141421 1.200000 0.141421
v -0.166294 0.200000 0.111114
v -0.166294 1.200000 0.111114
v -0.184776 0.200000 0.076537
v -0.184776 1.200000 0.076537
v -0.196157 0.200000 0.039018
v -0.196157 1.200000 0.039018
v -0.200000 0.200000 -0.000000
v -0.200000 1.200000 -0.000000
v -0.196157 0.200000 -0.039018
v -0.196157 1.200000 -0.039018
v -0.184776 0.200000 -0.076537
v -0.184776 1.200000 -0.076537
v -0.166294 0.200000 -0.111114
v -0.166294 1.200000 -0.111114
v -0.141421 0.200000 -0.141422
v -0.141421 1.200000 -0.141422
v -0.111114 0.200000 -0.166294
v -0.111114 1.200000 -0.166294
v -0.076536 0.200000 -0.184776
v -0.076536 1.200000 -0.184776
v -0.039018 0.200000 -0.196157
v -0.039018 1.200000 -0.196157
s off
f 1 5 3
f 2 3 5 4
f 1 7 5
f 4 5 7 6
f 1 9 7
f 6 7 9 8
f 1 11 9
f 8 9 11 10
f 1 13 11
f 10 11 13 12
f 1 15 13
f 12 13 15 14
f 1 17 15
f 14 15 17 16
f 1 19 17
f 16 17 19 18
f 1 21 19
f 18 19 21 20
f 1 23 21
f 20 21 23 22
f 1 25 23
f 22 23 25 24
f 1 27 25
f 24 25 27 26
f 1 29 27
f 26 27 29 28
f 1 31 29
f 28 29 31 30
f 1 33 31
f 30 31 33 32
f 1 35 33
f 32 33 35 34
f 1 37 35
f 34 35 37 36
f 1 39 37
f 36 37 39 38
f 1 41 39
f 38 39 41 40
f 1 43 41
f 40 41 43 42
f 1 45 43
f 42 43 45 44
f 1 47 45
f 44 45 47 46
f 1 49 47
f 46 47 49 48
f 1 51 49
f 48 49 51 50
f 1 53 51
f 50 51 53 52
f 1 55 53
f 52 53 55 54
f 1 57 55
f 54 55 57 56
f 1 59 57
f 56 57 59 58
f 1 61 59
f 58 59 61 60
f 1 63 61
f 60 61 63 62
f 1 65 63
f 62 63 65 64
f 1 3 65
f 64 65 3 2
