# PIPER geometrical reference model based on a manual segmentation. See the
# documentation for more info.
# Author: CEESAR, SOTON, UCBL-Ifsttar
# Version: 1.0.0
# License: Creative Commons Attribution 4.0 International License.
# (https://creativecommons.org/licenses/by/4.0/)
# 
# This work has received funding from the European Union Seventh Framework
# Program ([FP7/2007-2013]) under grant agreement 605544 [PIPER project]).
# Contributors include Pierre Maillez, Christophe Lecomte (SOTON), Erwan
# Jolivet (CEESAR), Philippe Beillas (UCBL-Ifsttar)
# This work is derived from a CT scan provided by CEESAR under a CCBY-4.0
# License
# 
# wavefront obj file written by the visualization toolkit

mtllib C:/desktop/registration_reference_model/22_REF_LTE635_Assembly_hands_corr/CCTu635_BP115_MetacarpusIndex_R.mtl

v 45.8259 244.692 -948.831
v 44.2673 246.496 -951.421
v 42.8686 244.377 -954.551
v 40.5645 244.056 -959.41
v 39.8716 246.424 -958.068
v 46.6034 243.218 -951.372
v 54.0787 240.412 -932.749
v 52.6056 246.393 -932.561
v 51.2065 240.874 -934.452
v 49.1817 243.938 -936.15
v 50.2719 244.869 -933.388
v 53.2788 242.602 -932.538
v 55.8053 245.929 -933.252
v 56.2392 238.979 -935.089
v 53.1644 239.314 -937.122
v 59.0137 240.855 -935.168
v 57.6863 241.611 -933.673
v 59.6513 245.651 -935.29
v 61.9465 248.419 -939.44
v 57.0807 238.108 -938.779
v 58.8228 239.488 -937.84
v 59.897 240.891 -940.22
v 55.8338 238.58 -940.977
v 49.7254 243.094 -940.519
v 47.9647 246.167 -940.245
v 47.6489 245.358 -944.603
v 53.2317 241.98 -946.125
v 48.1184 243.728 -946.066
v 50.7895 242.278 -945.001
v 53.0732 245.81 -951.984
v 57.1002 239.141 -941.797
v 56.6599 243.242 -946.247
v 59.5283 242.893 -943.495
v 58.9386 246.579 -945.905
v 50.3438 242.876 -950.33
v 52.9856 243.571 -949.995
v 46.0349 243.313 -960.193
v 49.889 248.075 -956.333
v 50.2606 244.366 -955.568
v 48.463 246.531 -959.968
v 45.6894 248.524 -952.377
v 48.4929 250.226 -952.681
v 41.6786 247.666 -956.315
v 39.3975 248.492 -961.58
v 43.232 249.11 -958.044
v 48.5641 248.086 -934.566
v 50.5937 249.474 -931.886
v 53.7456 251.827 -930.779
v 51.274 251.409 -933.926
v 55.193 253.813 -933.348
v 48.5099 249.328 -938.335
v 52.8416 252.99 -937.002
v 53.0801 249.091 -931.742
v 58.5268 250.227 -933.706
v 57.8239 254.318 -932.612
v 58.7137 255.19 -934.571
v 55.6378 254.512 -939.46
v 60.6415 255.062 -934.73
v 61.3748 249.77 -936.738
v 61.3307 252.436 -938.771
v 61.1191 245.788 -942.376
v 60.1309 251.835 -942.275
v 58.6732 254.12 -940.571
v 52.2138 250.906 -946.887
v 55.8741 253.598 -942.385
v 54.6065 250.382 -947.635
v 50.5093 250.94 -943.737
v 47.2313 247.652 -946.725
v 48.5802 249.38 -942.631
v 49.2342 249.99 -949.076
v 50.8417 249.617 -951.607
v 54.3117 248.299 -949.882
v 61.4263 248.954 -943.103
v 57.2176 251.825 -944.653
v 58.5151 249.324 -945.833
v 45.0255 249.903 -959.481
v 39.6381 243.958 -963.951
v 37.8707 246.699 -963.793
v 43.1759 242.898 -960.45
v 46.2099 245.124 -963.503
v 41.3204 242.999 -966.287
v 45.846 247.055 -966.62
v 42.1404 243.621 -969.489
v 44.5135 245.857 -969.181
v 37.2718 243.395 -970.474
v 35.4574 245.03 -971.904
v 35.3298 241.808 -980.648
v 35.2173 242.258 -976.756
v 39.1231 242.646 -971.927
v 41.368 243.333 -975.547
v 37.8884 241.92 -977.105
v 43.659 245.676 -974.334
v 44.0067 243.925 -979.962
v 44.3731 246.47 -979.291
v 33.7886 243.484 -984.627
v 31.9539 245.543 -979.249
v 32.2498 243.306 -982.121
v 31.4591 246.075 -986.029
v 37.0924 243.706 -987.798
v 33.8336 246.083 -988.468
v 41.3905 242.211 -980.466
v 38.8473 241.713 -982.009
v 43.5569 242.122 -983.761
v 45.2672 243.85 -984.16
v 38.9634 242.366 -986.215
v 40.7906 243.594 -988.792
v 43.515 242.796 -987.014
v 43.8047 246.506 -987.802
v 37.6057 246.881 -991.186
v 41.1345 246.454 -989.974
v 34.8863 249.96 -971.304
v 37.2392 248.57 -965.239
v 39.1091 249.85 -965.829
v 47.143 249.436 -958.763
v 45.4966 248.758 -965.803
v 43.1103 250.038 -966.681
v 38.9535 251.441 -971.903
v 35.5292 251.248 -972.433
v 33.1748 248.539 -974.978
v 32.5077 251.604 -976.222
v 32.0486 253.3 -977.97
v 33.9627 254.007 -978.564
v 44.7082 247.808 -971.962
v 44.504 248.719 -974.903
v 43.8671 249.807 -971.3
v 42.1782 251.07 -973.695
v 43.7216 250.505 -977.734
v 37.3284 254.045 -980.928
v 30.5505 250.845 -980.568
v 29.4856 250.579 -984.525
v 30.165 253.141 -983.421
v 32.3138 254.423 -984.692
v 30.4388 252.496 -986.969
v 30.9512 249.272 -987.736
v 34.092 251.751 -991.138
v 34.1485 254.088 -988.168
v 37.408 255.379 -985.408
v 40.0919 255.459 -984.142
v 41.2406 253.56 -980.859
v 42.8262 252.216 -983.993
v 45.0793 246.143 -984.652
v 38.1065 255.239 -987.902
v 41.8438 253.225 -987.482
v 34.6649 248.9 -990.747
v 37.4802 250.255 -991.295
v 40.7569 251.113 -989.662
v 39.2007 254.44 -988.986
v 50.677 241.945 -938.773
v 35.064 242.097 -981.334
v 32.4343 253.663 -979.515
vn -0.787921 -0.489164 0.37403
vn -0.84178 0.265694 0.469908
vn -0.702504 -0.571376 0.424286
vn -0.650919 -0.718861 0.244015
vn -0.897995 0.0233904 0.439384
vn -0.338879 -0.925515 0.169065
vn -0.0862817 -0.567917 0.818551
vn -0.0220311 -0.191112 0.981321
vn -0.656445 -0.644188 0.392558
vn -0.89887 -0.388914 0.201938
vn -0.628941 -0.252821 0.735197
vn -0.101231 -0.100197 0.989804
vn 0.336189 -0.0648856 0.939557
vn 0.149567 -0.879776 0.451246
vn -0.46508 -0.883491 0.056076
vn 0.750713 -0.441585 0.491358
vn 0.483599 -0.234682 0.843241
vn 0.744501 -0.0950901 0.660815
vn 0.995304 -0.0676811 0.0692033
vn 0.246529 -0.968989 -0.0168529
vn 0.710983 -0.693289 0.117701
vn 0.838115 -0.526992 -0.140863
vn -0.150593 -0.942179 -0.299368
vn -0.782181 -0.622786 0.0181595
vn -0.984203 -0.152469 0.0899881
vn -0.931862 -0.274294 0.237478
vn 0.026915 -0.911467 -0.410491
vn -0.660957 -0.706354 0.253376
vn -0.407968 -0.908737 -0.0880921
vn 0.799948 -0.178369 -0.572947
vn 0.372167 -0.799916 -0.470772
vn 0.509371 -0.587466 -0.628829
vn 0.722875 -0.446377 -0.527445
vn 0.727884 -0.120558 -0.675019
vn 0.0926875 -0.984734 -0.147335
vn 0.474076 -0.754599 -0.453687
vn 0.390465 -0.890703 -0.232779
vn 0.759648 0.500743 -0.41496
vn 0.722243 -0.526937 -0.447998
vn 0.895741 -0.0461577 -0.442174
vn -0.568617 0.76017 0.314352
vn -0.0604869 0.99797 0.0199461
vn -0.63941 0.645203 0.418172
vn -0.675896 0.642546 0.36097
vn -0.375576 0.893853 0.244886
vn -0.9205 0.139368 0.365042
vn -0.594385 0.16663 0.786728
vn -0.135404 0.310552 0.940863
vn -0.656806 0.715842 0.237015
vn -0.39259 0.878126 0.273436
vn -0.872239 0.486435 0.0507984
vn -0.547608 0.835705 0.0414979
vn 0.108104 -0.297056 0.948721
vn 0.563845 -0.157505 0.810723
vn 0.219347 0.55338 0.803528
vn -0.0581474 0.987304 0.147817
vn -0.247262 0.958594 -0.14128
vn 0.682392 0.643307 0.347127
vn 0.912807 -0.0649117 0.403199
vn 0.89844 0.412382 -0.150821
vn 0.921582 -0.240026 -0.305081
vn 0.645382 0.586363 -0.489551
vn 0.342909 0.865991 -0.363968
vn -0.113831 0.952277 -0.283216
vn -0.0726884 0.907827 -0.412998
vn 0.3006 0.766461 -0.567606
vn -0.513307 0.853727 -0.0875584
vn -0.845766 0.472948 0.246981
vn -0.817101 0.574418 0.0488899
vn -0.36828 0.929683 0.00774063
vn 0.337239 0.900971 -0.272987
vn 0.635194 0.425352 -0.644674
vn 0.880113 0.146156 -0.451708
vn 0.354576 0.711114 -0.607119
vn 0.610537 0.36542 -0.702647
vn -0.0198406 0.998825 0.0442155
vn -0.601763 -0.773772 0.197882
vn -0.902191 -0.202695 0.380744
vn -0.123577 -0.99173 0.0346396
vn 0.767838 -0.537474 -0.348635
vn -0.025832 -0.999465 0.0200367
vn 0.95729 -0.0427286 -0.285956
vn 0.515378 -0.848406 -0.120802
vn 0.803068 -0.551878 -0.224749
vn -0.541695 -0.790326 0.286273
vn -0.83446 -0.426254 0.349262
vn -0.255729 -0.965822 -0.0423122
vn -0.488866 -0.836859 0.246329
vn 0.0515953 -0.992826 0.107859
vn 0.490052 -0.863248 0.121042
vn 0.0743572 -0.989505 0.123899
vn 0.864959 -0.501748 0.00976354
vn 0.785329 -0.562253 0.259094
vn 0.993182 -0.0320139 0.112097
vn -0.420158 -0.823337 -0.381554
vn -0.889659 -0.34088 0.303821
vn -0.714435 -0.69837 -0.0431429
vn -0.765345 -0.522379 -0.375989
vn -0.296274 -0.780749 -0.550139
vn -0.506544 -0.579853 -0.63811
vn 0.30675 -0.934394 0.181141
vn 0.0270067 -0.998604 -0.0454053
vn 0.42226 -0.906431 0.0088543
vn 0.94013 -0.335275 -0.0612141
vn -0.106991 -0.94 -0.323964
vn 0.121053 -0.682591 -0.720705
vn 0.521965 -0.686713 -0.505943
vn 0.808992 0.0375299 -0.58662
vn -0.0578694 -0.3574 -0.932157
vn 0.461923 -0.147597 -0.874553
vn -0.807248 0.400736 0.433315
vn -0.786796 0.438313 0.43455
vn -0.253267 0.928438 0.27177
vn 0.435141 0.878906 -0.195388
vn 0.757385 0.617159 -0.213267
vn 0.245338 0.968239 0.0481875
vn 0.055131 0.965066 0.25614
vn -0.352034 0.825635 0.440907
vn -0.908281 -0.118878 0.401116
vn -0.839523 0.210839 0.500747
vn -0.645494 0.655148 0.39258
vn -0.0849288 0.965656 0.245553
vn 0.992173 0.0180413 -0.123561
vn 0.9914 0.129824 -0.0164977
vn 0.738301 0.674429 -0.00765985
vn 0.407782 0.899274 0.158178
vn 0.861695 0.505526 0.0438651
vn 0.038322 0.965273 0.258415
vn -0.947352 0.0182414 0.319673
vn -0.997517 -0.0470056 -0.0524379
vn -0.811249 0.579047 0.0811131
vn -0.354761 0.93288 -0.0622946
vn -0.787802 0.437452 -0.433595
vn -0.799831 -0.219364 -0.558704
vn -0.363108 0.296933 -0.883167
vn -0.311021 0.845707 -0.433641
vn -0.141317 0.988747 0.0490861
vn 0.348748 0.930251 0.114048
vn 0.483268 0.844114 0.232212
vn 0.859068 0.510931 -0.030849
vn 0.975289 0.159648 -0.152724
vn 0.00440417 0.927012 -0.375006
vn 0.750297 0.540121 -0.381214
vn -0.416379 -0.277142 -0.865922
vn 0.151567 0.143782 -0.977934
vn 0.556066 0.254026 -0.791366
vn 0.305039 0.699361 -0.646409
vn -0.693942 -0.714177 -0.0916293
vn -0.301134 -0.91495 -0.268671
vn -0.30316 0.941775 0.145446

g grp1
usemtl mtl1
f 2//2 1//1 26//26 
f 68//68 2//2 26//26 
f 1//1 3//3 6//6 
f 2//2 5//5 3//3 
f 43//43 5//5 2//2 
f 3//3 1//1 2//2 
f 3//3 5//5 4//4 
f 78//78 4//4 5//5 
f 4//4 6//6 3//3 
f 6//6 4//4 79//79 
f 6//6 79//79 35//35 
f 35//35 79//79 37//37 
f 11//11 7//7 12//12 
f 11//11 9//9 7//7 
f 7//7 9//9 14//14 
f 14//14 9//9 15//15 
f 10//10 9//9 11//11 
f 46//46 11//11 47//47 
f 11//11 46//46 10//10 
f 25//25 10//10 46//46 
f 8//8 11//11 12//12 
f 11//11 8//8 47//47 
f 12//12 13//13 8//8 
f 24//24 9//9 10//10 
f 10//10 25//25 24//24 
f 7//7 14//14 17//17 
f 7//7 17//17 12//12 
f 14//14 16//16 17//17 
f 14//14 15//15 20//20 
f 14//14 20//20 21//21 
f 21//21 16//16 14//14 
f 12//12 17//17 13//13 
f 18//18 17//17 16//16 
f 13//13 17//17 18//18 
f 18//18 16//16 19//19 
f 16//16 22//22 19//19 
f 18//18 19//19 59//59 
f 23//23 20//20 15//15 
f 21//21 20//20 31//31 
f 21//21 31//31 22//22 
f 16//16 21//21 22//22 
f 23//23 31//31 20//20 
f 22//22 61//61 19//19 
f 29//29 23//23 15//15 
f 23//23 29//29 27//27 
f 27//27 31//31 23//23 
f 15//15 24//24 29//29 
f 26//26 24//24 25//25 
f 24//24 28//28 29//29 
f 24//24 26//26 28//28 
f 26//26 1//1 28//28 
f 25//25 68//68 26//26 
f 31//31 27//27 32//32 
f 6//6 28//28 1//1 
f 28//28 6//6 29//29 
f 29//29 6//6 35//35 
f 27//27 29//29 35//35 
f 27//27 35//35 36//36 
f 32//32 27//27 36//36 
f 32//32 36//36 30//30 
f 33//33 31//31 32//32 
f 33//33 22//22 31//31 
f 22//22 33//33 61//61 
f 33//33 32//32 34//34 
f 34//34 61//61 33//33 
f 30//30 34//34 32//32 
f 37//37 36//36 35//35 
f 36//36 37//37 39//39 
f 36//36 39//39 30//30 
f 40//40 30//30 39//39 
f 40//40 38//38 30//30 
f 37//37 80//80 39//39 
f 40//40 39//39 80//80 
f 68//68 41//41 2//2 
f 2//2 41//41 43//43 
f 45//45 43//43 41//41 
f 41//41 42//42 45//45 
f 44//44 5//5 43//43 
f 43//43 45//45 44//44 
f 113//113 44//44 45//45 
f 76//76 45//45 42//42 
f 76//76 113//113 45//45 
f 47//47 49//49 46//46 
f 8//8 53//53 47//47 
f 47//47 53//53 48//48 
f 47//47 48//48 49//49 
f 50//50 49//49 48//48 
f 55//55 48//48 54//54 
f 48//48 55//55 50//50 
f 49//49 51//51 46//46 
f 52//52 51//51 49//49 
f 46//46 51//51 25//25 
f 53//53 8//8 13//13 
f 52//52 49//49 50//50 
f 67//67 51//51 52//52 
f 69//69 25//25 51//51 
f 51//51 67//67 69//69 
f 52//52 57//57 67//67 
f 65//65 67//67 57//57 
f 18//18 54//54 13//13 
f 13//13 54//54 53//53 
f 53//53 54//54 48//48 
f 18//18 59//59 54//54 
f 55//55 54//54 58//58 
f 58//58 54//54 59//59 
f 55//55 56//56 50//50 
f 58//58 56//56 55//55 
f 52//52 50//50 57//57 
f 63//63 57//57 56//56 
f 50//50 56//56 57//57 
f 56//56 58//58 63//63 
f 59//59 19//19 60//60 
f 60//60 63//63 58//58 
f 58//58 59//59 60//60 
f 19//19 61//61 73//73 
f 60//60 19//19 73//73 
f 63//63 74//74 65//65 
f 63//63 62//62 74//74 
f 63//63 65//65 57//57 
f 63//63 60//60 62//62 
f 60//60 73//73 62//62 
f 25//25 69//69 68//68 
f 70//70 69//69 67//67 
f 67//67 64//64 70//70 
f 66//66 64//64 65//65 
f 74//74 66//66 65//65 
f 67//67 65//65 64//64 
f 68//68 69//69 70//70 
f 68//68 70//70 41//41 
f 64//64 71//71 70//70 
f 70//70 71//71 42//42 
f 64//64 66//66 71//71 
f 66//66 72//72 71//71 
f 75//75 74//74 62//62 
f 66//66 74//74 75//75 
f 61//61 34//34 73//73 
f 62//62 73//73 75//75 
f 73//73 34//34 75//75 
f 66//66 75//75 72//72 
f 75//75 34//34 72//72 
f 30//30 72//72 34//34 
f 70//70 42//42 41//41 
f 71//71 38//38 114//114 
f 114//114 76//76 42//42 
f 114//114 42//42 71//71 
f 38//38 72//72 30//30 
f 72//72 38//38 71//71 
f 38//38 40//40 115//115 
f 115//115 114//114 38//38 
f 78//78 119//119 86//86 
f 77//77 4//4 78//78 
f 85//85 81//81 77//77 
f 77//77 78//78 85//85 
f 4//4 77//77 79//79 
f 79//79 77//77 81//81 
f 79//79 81//81 37//37 
f 37//37 81//81 83//83 
f 37//37 83//83 80//80 
f 83//83 84//84 80//80 
f 78//78 86//86 85//85 
f 85//85 89//89 81//81 
f 80//80 84//84 82//82 
f 84//84 123//123 82//82 
f 86//86 88//88 85//85 
f 88//88 87//87 91//91 
f 97//97 87//87 88//88 
f 96//96 88//88 86//86 
f 88//88 96//96 97//97 
f 89//89 88//88 91//91 
f 88//88 89//89 85//85 
f 89//89 83//83 81//81 
f 83//83 89//89 90//90 
f 89//89 91//91 90//90 
f 84//84 83//83 92//92 
f 84//84 92//92 123//123 
f 92//92 83//83 90//90 
f 102//102 101//101 91//91 
f 87//87 102//102 91//91 
f 90//90 91//91 101//101 
f 124//124 92//92 94//94 
f 90//90 101//101 93//93 
f 90//90 93//93 92//92 
f 93//93 94//94 92//92 
f 130//130 97//97 96//96 
f 98//98 97//97 130//130 
f 134//134 98//98 130//130 
f 100//100 98//98 134//134 
f 95//95 99//99 105//105 
f 100//100 99//99 95//95 
f 95//95 97//97 98//98 
f 95//95 98//98 100//100 
f 109//109 99//99 100//100 
f 87//87 105//105 102//102 
f 102//102 103//103 101//101 
f 93//93 101//101 103//103 
f 93//93 103//103 104//104 
f 104//104 94//94 93//93 
f 94//94 104//104 141//141 
f 94//94 141//141 127//127 
f 103//103 102//102 107//107 
f 105//105 107//107 102//102 
f 106//106 105//105 99//99 
f 106//106 99//99 109//109 
f 109//109 110//110 106//106 
f 103//103 107//107 104//104 
f 107//107 108//108 104//104 
f 141//141 104//104 108//108 
f 105//105 106//106 107//107 
f 106//106 110//110 107//107 
f 108//108 107//107 110//110 
f 40//40 80//80 82//82 
f 78//78 112//112 119//119 
f 112//112 111//111 119//119 
f 112//112 118//118 111//111 
f 112//112 78//78 44//44 
f 5//5 44//44 78//78 
f 113//113 112//112 44//44 
f 113//113 76//76 116//116 
f 115//115 116//116 114//114 
f 76//76 114//114 116//116 
f 112//112 113//113 118//118 
f 126//126 117//117 116//116 
f 113//113 116//116 117//117 
f 115//115 82//82 123//123 
f 116//116 125//125 126//126 
f 116//116 115//115 125//125 
f 123//123 125//125 115//115 
f 120//120 111//111 118//118 
f 111//111 120//120 119//119 
f 129//129 96//96 119//119 
f 86//86 119//119 96//96 
f 121//121 120//120 118//118 
f 129//129 119//119 120//120 
f 120//120 121//121 129//129 
f 122//122 121//121 118//118 
f 118//118 117//117 122//122 
f 117//117 128//128 122//122 
f 113//113 117//117 118//118 
f 123//123 92//92 124//124 
f 125//125 123//123 124//124 
f 94//94 127//127 124//124 
f 125//125 127//127 126//126 
f 125//125 124//124 127//127 
f 126//126 139//139 117//117 
f 117//117 139//139 128//128 
f 127//127 139//139 126//126 
f 127//127 140//140 139//139 
f 130//130 96//96 129//129 
f 131//131 129//129 121//121 
f 129//129 131//131 130//130 
f 121//121 132//132 131//131 
f 122//122 128//128 132//132 
f 130//130 133//133 134//134 
f 135//135 134//134 133//133 
f 100//100 134//134 144//144 
f 134//134 135//135 144//144 
f 132//132 133//133 131//131 
f 130//130 131//131 133//133 
f 132//132 136//136 133//133 
f 135//135 133//133 136//136 
f 137//137 136//136 132//132 
f 136//136 147//147 135//135 
f 137//137 142//142 136//136 
f 147//147 136//136 142//142 
f 140//140 127//127 141//141 
f 128//128 139//139 138//138 
f 128//128 137//137 132//132 
f 138//138 137//137 128//128 
f 139//139 140//140 138//138 
f 143//143 146//146 147//147 
f 141//141 108//108 143//143 
f 143//143 140//140 141//141 
f 146//146 143//143 108//108 
f 137//137 138//138 142//142 
f 138//138 147//147 142//142 
f 143//143 147//147 138//138 
f 138//138 140//140 143//143 
f 109//109 100//100 144//144 
f 135//135 145//145 144//144 
f 144//144 145//145 109//109 
f 110//110 146//146 108//108 
f 146//146 110//110 145//145 
f 109//109 145//145 110//110 
f 135//135 147//147 145//145 
f 145//145 147//147 146//146 
f 40//40 82//82 115//115 
f 9//9 24//24 148//148 
f 24//24 15//15 148//148 
f 15//15 9//9 148//148 
f 87//87 149//149 105//105 
f 149//149 95//95 105//105 
f 95//95 149//149 97//97 
f 149//149 87//87 97//97 
f 121//121 122//122 150//150 
f 122//122 132//132 150//150 
f 132//132 121//121 150//150 
