# PIPER geometrical reference model based on a manual segmentation. See the
# documentation for more info.
# Author: CEESAR, SOTON, UCBL-Ifsttar
# Version: 1.0.0
# License: Creative Commons Attribution 4.0 International License.
# (https://creativecommons.org/licenses/by/4.0/)
# 
# This work has received funding from the European Union Seventh Framework
# Program ([FP7/2007-2013]) under grant agreement 605544 [PIPER project]).
# Contributors include Pierre Maillez, Christophe Lecomte (SOTON), Erwan
# Jolivet (CEESAR), Philippe Beillas (UCBL-Ifsttar)
# This work is derived from a CT scan provided by CEESAR under a CCBY-4.0
# License
# 
# wavefront obj file written by the visualization toolkit

mtllib C:/desktop/registration_reference_model/22_REF_LTE635_Assembly_hands_corr/CCTu635_BP109_Lunate_R.mtl

v 60.1583 259.101 -902.204
v 64.1507 257.778 -901.085
v 57.8979 253.553 -905.592
v 56.7799 254.198 -906.124
v 62.3303 253.983 -904.059
v 63.8001 253.726 -906.079
v 60.8257 253.758 -906.36
v 58.2938 255.303 -904.287
v 57.8565 256.417 -904.591
v 56.8038 255.684 -906.243
v 60.3903 254.708 -903.644
v 61.242 257.288 -901.999
v 62.8016 255.12 -902.581
v 68.1015 256.749 -902.063
v 66.6592 258.646 -900.831
v 68.8991 259.717 -901.21
v 70.0617 257.945 -902.615
v 65.8621 253.74 -904.006
v 69.1446 254.242 -904.243
v 66.6121 253.342 -906.378
v 69.5455 253.493 -905.841
v 71.0113 254.105 -906.363
v 70.9592 253.43 -909.14
v 65.3067 255.955 -901.831
v 65.3017 254.366 -902.742
v 67.0703 254.129 -903.044
v 71.462 258.344 -903.594
v 69.9872 255.839 -903.565
v 72.2247 255.426 -906.214
v 72.3146 257.379 -905.122
v 72.2624 254.572 -908.135
v 72.9792 256.759 -907.464
v 72.8376 258.706 -906.336
v 62.347 260.47 -900.846
v 65.2884 260.918 -900.203
v 61.1802 263.224 -900.901
v 60.4555 263.494 -901.848
v 62.6532 264.141 -900.081
v 61.9737 265.273 -900.994
v 65.4825 265.593 -900.128
v 62.5692 265.78 -902.552
v 58.6277 263.096 -905.404
v 59.2673 263.881 -905.87
v 59.2058 259.439 -903.31
v 59.6922 262.847 -903.092
v 60.2488 264.348 -903.468
v 61.2443 264.677 -905.429
v 60.8279 264.085 -907.19
v 67.6895 262.103 -900.239
v 65.4301 263.117 -899.859
v 67.3586 264.745 -900.089
v 68.7695 264.124 -900.683
v 70.1213 263.004 -901.883
v 69.1197 264.871 -901.749
v 69.7744 261.952 -901.176
v 64.6988 266.497 -900.716
v 67.5702 266.035 -900.995
v 65.4572 265.559 -906.736
v 70.3665 263.03 -906.779
v 72.0208 259.628 -904.193
v 70.3404 263.011 -904.345
v 71.553 261.192 -904.133
v 66.1262 266.788 -903.123
v 67.2812 266.927 -902.619
v 68.5719 265.762 -903.246
v 64.5675 265.758 -904.911
v 67.4405 265.986 -906.716
v 68.9571 265.359 -907.443
v 56.659 253.74 -908.198
v 58.1918 253.671 -908.523
v 57.3087 254.696 -910.062
v 61.4633 254.462 -908.678
v 61.9086 253.858 -907.551
v 55.9633 254.63 -908.668
v 57.109 259.05 -907.208
v 56.1033 254.69 -909.695
v 57.8698 255.884 -910.331
v 56.9589 257.532 -910.168
v 57.6442 258.733 -910.248
v 58.8955 260.617 -909.961
v 61.6815 255.504 -908.933
v 63.1188 257.444 -908.811
v 65.2629 253.673 -908.117
v 64.4262 255.367 -908.886
v 67.1573 253.074 -908.885
v 69.9106 253.045 -908.942
v 68.3782 252.966 -911.5
v 66.9641 253.455 -910.426
v 71.7249 254.077 -910.263
v 69.5753 253.018 -913.073
v 65.8592 255.009 -909.695
v 65.2831 260.164 -910.111
v 66.6512 255.3 -910.992
v 72.5796 255.653 -910.018
v 72.92 258.495 -909.407
v 73.1941 256.923 -909.381
v 71.5583 255.262 -912.214
v 72.0641 259.462 -911.714
v 72.4869 257.633 -911.41
v 71.086 259.067 -913.4
v 68.4398 253.657 -914.06
v 69.6144 253.84 -914.41
v 68.0236 255.26 -914.688
v 69.0227 255.111 -915.345
v 69.9805 257.666 -914.678
v 68.5444 257.828 -915.059
v 71.2353 256.888 -913.488
v 57.0904 259.839 -909.244
v 57.3784 261.784 -908.38
v 57.9131 261.77 -909.588
v 58.1977 263.096 -908.423
v 60.2687 262.195 -909.072
v 60.6685 258.721 -909.348
v 62.1759 260.684 -908.978
v 63.508 262.176 -909.073
v 63.8083 260.184 -909.066
v 61.6852 263.383 -908.499
v 64.5471 264.203 -908.815
v 65.3213 262.427 -910.005
v 67.2635 264.708 -909.933
v 66.135 263.623 -910.862
v 68.7721 264.89 -909.385
v 66.4664 260.169 -912.586
v 67.4653 263.604 -912.353
v 68.9199 263.557 -911.691
v 68.5537 262.227 -913.646
v 72.309 260.212 -908.276
v 71.6551 260.806 -910.586
v 70.0005 263.147 -910.823
v 70.4065 261.245 -912.762
v 66.9822 260.979 -913.893
v 67.0205 262.737 -913.368
v 68.1569 260.801 -914.575
v 69.43 259.995 -914.422
vn -0.612367 -0.10194 0.783974
vn -0.118385 -0.323543 0.938778
vn -0.316214 -0.852605 0.416022
vn -0.805376 -0.390196 0.446226
vn -0.0925091 -0.91519 0.392263
vn -0.0701818 -0.997027 0.0317932
vn 0.0453965 -0.998963 0.00356257
vn -0.586772 -0.276945 0.76092
vn -0.78823 0.0194967 0.615072
vn -0.90194 0.0911734 0.422129
vn -0.266028 -0.59583 0.75777
vn -0.360334 -0.301509 0.882752
vn -0.193643 -0.57625 0.794002
vn 0.335453 -0.403635 0.851205
vn 0.156703 -0.311828 0.937127
vn 0.426168 -0.262765 0.865642
vn 0.541016 -0.318012 0.778569
vn -0.035477 -0.96116 0.2737
vn 0.450722 -0.680796 0.577379
vn -0.0794377 -0.99234 0.0946072
vn 0.278602 -0.91067 0.30506
vn 0.558512 -0.741951 0.370908
vn 0.496935 -0.86627 0.0513071
vn 0.0306156 -0.441025 0.896972
vn -0.0415519 -0.719582 0.693164
vn 0.188089 -0.737051 0.649136
vn 0.723464 -0.222102 0.653659
vn 0.549012 -0.460441 0.697553
vn 0.786184 -0.459398 0.413362
vn 0.845478 -0.225137 0.484232
vn 0.805469 -0.584054 0.100505
vn 0.976324 -0.16188 0.143477
vn 0.973214 0.149137 0.174963
vn -0.307027 -0.188068 0.932933
vn -0.0434619 -0.188023 0.981203
vn -0.622294 0.05359 0.780947
vn -0.819855 0.271741 0.503978
vn -0.322118 0.141391 0.936082
vn -0.563147 0.64867 0.51195
vn 0.0353078 0.398953 0.916291
vn -0.401747 0.914267 -0.0520979
vn -0.852853 0.440874 0.27977
vn -0.540602 0.841199 -0.0115449
vn -0.791894 0.0435413 0.609104
vn -0.866355 0.238831 0.438621
vn -0.692271 0.700304 0.174168
vn -0.335784 0.925246 -0.176545
vn -0.234779 0.901948 -0.362447
vn 0.263897 -0.115888 0.957564
vn -0.00861948 -0.0520879 0.998605
vn 0.290019 0.256276 0.922069
vn 0.594266 0.249848 0.764476
vn 0.86525 0.309502 0.394399
vn 0.776288 0.55252 0.303477
vn 0.648533 -0.0211307 0.760893
vn -0.171621 0.838681 0.516877
vn 0.447099 0.696665 0.561036
vn -0.238341 0.920421 -0.309869
vn 0.840615 0.541632 0.000367651
vn 0.894167 0.0910623 0.438375
vn 0.840039 0.541322 0.0361365
vn 0.889368 0.395591 0.229199
vn -0.174194 0.973403 -0.148807
vn 0.319208 0.942014 0.103513
vn 0.748623 0.65965 0.0665193
vn -0.268448 0.929507 -0.252887
vn 0.0319041 0.960672 -0.275848
vn 0.611491 0.779669 -0.134891
vn -0.476836 -0.872095 -0.109901
vn 0.0321838 -0.93729 -0.347061
vn -0.0649566 -0.52185 -0.850561
vn 0.128466 -0.612892 -0.779654
vn -0.00344074 -0.970427 -0.24137
vn -0.973162 -0.22877 0.024914
vn -0.953304 0.189826 0.234901
vn -0.719619 -0.372275 -0.58614
vn 0.0633042 -0.131523 -0.98929
vn -0.597393 0.129558 -0.791414
vn -0.267176 0.175665 -0.947501
vn 0.1755 0.194505 -0.965074
vn 0.166974 -0.144605 -0.975299
vn 0.0124249 -0.0319588 -0.999412
vn -0.312642 -0.87818 -0.362016
vn -0.249285 -0.258191 -0.933378
vn -0.197359 -0.980025 -0.0245264
vn 0.195318 -0.977219 0.0830312
vn -0.224653 -0.966943 -0.120633
vn -0.665944 -0.665889 -0.336318
vn 0.749076 -0.636601 -0.18337
vn 0.278025 -0.908476 -0.312048
vn -0.714257 -0.275894 -0.64321
vn -0.760312 -0.0561168 -0.64713
vn -0.8754 -0.209205 -0.435783
vn 0.910677 -0.3499 -0.219633
vn 0.962208 0.248342 -0.111726
vn 0.987952 -0.123061 -0.0938467
vn 0.834396 -0.352013 -0.424112
vn 0.868218 0.31961 -0.379535
vn 0.915245 -0.00434335 -0.402875
vn 0.737419 0.233494 -0.633793
vn -0.482912 -0.694546 -0.533293
vn 0.417407 -0.610101 -0.673459
vn -0.746071 -0.219595 -0.628615
vn 0.05012 -0.244143 -0.968443
vn 0.517856 0.102617 -0.849291
vn -0.177987 0.0948377 -0.979452
vn 0.792391 -0.0773557 -0.605089
vn -0.923812 0.220987 -0.312629
vn -0.93318 0.355225 -0.0546907
vn -0.435401 0.471757 -0.766728
vn -0.516331 0.764458 -0.386014
vn 0.125832 0.351891 -0.927545
vn 0.278343 0.0175361 -0.960322
vn 0.0350844 0.0563229 -0.997796
vn -0.290124 0.118799 -0.949587
vn -0.320824 -0.0569735 -0.945424
vn -0.133623 0.550295 -0.824209
vn -0.380365 0.660605 -0.647243
vn -0.736814 0.127517 -0.663961
vn -0.141898 0.886918 -0.439593
vn -0.653413 0.568773 -0.499549
vn 0.377198 0.85527 -0.355295
vn -0.911096 -0.0862401 -0.403072
vn -0.0873755 0.847966 -0.5228
vn 0.423235 0.767768 -0.481045
vn 0.329467 0.606707 -0.723435
vn 0.883753 0.466422 -0.0378277
vn 0.837655 0.5078 -0.201181
vn 0.719701 0.623312 -0.305798
vn 0.683465 0.503637 -0.528417
vn -0.735938 0.0939185 -0.670503
vn -0.469666 0.540716 -0.697882
vn -0.072439 0.302425 -0.950417
vn 0.451236 0.310335 -0.836707

g grp1
usemtl mtl1
f 34//34 1//1 12//12 
f 35//35 34//34 2//2 
f 12//12 2//2 34//34 
f 8//8 4//4 3//3 
f 69//69 3//3 4//4 
f 3//3 69//69 70//70 
f 74//74 69//69 4//4 
f 3//3 70//70 7//7 
f 3//3 11//11 8//8 
f 3//3 5//5 11//11 
f 5//5 6//6 18//18 
f 5//5 3//3 7//7 
f 5//5 7//7 6//6 
f 70//70 73//73 7//7 
f 6//6 7//7 73//73 
f 9//9 10//10 8//8 
f 8//8 44//44 9//9 
f 44//44 10//10 9//9 
f 42//42 10//10 45//45 
f 44//44 45//45 10//10 
f 10//10 75//75 74//74 
f 4//4 8//8 10//10 
f 4//4 10//10 74//74 
f 42//42 75//75 10//10 
f 11//11 5//5 13//13 
f 11//11 13//13 12//12 
f 11//11 12//12 8//8 
f 12//12 13//13 2//2 
f 5//5 25//25 13//13 
f 8//8 12//12 1//1 
f 44//44 8//8 1//1 
f 24//24 26//26 14//14 
f 15//15 35//35 2//2 
f 24//24 15//15 2//2 
f 24//24 14//14 15//15 
f 14//14 16//16 15//15 
f 17//17 16//16 14//14 
f 55//55 16//16 17//17 
f 5//5 18//18 25//25 
f 25//25 18//18 26//26 
f 21//21 26//26 18//18 
f 26//26 21//21 19//19 
f 18//18 6//6 20//20 
f 18//18 20//20 21//21 
f 6//6 73//73 83//83 
f 20//20 6//6 83//83 
f 20//20 83//83 85//85 
f 85//85 86//86 20//20 
f 21//21 20//20 86//86 
f 19//19 21//21 22//22 
f 22//22 21//21 23//23 
f 22//22 23//23 31//31 
f 13//13 25//25 24//24 
f 13//13 24//24 2//2 
f 24//24 25//25 26//26 
f 19//19 28//28 26//26 
f 14//14 26//26 28//28 
f 14//14 28//28 17//17 
f 17//17 28//28 27//27 
f 55//55 17//17 27//27 
f 27//27 60//60 55//55 
f 27//27 28//28 30//30 
f 30//30 60//60 27//27 
f 60//60 30//30 33//33 
f 22//22 28//28 19//19 
f 28//28 22//22 29//29 
f 29//29 30//30 28//28 
f 29//29 22//22 31//31 
f 29//29 31//31 32//32 
f 29//29 32//32 30//30 
f 30//30 32//32 33//33 
f 34//34 38//38 36//36 
f 36//36 44//44 1//1 
f 36//36 1//1 34//34 
f 50//50 38//38 34//34 
f 35//35 50//50 34//34 
f 38//38 39//39 36//36 
f 36//36 37//37 44//44 
f 36//36 39//39 37//37 
f 56//56 39//39 38//38 
f 56//56 38//38 40//40 
f 39//39 56//56 41//41 
f 75//75 42//42 109//109 
f 111//111 42//42 43//43 
f 37//37 45//45 44//44 
f 37//37 46//46 45//45 
f 37//37 39//39 46//46 
f 39//39 41//41 46//46 
f 45//45 46//46 42//42 
f 43//43 42//42 46//46 
f 46//46 47//47 43//43 
f 46//46 41//41 47//47 
f 41//41 66//66 47//47 
f 58//58 48//48 47//47 
f 43//43 48//48 111//111 
f 43//43 47//47 48//48 
f 66//66 58//58 47//47 
f 15//15 49//49 35//35 
f 35//35 49//49 50//50 
f 16//16 49//49 15//15 
f 16//16 55//55 49//49 
f 51//51 50//50 49//49 
f 50//50 51//51 40//40 
f 52//52 49//49 55//55 
f 49//49 52//52 51//51 
f 57//57 51//51 52//52 
f 53//53 52//52 55//55 
f 52//52 53//53 54//54 
f 53//53 61//61 54//54 
f 57//57 52//52 54//54 
f 40//40 38//38 50//50 
f 40//40 51//51 57//57 
f 40//40 57//57 56//56 
f 63//63 41//41 56//56 
f 56//56 57//57 64//64 
f 57//57 54//54 65//65 
f 57//57 65//65 64//64 
f 61//61 65//65 54//54 
f 61//61 59//59 65//65 
f 62//62 55//55 60//60 
f 55//55 62//62 53//53 
f 60//60 33//33 62//62 
f 53//53 62//62 61//61 
f 62//62 33//33 127//127 
f 61//61 62//62 127//127 
f 127//127 59//59 61//61 
f 41//41 63//63 66//66 
f 56//56 64//64 63//63 
f 59//59 68//68 65//65 
f 68//68 64//64 65//65 
f 63//63 67//67 66//66 
f 64//64 67//67 63//63 
f 66//66 67//67 58//58 
f 64//64 68//68 67//67 
f 69//69 74//74 76//76 
f 69//69 76//76 71//71 
f 69//69 71//71 70//70 
f 71//71 72//72 70//70 
f 70//70 72//72 73//73 
f 73//73 72//72 83//83 
f 83//83 72//72 84//84 
f 108//108 74//74 75//75 
f 108//108 76//76 74//74 
f 77//77 71//71 76//76 
f 78//78 76//76 108//108 
f 77//77 76//76 78//78 
f 77//77 78//78 79//79 
f 77//77 79//79 80//80 
f 79//79 78//78 108//108 
f 81//81 113//113 82//82 
f 71//71 81//81 72//72 
f 81//81 71//71 77//77 
f 81//81 77//77 113//113 
f 72//72 81//81 84//84 
f 82//82 84//84 81//81 
f 84//84 82//82 116//116 
f 82//82 113//113 114//114 
f 80//80 113//113 77//77 
f 82//82 114//114 116//116 
f 83//83 84//84 91//91 
f 88//88 85//85 83//83 
f 83//83 91//91 88//88 
f 86//86 85//85 87//87 
f 88//88 87//87 85//85 
f 93//93 88//88 91//91 
f 86//86 87//87 90//90 
f 21//21 86//86 23//23 
f 31//31 23//23 89//89 
f 23//23 86//86 90//90 
f 89//89 23//23 90//90 
f 89//89 90//90 97//97 
f 97//97 90//90 102//102 
f 84//84 116//116 91//91 
f 92//92 91//91 116//116 
f 91//91 92//92 93//93 
f 103//103 93//93 123//123 
f 93//93 92//92 123//123 
f 89//89 94//94 31//31 
f 32//32 31//31 94//94 
f 32//32 94//94 96//96 
f 96//96 94//94 99//99 
f 33//33 95//95 127//127 
f 96//96 95//95 32//32 
f 32//32 95//95 33//33 
f 99//99 95//95 96//96 
f 94//94 89//89 97//97 
f 94//94 97//97 99//99 
f 95//95 99//99 98//98 
f 95//95 98//98 128//128 
f 107//107 99//99 97//97 
f 98//98 99//99 100//100 
f 107//107 100//100 99//99 
f 87//87 88//88 101//101 
f 93//93 103//103 88//88 
f 101//101 88//88 103//103 
f 87//87 101//101 90//90 
f 101//101 102//102 90//90 
f 101//101 103//103 104//104 
f 104//104 102//102 101//101 
f 107//107 102//102 104//104 
f 104//104 103//103 106//106 
f 104//104 106//106 105//105 
f 104//104 105//105 107//107 
f 131//131 103//103 123//123 
f 100//100 105//105 134//134 
f 105//105 106//106 134//134 
f 106//106 103//103 131//131 
f 133//133 106//106 131//131 
f 133//133 134//134 106//106 
f 97//97 102//102 107//107 
f 100//100 107//107 105//105 
f 75//75 109//109 108//108 
f 110//110 108//108 109//109 
f 42//42 111//111 109//109 
f 111//111 110//110 109//109 
f 79//79 108//108 110//110 
f 110//110 80//80 79//79 
f 114//114 113//113 112//112 
f 114//114 112//112 117//117 
f 80//80 112//112 113//113 
f 80//80 110//110 112//112 
f 116//116 114//114 115//115 
f 115//115 119//119 116//116 
f 116//116 119//119 92//92 
f 111//111 48//48 117//117 
f 110//110 111//111 112//112 
f 112//112 111//111 117//117 
f 48//48 118//118 117//117 
f 117//117 115//115 114//114 
f 115//115 117//117 118//118 
f 118//118 48//48 58//58 
f 119//119 115//115 118//118 
f 120//120 118//118 58//58 
f 67//67 120//120 58//58 
f 118//118 121//121 119//119 
f 120//120 121//121 118//118 
f 67//67 122//122 120//120 
f 67//67 68//68 122//122 
f 59//59 128//128 68//68 
f 68//68 129//129 122//122 
f 68//68 128//128 129//129 
f 92//92 119//119 123//123 
f 119//119 131//131 123//123 
f 132//132 131//131 119//119 
f 125//125 130//130 126//126 
f 130//130 125//125 129//129 
f 120//120 124//124 121//121 
f 132//132 119//119 121//121 
f 121//121 124//124 132//132 
f 122//122 125//125 120//120 
f 120//120 125//125 124//124 
f 129//129 125//125 122//122 
f 126//126 124//124 125//125 
f 124//124 126//126 132//132 
f 127//127 128//128 59//59 
f 127//127 95//95 128//128 
f 128//128 98//98 130//130 
f 100//100 130//130 98//98 
f 130//130 129//129 128//128 
f 132//132 133//133 131//131 
f 130//130 100//100 134//134 
f 130//130 134//134 126//126 
f 133//133 126//126 134//134 
f 133//133 132//132 126//126 
