# PIPER geometrical reference model based on a manual segmentation. See the
# documentation for more info.
# Author: CEESAR, SOTON, UCBL-Ifsttar
# Version: 1.0.0
# License: Creative Commons Attribution 4.0 International License.
# (https://creativecommons.org/licenses/by/4.0/)
# 
# This work has received funding from the European Union Seventh Framework
# Program ([FP7/2007-2013]) under grant agreement 605544 [PIPER project]).
# Contributors include Pierre Maillez, Christophe Lecomte (SOTON), Erwan
# Jolivet (CEESAR), Philippe Beillas (UCBL-Ifsttar)
# This work is derived from a CT scan provided by CEESAR under a CCBY-4.0
# License
# 
# wavefront obj file written by the visualization toolkit

mtllib C:/desktop/registration_reference_model/22_REF_LTE635_Assembly_hands_corr/CCTu635_BP101_Capitate_R.mtl

v 55.3697 254.496 -915.235
v 55.4182 253.345 -917.407
v 55.558 253.193 -916.451
v 55.0358 254.623 -917.307
v 54.9969 253.877 -918.596
v 54.4737 255.088 -918.766
v 55.606 252.681 -918.165
v 52.1986 255.167 -922.459
v 55.1043 253.022 -919.93
v 54.2574 254.496 -920.006
v 52.8656 253.98 -922.52
v 54.2193 253.342 -921.552
v 58.9535 255.388 -911.361
v 61.3683 254.514 -911.352
v 60.2953 255.485 -911.147
v 61.3726 255.414 -911.21
v 61.1337 252.146 -913.527
v 63.2874 252.591 -912.615
v 62.7382 251.196 -914.257
v 57.6519 253.313 -913.139
v 59.2667 253.338 -912.418
v 59.6085 254.368 -911.587
v 59.1778 252.209 -914.103
v 57.7786 255.964 -911.796
v 57.8522 254.426 -912.285
v 55.9888 253.157 -914.935
v 56.608 253.907 -913.496
v 55.9174 254.54 -914.12
v 60.8738 253.476 -911.927
v 62.2968 252.943 -912.244
v 62.7435 252.076 -912.959
v 63.6514 251.795 -913.489
v 63.7309 251.042 -914.685
v 64.3885 251.5 -914.481
v 63.198 253.756 -912.18
v 64.1325 252.596 -913.299
v 64.6775 253.515 -913.557
v 63.4854 255.083 -912.215
v 64.1397 253.948 -912.862
v 64.902 255.577 -914.333
v 65.0541 253.549 -914.603
v 59.2518 248.467 -921.163
v 59.5176 247.961 -922.465
v 60.3503 247.691 -922.229
v 59.9791 251.158 -915.345
v 59.0099 250.379 -916.719
v 56.8674 251.071 -917.048
v 55.8534 252.35 -916.516
v 56.6389 252.124 -915.554
v 57.8586 251.094 -916.087
v 57.8901 250.111 -918.05
v 59.7242 249.648 -918.492
v 56.1823 251.771 -916.836
v 60.7045 250.354 -916.672
v 62.3886 250.484 -916.208
v 61.991 250.77 -914.963
v 62.2869 249.744 -918.388
v 61.1301 249.686 -918.308
v 57.2531 250.191 -919.404
v 60.3558 248.897 -920.045
v 58.0242 249.126 -920.666
v 57.5208 249.793 -922.613
v 56.0326 251.726 -919.706
v 61.3168 248.993 -920.035
v 62.6178 249.009 -922.418
v 64.9815 252.12 -915.039
v 62.4569 248.956 -921.205
v 64.1361 250.601 -916.185
v 65.0155 251.237 -916.048
v 65.39 252.083 -916.485
v 65.1818 254.417 -915.523
v 64.8536 254.914 -916.501
v 65.3356 252.623 -918.142
v 65.2536 253.277 -919.66
v 65.2183 253.06 -916.978
v 64.2481 254.829 -918.485
v 64.6131 250.508 -917.735
v 64.6713 250.382 -919.43
v 65.4708 251.202 -918.682
v 65.6474 251.966 -919.047
v 64.4769 250.261 -921.009
v 65.0123 250.993 -921.786
v 65.7994 251.505 -920.059
v 65.8373 251.989 -921.25
v 65.0548 254.483 -920.802
v 64.4193 254.698 -919.657
v 65.7836 253.84 -921.653
v 65.8097 252.613 -920.652
v 56.1224 257.129 -913.23
v 55.6888 258.363 -914.126
v 55.8922 259.161 -914.527
v 55.5421 257.625 -914.198
v 54.9284 256.356 -916.566
v 54.9521 257.995 -916.331
v 55.2546 259.08 -916.311
v 54.4471 255.985 -918.128
v 54.186 257.39 -918.203
v 54.0933 259.142 -918.582
v 55.0935 260.047 -918.026
v 52.4673 256.768 -921.288
v 52.0687 256.18 -922.097
v 53.556 256.443 -919.8
v 53.1033 255.199 -921.391
v 52.3576 257.881 -920.965
v 53.0007 259.324 -919.853
v 53.0999 258.39 -919.816
v 52.1583 260.374 -921.067
v 49.2773 261.379 -922.923
v 50.5981 261.837 -922.379
v 51.4122 259.829 -921.655
v 51.2338 260.944 -921.763
v 52.9361 260.515 -920.532
v 54.2103 260.373 -919.586
v 55.2942 260.488 -918.779
v 54.6662 260.695 -920.242
v 56.6212 260.544 -919.442
v 52.2077 261.257 -921.533
v 53.8221 260.973 -921.271
v 54.1546 261.437 -922.794
v 60.1896 256.906 -911.034
v 58.6747 256.431 -911.279
v 58.9274 258.642 -911.591
v 60.8446 258.37 -911.414
v 62.006 257.307 -911.468
v 56.9313 256.384 -912.306
v 57.2627 258.103 -912.095
v 56.5021 258.651 -913.018
v 56.7059 259.67 -913.818
v 57.712 259.392 -912.424
v 62.3417 255.519 -911.562
v 63.0413 256.754 -912.097
v 60.4475 259.65 -912.074
v 61.5759 259.15 -912.02
v 62.8311 258.715 -912.582
v 57.6726 259.889 -912.994
v 59.4988 260.224 -913.6
v 57.771 260.088 -913.98
v 58.9348 260.229 -915.379
v 60.2685 260.05 -912.695
v 61.9412 259.9 -912.74
v 61.3735 260.263 -913.53
v 63.118 259.784 -913.568
v 62.6619 260.259 -914.108
v 61.3414 260.353 -914.633
v 64.1558 255.744 -913.056
v 63.8653 257.592 -913.169
v 65.0047 256.917 -914.93
v 63.633 259.005 -913.682
v 64.2938 259.056 -914.874
v 63.4016 259.913 -914.837
v 62.6909 259.454 -917.345
v 62.7689 258.96 -918.279
v 56.5831 260.138 -916.172
v 55.8044 259.765 -916.272
v 56.6815 260.47 -917.788
v 58.5232 260.305 -917.689
v 60.8359 260.162 -916.983
v 59.9051 260.263 -916.177
v 62.6357 260.205 -915.497
v 61.9156 259.926 -917.142
v 63.4511 258.097 -919.592
v 63.665 258.892 -921.507
v 55.9692 260.862 -921.584
v 58.6068 260.437 -920.543
v 61.5215 259.879 -918.717
v 62.3732 259.448 -919.023
v 60.0446 260.193 -918.969
v 62.0696 259.783 -920.642
v 62.8379 259.153 -920.109
v 60.772 260.175 -920.85
v 64.7393 257.746 -915.632
v 64.9431 256.263 -915.78
v 64.1578 258.553 -916.225
v 64.2061 257.349 -916.76
v 64.0704 255.919 -917.726
v 63.7395 257.222 -917.984
v 63.5873 258.391 -917.216
v 63.4925 257.844 -918.392
v 64.0601 259.356 -915.521
v 63.9207 256.542 -918.888
v 64.0263 257.185 -920.374
v 64.6765 257.691 -922.227
v 49.0133 253.952 -926.059
v 48.3888 254.949 -926.373
v 48.9956 254.424 -927.192
v 51.9853 252.004 -925.399
v 52.295 252.231 -924.229
v 55.4324 252.015 -921.553
v 55.4468 251.366 -923.263
v 55.1736 251.953 -922.511
v 53.5265 252.732 -922.954
v 54.1039 251.966 -923.441
v 54.0695 251.548 -924.248
v 51.6187 254.514 -923.278
v 50.3966 255.21 -923.984
v 51.2911 255.945 -922.989
v 50.0851 253.178 -924.864
v 50.4592 253.844 -924.231
v 50.4385 252.63 -925.341
v 49.1238 254.35 -925.163
v 49.6827 255.81 -924.476
v 52.4729 252.924 -923.471
v 51.0667 252.449 -925.97
v 53.4212 251.949 -926.583
v 54.4988 251.419 -925.255
v 53.6697 252.046 -927.759
v 54.4447 251.753 -928.716
v 54.7423 251.697 -927.236
v 55.6544 251.581 -928.488
v 49.92 253.297 -926.574
v 50.5901 253.536 -927.368
v 52.2126 252.576 -927.263
v 53.5267 252.259 -929
v 50.1238 254.684 -928.449
v 51.2259 253.789 -928.759
v 52.3712 253.873 -929.917
v 52.0337 255.869 -930.594
v 54.7036 253.395 -930.274
v 52.9831 254.258 -930.362
v 55.1897 252.319 -929.629
v 54.9122 254.835 -931.024
v 53.7852 255.579 -931.224
v 58.5879 248.598 -923.597
v 58.4006 248.853 -922.172
v 59.9799 247.989 -923.117
v 62.0531 248.726 -922.906
v 56.581 250.685 -922.352
v 56.8278 250.4 -924.149
v 55.9254 250.998 -924.589
v 57.2389 250.298 -924.684
v 58.735 248.834 -924.069
v 57.4696 250.96 -925.93
v 60.8522 248.702 -923.58
v 59.3965 248.849 -924.069
v 60.7987 249.968 -924.556
v 62.2458 249.927 -923.957
v 61.3743 251.487 -925.57
v 60.1256 250.874 -925.599
v 62.5067 252.358 -925.706
v 56.7632 251.433 -926.613
v 58.5408 251.025 -926.079
v 57.7764 251.533 -926.977
v 58.6661 251.877 -927.521
v 56.4988 251.979 -929.144
v 57.4514 251.768 -928.336
v 59.3983 251.678 -926.784
v 61.2438 252.231 -926.534
v 62.7533 253.184 -926.383
v 61.6264 253.726 -929.41
v 60.0373 252.526 -927.985
v 63.4583 249.937 -922.912
v 65.7241 252.566 -922.664
v 64.6749 251.381 -923.268
v 63.4746 250.926 -924.072
v 64.1925 251.951 -924.141
v 64.8409 252.815 -924.115
v 66.0756 254.346 -922.438
v 66.1931 253.916 -922.718
v 66.0735 255.377 -924.806
v 63.7807 252.681 -925.108
v 64.6975 253.693 -925.192
v 64.8961 254.51 -926.262
v 65.9733 254.613 -924.321
v 63.9957 253.845 -926.151
v 64.0526 254.355 -927.615
v 65.6557 255.291 -926.209
v 64.9996 255.261 -928.083
v 65.5526 256.103 -927.186
v 62.5107 253.503 -927.708
v 63.862 254.654 -929.87
v 59.3582 252.89 -929.601
v 58.4576 252.868 -929.956
v 56.8542 254.951 -931.457
v 56.2327 255.991 -931.801
v 57.2378 253.644 -930.619
v 60.8076 254.034 -930.575
v 63.1854 254.747 -930.719
v 59.7674 254.596 -931.708
v 61.7188 256.092 -933.062
v 62.4517 255.375 -932.053
v 63.7527 255.284 -930.902
v 49.014 256.893 -924.997
v 48.3311 261.625 -923.885
v 48.692 262.486 -923.618
v 48.2287 259.368 -925.172
v 48.5234 260.442 -923.999
v 47.4687 261.049 -925.41
v 47.9075 258.055 -926.365
v 47.7654 257.266 -927.593
v 47.1607 259.016 -927.46
v 48.3415 256.152 -927.952
v 47.5824 258.161 -928.312
v 48.1332 257.934 -929.026
v 46.8901 260.834 -926.586
v 46.5305 260.387 -927.817
v 47.3303 262.35 -925.406
v 46.5676 262.765 -927.995
v 46.6128 260.351 -928.517
v 46.279 262.032 -927.697
v 46.9382 260.94 -929.082
v 46.3809 261.904 -928.467
v 48.2879 263.121 -929.989
v 51.2386 257.802 -922.342
v 50.1998 256.769 -923.747
v 49.575 258.922 -923.667
v 50.5476 259.777 -922.471
v 50.2693 262.465 -923.161
v 52.6117 261.674 -922.61
v 52.6019 262.243 -924.282
v 54.0509 262.252 -925.972
v 55.6451 261.842 -926.077
v 51.9439 263.002 -926.372
v 57.2042 261.268 -925.486
v 53.4734 262.73 -927.669
v 54.8681 262.26 -927.197
v 54.835 262.48 -928.743
v 47.6529 263.023 -925.202
v 48.7866 263.334 -924.411
v 49.4111 263.439 -924.836
v 47.0373 263.164 -926.765
v 48.9417 264.032 -926.34
v 47.3619 263.807 -927.541
v 47.9338 264.152 -927.044
v 47.5383 263.643 -928.858
v 48.0875 264.225 -928.347
v 49.1219 264.452 -929.034
v 50.1584 264.003 -927.399
v 51.0736 263.947 -929.198
v 49.2402 264.45 -928.211
v 51.965 263.346 -928.06
v 48.5443 259.101 -929.894
v 47.7122 259.818 -929.628
v 49.4425 262.069 -930.748
v 48.2516 261.87 -930.236
v 49.1677 256.633 -929.182
v 51.1821 256.817 -930.337
v 50.7228 255.886 -929.706
v 52.5785 257.805 -930.773
v 49.4552 257.438 -929.752
v 51.929 259.336 -930.712
v 54.2315 257.65 -931.233
v 53.5323 259.355 -930.992
v 55.4907 256.819 -931.708
v 55.702 257.561 -931.744
v 48.8164 260.441 -930.372
v 50.0848 259.546 -930.389
v 52.9813 260.879 -930.871
v 51.2303 261.623 -930.911
v 49.5357 263.239 -930.931
v 52.3747 263.127 -930.328
v 50.7009 262.661 -931.096
v 54.3333 260.706 -931.033
v 54.4166 261.945 -930.826
v 55.5871 261.6 -931.148
v 53.1736 263.046 -929.655
v 52.4657 262.31 -930.755
v 54.6393 262.461 -930.452
v 56.41 262.189 -930.907
v 55.1611 259.756 -931.333
v 48.8918 264.112 -929.632
v 50.678 264.138 -930.047
v 49.7549 263.904 -930.503
v 50.9167 263.474 -930.799
v 58.1476 260.516 -922.557
v 55.7679 261.437 -924.211
v 58.3656 261.077 -924.917
v 60.2004 260.456 -922.652
v 62.7142 259.734 -921.597
v 63.2739 259.86 -923.227
v 62.2247 260.297 -923.524
v 61.2636 260.85 -925.759
v 56.3303 262.001 -927.507
v 58.9048 261.774 -927.558
v 58.9308 262.111 -929.453
v 59.4426 261.315 -926.565
v 61.1189 261.209 -927.626
v 62.2968 260.618 -926.539
v 62.3202 260.516 -928.369
v 61.8454 260.559 -930.406
v 63.3242 259.472 -928.478
v 59.7975 261.714 -928.044
v 66.0931 255.7 -923.659
v 64.5878 258.763 -923.475
v 65.5402 257.408 -923.793
v 65.8527 256.788 -925.252
v 64.0656 259.426 -925.3
v 65.5755 257.811 -924.81
v 63.1683 260.085 -925.012
v 65.3928 257.122 -927.187
v 65.1562 258.382 -924.982
v 63.242 260.025 -926.94
v 64.7199 255.945 -929.92
v 64.3108 258.018 -929.528
v 57.5071 257.314 -932.535
v 57.791 258.931 -932.389
v 63.0697 259.329 -930.644
v 62.1819 259.655 -931.75
v 62.4278 258.436 -932.611
v 56.5224 262.383 -929.967
v 57.56 262.031 -931.394
v 58.8803 262.062 -930.767
v 57.7417 262.315 -930.38
v 55.5846 258.462 -931.499
v 57.7131 260.768 -932.098
v 59.4024 261.469 -931.514
v 59.8367 260.337 -932.34
v 60.449 261.596 -929.567
v 60.2309 261.576 -930.865
v 60.8329 260.77 -931.592
v 60.1742 259.369 -932.995
v 61.1929 259.41 -932.597
v 58.8488 256.448 -932.859
v 59.1668 258.364 -933.154
v 58.9832 259.749 -932.657
v 59.1911 255.396 -932.164
v 60.7204 256.65 -933.28
v 59.3414 257.429 -933.379
v 61.5333 257.753 -933.25
v 62.3531 257.001 -933.05
v 60.7679 257.643 -933.571
v 64.8508 257.006 -929.187
v 64.4269 256.54 -930.602
v 63.9809 257.562 -931.085
v 63.0687 256.152 -932.258
v 63.9406 256.361 -931.526
v 63.2577 257.791 -932.247
v 63.2259 258.58 -931.598
vn -0.932329 -0.201383 0.300346
vn -0.935462 -0.334245 0.114853
vn -0.933419 -0.320704 0.160868
vn -0.947303 -0.245462 0.205828
vn -0.898487 -0.380784 0.218461
vn -0.896464 -0.314778 0.311877
vn -0.888487 -0.448012 0.0993742
vn -0.667634 -0.344815 0.659824
vn -0.822909 -0.521585 0.22532
vn -0.83653 -0.414249 0.358628
vn -0.613686 -0.446806 0.650964
vn -0.692927 -0.574147 0.436127
vn -0.283303 -0.251779 0.92539
vn 0.122195 -0.299856 0.946126
vn -0.0599539 -0.172529 0.983178
vn 0.21081 -0.0782283 0.974392
vn -0.199489 -0.778915 0.594555
vn 0.36727 -0.462914 0.806736
vn -0.02102 -0.860392 0.509198
vn -0.397258 -0.646086 0.651735
vn -0.239497 -0.68033 0.692671
vn -0.208966 -0.438889 0.873905
vn -0.19766 -0.801807 0.563947
vn -0.51471 -0.163762 0.841579
vn -0.468029 -0.398777 0.788623
vn -0.747822 -0.500095 0.436654
vn -0.653927 -0.416318 0.63171
vn -0.829962 -0.213542 0.515327
vn -0.0964786 -0.618 0.780236
vn 0.0319375 -0.562611 0.826105
vn -0.0390931 -0.739169 0.672384
vn 0.355372 -0.695566 0.624419
vn 0.228776 -0.880531 0.415124
vn 0.632575 -0.610193 0.476983
vn 0.446754 -0.225818 0.865689
vn 0.678275 -0.365746 0.637317
vn 0.849363 -0.123264 0.513214
vn 0.620583 0.0192058 0.783905
vn 0.708643 -0.0896337 0.69985
vn 0.927524 0.0805439 0.364981
vn 0.96288 -0.0377811 0.267271
vn -0.321556 -0.894571 0.310394
vn -0.41993 -0.907473 0.0123144
vn 0.0871581 -0.995388 0.0400881
vn -0.182565 -0.827044 0.531665
vn -0.150018 -0.880116 0.450434
vn -0.54876 -0.773063 0.318175
vn -0.837754 -0.497229 0.225679
vn -0.532865 -0.700834 0.474222
vn -0.312616 -0.803766 0.506193
vn -0.373199 -0.869115 0.324595
vn -0.0765121 -0.91618 0.393395
vn -0.74562 -0.62719 0.225132
vn -0.0617268 -0.919085 0.389195
vn 0.0474585 -0.952546 0.300674
vn -0.0291471 -0.900728 0.433404
vn 0.103662 -0.945554 0.308515
vn 0.0210196 -0.92722 0.373927
vn -0.706896 -0.692169 0.145606
vn -0.00505353 -0.899955 0.435953
vn -0.572635 -0.807 0.14436
vn -0.709963 -0.704225 -0.00453846
vn -0.800073 -0.591329 0.101061
vn 0.184346 -0.911612 0.367395
vn 0.560386 -0.81893 -0.123782
vn 0.88886 -0.276802 0.365116
vn 0.431352 -0.890462 0.144956
vn 0.328713 -0.900107 0.28593
vn 0.76984 -0.576989 0.272817
vn 0.986025 -0.0957345 0.136345
vn 0.995485 0.0948704 -0.00302754
vn 0.926259 0.196232 -0.321771
vn 0.92966 0.364724 0.0520467
vn 0.878424 0.4247 0.219093
vn 0.965327 0.241869 -0.0981958
vn 0.946965 0.31983 -0.0310838
vn 0.555449 -0.819017 0.143832
vn 0.609272 -0.792152 0.0358082
vn 0.865972 -0.488546 0.106843
vn 0.984199 0.0949468 0.149458
vn 0.640837 -0.761643 -0.0960593
vn 0.739835 -0.627125 -0.243634
vn 0.93003 -0.367025 0.0183471
vn 0.938913 -0.328147 -0.103739
vn 0.841047 0.349987 0.412491
vn 0.902796 0.354656 0.243267
vn 0.857066 0.296813 0.421118
vn 0.965091 0.171291 0.198141
vn -0.811972 -0.00667524 0.583659
vn -0.866807 0.258913 0.426157
vn -0.77648 0.530992 0.339301
vn -0.91235 0.0428554 0.407162
vn -0.952926 -0.0901312 0.289496
vn -0.934752 0.0985072 0.341373
vn -0.834558 0.42657 0.348641
vn -0.913069 -0.204812 0.352644
vn -0.90133 -0.0678307 0.427788
vn -0.784444 0.296318 0.544833
vn -0.608498 0.689336 0.393123
vn -0.76946 -0.292383 0.567841
vn -0.714282 -0.30404 0.630366
vn -0.842093 -0.2646 0.469963
vn -0.744117 -0.391882 0.541035
vn -0.778949 -0.19835 0.594892
vn -0.731042 0.13187 0.669468
vn -0.797887 -0.100958 0.594293
vn -0.59397 0.295091 0.748412
vn -0.595019 0.00110333 0.803711
vn -0.270184 0.550854 0.789659
vn -0.698768 -0.0603356 0.712799
vn -0.485311 0.168422 0.857967
vn -0.381771 0.655679 0.651411
vn -0.384258 0.791077 0.475966
vn -0.211707 0.947193 0.240842
vn -0.0624964 0.968839 0.239677
vn 0.0543909 0.994897 0.0849814
vn -0.118153 0.740612 0.661463
vn 0.0388846 0.931831 0.360803
vn 0.177569 0.943923 0.278348
vn -0.00602795 0.0842368 0.996428
vn -0.312513 -0.0158551 0.949781
vn -0.200163 0.380657 0.902793
vn 0.143933 0.340954 0.928996
vn 0.409747 0.181931 0.893873
vn -0.665994 -0.101077 0.739077
vn -0.550608 0.192936 0.812162
vn -0.722348 0.33714 0.60378
vn -0.559505 0.745246 0.362715
vn -0.394839 0.568712 0.721574
vn 0.424608 -0.0304297 0.904866
vn 0.626139 0.154022 0.764347
vn 0.0306308 0.678861 0.733628
vn 0.344007 0.475484 0.809675
vn 0.598108 0.367341 0.71227
vn -0.33853 0.831259 0.440915
vn -0.0707287 0.987319 0.142119
vn -0.190337 0.972888 0.131383
vn -0.0507508 0.998293 0.0289204
vn -0.0248256 0.911539 0.410464
vn 0.315208 0.748338 0.583639
vn 0.0538989 0.974504 0.217801
vn 0.631788 0.633947 0.446043
vn 0.310751 0.935787 0.16654
vn 0.0178036 0.999841 -0.000890847
vn 0.80117 0.12453 0.585336
vn 0.776321 0.239725 0.582974
vn 0.968967 0.18155 0.167759
vn 0.767765 0.418922 0.48481
vn 0.847454 0.493708 0.195127
vn 0.586368 0.808086 0.0562954
vn 0.60922 0.740261 -0.284369
vn 0.826304 0.550751 -0.117876
vn -0.239466 0.953002 0.185589
vn -0.607241 0.734524 0.302876
vn -0.00307589 0.990848 0.134947
vn 0.0517145 0.997551 0.0471007
vn 0.116092 0.989409 -0.0871381
vn 0.0128133 0.999556 -0.0269194
vn 0.296925 0.939045 -0.173292
vn 0.322031 0.924522 -0.20385
vn 0.876341 0.450725 0.16992
vn 0.739134 0.600499 0.305093
vn 0.131388 0.977561 0.164655
vn 0.108443 0.992605 0.0545443
vn 0.324084 0.94577 -0.0220905
vn 0.599345 0.800041 0.0268369
vn 0.141976 0.989678 0.0195176
vn 0.395895 0.905798 0.150988
vn 0.688193 0.701784 0.184093
vn 0.189455 0.977221 0.0956355
vn 0.928775 0.272648 -0.251077
vn 0.943555 0.143978 -0.298285
vn 0.803379 0.390668 -0.4494
vn 0.868071 0.234696 -0.43746
vn 0.946837 0.219536 -0.235167
vn 0.943136 0.271838 -0.191309
vn 0.802001 0.444314 -0.399224
vn 0.912298 0.400671 -0.0847027
vn 0.731466 0.644536 -0.222556
vn 0.964095 0.254857 0.0746208
vn 0.901082 0.316688 0.296244
vn 0.830464 0.395954 0.391855
vn -0.784024 -0.620042 0.029227
vn -0.930455 -0.351209 0.104429
vn -0.668227 -0.600231 -0.43954
vn -0.312695 -0.949682 -0.0180575
vn -0.399545 -0.779356 0.482669
vn -0.721578 -0.660499 0.207524
vn -0.493467 -0.83543 0.241965
vn -0.613311 -0.701628 0.362724
vn -0.48145 -0.625188 0.614285
vn -0.406186 -0.761344 0.50534
vn -0.3079 -0.923015 0.23074
vn -0.573286 -0.31784 0.755196
vn -0.618932 -0.188364 0.762523
vn -0.659124 -0.266177 0.703353
vn -0.630425 -0.570472 0.526428
vn -0.55155 -0.30623 0.775897
vn -0.537635 -0.83238 0.134504
vn -0.778273 -0.298249 0.552574
vn -0.67759 -0.124653 0.724798
vn -0.475899 -0.519713 0.70952
vn -0.378793 -0.878938 -0.2898
vn -0.278842 -0.939378 -0.199538
vn -0.221317 -0.969395 -0.106264
vn -0.352008 -0.931233 -0.0943207
vn -0.235277 -0.9202 -0.312853
vn -0.188933 -0.97902 -0.0763161
vn -0.0234591 -0.962379 -0.270696
vn -0.514481 -0.769637 -0.378111
vn -0.460356 -0.748401 -0.477459
vn -0.412313 -0.860396 -0.299527
vn -0.391813 -0.79284 -0.466783
vn -0.563738 -0.560393 -0.606761
vn -0.570562 -0.660715 -0.487765
vn -0.439963 -0.528615 -0.725947
vn -0.415359 -0.197836 -0.887884
vn -0.163309 -0.52155 -0.837446
vn -0.285689 -0.442526 -0.850031
vn -0.0838267 -0.698417 -0.710765
vn -0.159485 -0.439654 -0.883894
vn -0.267634 -0.21856 -0.938405
vn -0.48185 -0.826771 -0.290295
vn -0.643861 -0.763961 0.042514
vn 0.0151255 -0.879244 -0.476131
vn 0.487152 -0.790499 -0.371207
vn -0.683666 -0.725258 0.0812559
vn -0.584517 -0.804588 -0.104778
vn -0.364657 -0.925547 -0.101921
vn -0.515725 -0.75979 -0.395912
vn -0.208326 -0.788312 -0.578934
vn -0.194703 -0.8364 -0.512372
vn 0.283853 -0.673868 -0.682151
vn 0.0727239 -0.71002 -0.700417
vn 0.273857 -0.60774 -0.745422
vn 0.40259 -0.611639 -0.681043
vn 0.363218 -0.642983 -0.674273
vn 0.249506 -0.672121 -0.697137
vn 0.439749 -0.609902 -0.659273
vn -0.089205 -0.957225 -0.275252
vn 0.0616242 -0.761727 -0.644961
vn 0.071656 -0.929505 -0.36178
vn 0.232561 -0.905591 -0.354712
vn 0.0919458 -0.822951 -0.560623
vn 0.185522 -0.931874 -0.311759
vn 0.213955 -0.819322 -0.531916
vn 0.397414 -0.752778 -0.524774
vn 0.493403 -0.741221 -0.455132
vn 0.320644 -0.877597 -0.356386
vn 0.327828 -0.862157 -0.386283
vn 0.607983 -0.682233 -0.406097
vn 0.838309 -0.425103 -0.341358
vn 0.694472 -0.538293 -0.47744
vn 0.515722 -0.572777 -0.637148
vn 0.622188 -0.464137 -0.630444
vn 0.676049 -0.485826 -0.554013
vn 0.915398 0.189254 0.355288
vn 0.995174 -0.0972314 0.0132394
vn 0.983776 -0.0684088 -0.165844
vn 0.543038 -0.559294 -0.626339
vn 0.635179 -0.604021 -0.481359
vn 0.628124 -0.708577 -0.321524
vn 0.849528 -0.407805 -0.334659
vn 0.519647 -0.74119 -0.424977
vn 0.547378 -0.806798 -0.222382
vn 0.85498 -0.427377 -0.293867
vn 0.798608 -0.543096 -0.259369
vn 0.962742 -0.0474609 -0.266223
vn 0.435084 -0.850977 -0.294177
vn 0.572768 -0.750814 -0.328961
vn 0.28221 -0.848145 -0.448339
vn 0.114248 -0.783027 -0.611404
vn -0.163488 -0.497144 -0.852127
vn -0.254708 -0.297038 -0.920268
vn -0.0517099 -0.615206 -0.786669
vn 0.243539 -0.824294 -0.511104
vn 0.365919 -0.800878 -0.474023
vn 0.0189165 -0.693773 -0.719945
vn 0.191231 -0.4645 -0.86468
vn 0.333626 -0.702325 -0.628835
vn 0.633939 -0.569106 -0.523679
vn -0.780952 -0.156876 0.60457
vn -0.783131 -0.0332692 0.620966
vn -0.540416 0.426705 0.725171
vn -0.80421 -0.280268 0.524115
vn -0.75017 -0.27856 0.599707
vn -0.852516 -0.193685 0.485491
vn -0.881217 -0.238996 0.407846
vn -0.94831 -0.315775 -0.0315311
vn -0.919277 -0.356242 0.167395
vn -0.773322 -0.444085 -0.452506
vn -0.868048 -0.378444 -0.321361
vn -0.677623 -0.385078 -0.626532
vn -0.889024 -0.19652 0.413541
vn -0.955828 -0.272002 0.111392
vn -0.873303 0.112442 0.474025
vn -0.868017 0.478799 -0.131522
vn -0.895297 -0.264704 -0.358294
vn -0.985704 0.11104 0.126716
vn -0.727413 -0.069483 -0.682673
vn -0.90042 0.109056 -0.421129
vn -0.598767 0.337539 -0.726323
vn -0.71468 -0.220511 0.663782
vn -0.69149 -0.210361 0.691078
vn -0.70276 -0.257034 0.663371
vn -0.639305 -0.195554 0.743672
vn 0.0370625 0.840338 0.540794
vn 0.183892 0.916764 0.354582
vn 0.251977 0.927263 0.27693
vn 0.264386 0.944293 0.195989
vn 0.25325 0.946612 0.199473
vn 0.324451 0.919012 0.223936
vn 0.163124 0.970561 0.177206
vn 0.299897 0.943176 0.143113
vn 0.240563 0.956607 0.164415
vn 0.217086 0.972668 0.0824038
vn -0.713621 0.511242 0.478932
vn -0.230806 0.821253 0.521797
vn 0.197649 0.91645 0.347927
vn -0.808143 0.510678 0.293449
vn 0.0710416 0.954592 0.289324
vn -0.689069 0.723618 0.0395068
vn -0.384643 0.897001 0.217805
vn -0.671694 0.598958 -0.435978
vn -0.422185 0.895027 -0.143829
vn -0.123307 0.97478 -0.186011
vn 0.320947 0.921066 0.220524
vn 0.392214 0.917942 0.05958
vn 0.074944 0.99177 0.103806
vn 0.378911 0.911524 0.159845
vn -0.418099 -0.295078 -0.85914
vn -0.629568 -0.238986 -0.739277
vn -0.308846 -0.0967847 -0.946175
vn -0.537522 0.053751 -0.841535
vn -0.555419 -0.440298 -0.705441
vn -0.373675 -0.17883 -0.910158
vn -0.510805 -0.395262 -0.763443
vn -0.252158 -0.0239824 -0.967389
vn -0.441681 -0.301966 -0.844828
vn -0.16435 -0.0714633 -0.98381
vn -0.281336 0.0586581 -0.957815
vn -0.195748 0.0319975 -0.980132
vn -0.308612 -0.0228733 -0.950913
vn -0.355448 0.133185 -0.925159
vn -0.327696 -0.175218 -0.928393
vn -0.207822 -0.176465 -0.962118
vn -0.0574451 0.0386275 -0.997601
vn -0.02197 -0.108227 -0.993883
vn -0.34765 0.271221 -0.89754
vn 0.329109 0.752852 -0.570001
vn 0.0212276 0.0460865 -0.998712
vn -0.165156 0.127119 -0.978041
vn -0.0681827 0.381736 -0.921753
vn -0.205114 0.348483 -0.914597
vn 0.320927 0.944738 -0.0669112
vn 0.13079 0.262123 -0.95613
vn 0.0994823 0.868926 -0.484841
vn -0.076585 0.848349 -0.523869
vn -0.257211 0.0872117 -0.962412
vn -0.416547 0.753638 -0.508447
vn 0.257325 0.917564 -0.303086
vn -0.186702 0.742122 -0.643737
vn 0.210072 0.563345 -0.79907
vn 0.133726 0.983387 0.122747
vn 0.223352 0.954335 0.19839
vn 0.135877 0.969606 0.203473
vn 0.089951 0.988952 0.117828
vn 0.484889 0.844051 0.229045
vn 0.51623 0.83975 0.168304
vn 0.268674 0.952249 0.145042
vn 0.215844 0.962746 0.162887
vn 0.160334 0.966302 0.20138
vn 0.145403 0.955562 0.256437
vn 0.204751 0.976517 0.0670176
vn 0.166651 0.949449 0.266034
vn 0.364585 0.92619 0.0961769
vn 0.431318 0.901135 0.0438265
vn 0.598431 0.794579 -0.102589
vn 0.610167 0.76173 -0.217861
vn 0.728395 0.663297 -0.171692
vn 0.260084 0.948032 0.183278
vn 0.967197 0.208699 0.144824
vn 0.744388 0.630826 0.218964
vn 0.88299 0.396224 0.251664
vn 0.971248 0.220418 -0.0899601
vn 0.658255 0.752784 -0.0040905
vn 0.884073 0.464573 0.0508567
vn 0.499485 0.864163 0.0611377
vn 0.922381 0.314256 -0.224624
vn 0.777518 0.628651 -0.0162383
vn 0.641587 0.759722 -0.105778
vn 0.900178 -0.234882 -0.366756
vn 0.832778 0.499122 -0.239494
vn -0.385917 -0.019673 -0.922324
vn -0.386402 0.161651 -0.908054
vn 0.730256 0.637525 -0.245539
vn 0.56981 0.643285 -0.511372
vn 0.502713 0.420302 -0.755398
vn 0.0740408 0.997104 -0.0173528
vn -0.0178184 0.767209 -0.64115
vn 0.242473 0.931887 -0.269803
vn 0.090586 0.990467 -0.103777
vn -0.310591 0.117759 -0.943221
vn -0.194222 0.325669 -0.92532
vn 0.230638 0.732239 -0.640806
vn 0.139958 0.583496 -0.799965
vn 0.429574 0.902465 -0.0320022
vn 0.416718 0.85569 -0.306822
vn 0.433744 0.703992 -0.562372
vn 0.0846202 0.449519 -0.889254
vn 0.351325 0.53011 -0.771721
vn -0.236013 -0.425161 -0.873805
vn -0.28377 0.225902 -0.931903
vn -0.176309 0.36184 -0.915416
vn -0.133514 -0.568136 -0.812032
vn -0.00442377 -0.371638 -0.928367
vn -0.256025 -0.0890462 -0.96256
vn 0.324885 0.169855 -0.930376
vn 0.452356 -0.050158 -0.890426
vn 0.156133 0.0296627 -0.987291
vn 0.925798 0.238984 -0.292891
vn 0.907779 0.0817457 -0.411405
vn 0.863768 0.305176 -0.400964
vn 0.581347 -0.374855 -0.722163
vn 0.787384 -0.168225 -0.593066
vn 0.718485 0.24456 -0.65113
vn 0.742076 0.510769 -0.434094

g grp1
usemtl mtl1
f 28//28 1//1 26//26 
f 1//1 28//28 92//92 
f 3//3 48//48 26//26 
f 1//1 3//3 26//26 
f 3//3 4//4 2//2 
f 4//4 3//3 1//1 
f 96//96 4//4 93//93 
f 1//1 93//93 4//4 
f 2//2 48//48 3//3 
f 5//5 2//2 4//4 
f 5//5 7//7 2//2 
f 48//48 2//2 7//7 
f 96//96 6//6 4//4 
f 4//4 6//6 5//5 
f 12//12 191//191 190//190 
f 190//190 188//188 12//12 
f 9//9 7//7 5//5 
f 5//5 10//10 9//9 
f 103//103 10//10 102//102 
f 6//6 102//102 10//10 
f 6//6 10//10 5//5 
f 8//8 11//11 103//103 
f 9//9 10//10 12//12 
f 9//9 12//12 188//188 
f 10//10 103//103 12//12 
f 11//11 191//191 12//12 
f 12//12 103//103 11//11 
f 101//101 8//8 103//103 
f 121//121 24//24 13//13 
f 120//120 121//121 13//13 
f 22//22 29//29 14//14 
f 13//13 22//22 15//15 
f 15//15 22//22 14//14 
f 14//14 16//16 15//15 
f 13//13 15//15 120//120 
f 14//14 130//130 16//16 
f 20//20 49//49 50//50 
f 20//20 50//50 23//23 
f 50//50 45//45 23//23 
f 18//18 31//31 32//32 
f 17//17 45//45 56//56 
f 45//45 17//17 23//23 
f 17//17 56//56 19//19 
f 31//31 17//17 19//19 
f 19//19 32//32 31//31 
f 19//19 56//56 55//55 
f 27//27 20//20 25//25 
f 22//22 25//25 21//21 
f 20//20 21//21 25//25 
f 20//20 23//23 21//21 
f 17//17 21//21 23//23 
f 125//125 25//25 24//24 
f 28//28 27//27 125//125 
f 25//25 125//125 27//27 
f 13//13 25//25 22//22 
f 13//13 24//24 25//25 
f 27//27 28//28 26//26 
f 20//20 27//27 26//26 
f 26//26 49//49 20//20 
f 21//21 17//17 29//29 
f 21//21 29//29 22//22 
f 29//29 17//17 30//30 
f 30//30 17//17 31//31 
f 31//31 18//18 30//30 
f 35//35 30//30 18//18 
f 30//30 14//14 29//29 
f 30//30 35//35 14//14 
f 35//35 130//130 14//14 
f 19//19 33//33 32//32 
f 32//32 33//33 34//34 
f 34//34 36//36 32//32 
f 34//34 66//66 36//36 
f 55//55 33//33 19//19 
f 33//33 68//68 34//34 
f 34//34 68//68 69//69 
f 69//69 66//66 34//34 
f 35//35 18//18 36//36 
f 35//35 36//36 39//39 
f 32//32 36//36 18//18 
f 37//37 39//39 36//36 
f 130//130 35//35 38//38 
f 38//38 35//35 39//39 
f 39//39 37//37 145//145 
f 39//39 145//145 38//38 
f 66//66 37//37 36//36 
f 37//37 41//41 40//40 
f 37//37 66//66 41//41 
f 40//40 41//41 71//71 
f 40//40 145//145 37//37 
f 224//224 43//43 42//42 
f 42//42 61//61 224//224 
f 60//60 42//42 44//44 
f 44//44 64//64 60//60 
f 42//42 43//43 44//44 
f 44//44 67//67 64//64 
f 67//67 44//44 226//226 
f 226//226 65//65 67//67 
f 45//45 50//50 46//46 
f 50//50 51//51 46//46 
f 50//50 49//49 47//47 
f 49//49 48//48 53//53 
f 53//53 47//47 49//49 
f 50//50 47//47 51//51 
f 47//47 59//59 51//51 
f 46//46 51//51 52//52 
f 53//53 59//59 47//47 
f 48//48 7//7 53//53 
f 52//52 54//54 46//46 
f 45//45 46//46 54//54 
f 56//56 54//54 55//55 
f 45//45 54//54 56//56 
f 58//58 52//52 60//60 
f 58//58 54//54 52//52 
f 58//58 55//55 54//54 
f 55//55 58//58 57//57 
f 48//48 49//49 26//26 
f 227//227 61//61 59//59 
f 227//227 59//59 63//63 
f 51//51 42//42 52//52 
f 52//52 42//42 60//60 
f 61//61 42//42 51//51 
f 51//51 59//59 61//61 
f 63//63 53//53 7//7 
f 59//59 53//53 63//63 
f 9//9 63//63 7//7 
f 227//227 62//62 61//61 
f 62//62 224//224 61//61 
f 188//188 227//227 63//63 
f 188//188 63//63 9//9 
f 60//60 64//64 58//58 
f 58//58 64//64 57//57 
f 57//57 64//64 67//67 
f 33//33 55//55 68//68 
f 77//77 69//69 68//68 
f 66//66 69//69 70//70 
f 57//57 68//68 55//55 
f 68//68 57//57 67//67 
f 67//67 77//77 68//68 
f 69//69 77//77 79//79 
f 69//69 79//79 70//70 
f 78//78 79//79 77//77 
f 70//70 79//79 80//80 
f 70//70 80//80 73//73 
f 41//41 66//66 70//70 
f 71//71 41//41 70//70 
f 71//71 70//70 75//75 
f 75//75 72//72 71//71 
f 172//172 175//175 174//174 
f 72//72 172//172 71//71 
f 175//175 172//172 72//72 
f 70//70 73//73 75//75 
f 80//80 74//74 73//73 
f 72//72 75//75 175//175 
f 75//75 73//73 76//76 
f 175//175 75//75 76//76 
f 73//73 86//86 76//76 
f 175//175 76//76 180//180 
f 77//77 67//67 78//78 
f 80//80 79//79 83//83 
f 80//80 83//83 88//88 
f 79//79 78//78 83//83 
f 78//78 81//81 83//83 
f 78//78 67//67 81//81 
f 81//81 67//67 65//65 
f 81//81 65//65 251//251 
f 81//81 251//251 82//82 
f 81//81 82//82 83//83 
f 83//83 84//84 88//88 
f 83//83 82//82 84//84 
f 84//84 82//82 252//252 
f 80//80 88//88 74//74 
f 73//73 74//74 86//86 
f 88//88 85//85 74//74 
f 76//76 86//86 180//180 
f 180//180 86//86 181//181 
f 182//182 181//181 86//86 
f 86//86 74//74 85//85 
f 88//88 84//84 258//258 
f 258//258 87//87 88//88 
f 87//87 85//85 88//88 
f 258//258 84//84 252//252 
f 258//258 257//257 87//87 
f 85//85 182//182 86//86 
f 85//85 87//87 257//257 
f 182//182 85//85 257//257 
f 89//89 92//92 28//28 
f 93//93 1//1 92//92 
f 89//89 90//90 92//92 
f 90//90 91//91 95//95 
f 92//92 94//94 93//93 
f 90//90 94//94 92//92 
f 91//91 154//154 95//95 
f 90//90 95//95 94//94 
f 96//96 97//97 102//102 
f 97//97 96//96 93//93 
f 94//94 97//97 93//93 
f 97//97 98//98 106//106 
f 94//94 98//98 97//97 
f 98//98 94//94 95//95 
f 154//154 99//99 95//95 
f 154//154 114//114 99//99 
f 113//113 98//98 99//99 
f 95//95 99//99 98//98 
f 114//114 113//113 99//99 
f 104//104 303//303 100//100 
f 101//101 100//100 303//303 
f 106//106 110//110 104//104 
f 110//110 303//303 104//104 
f 6//6 96//96 102//102 
f 97//97 106//106 102//102 
f 100//100 103//103 102//102 
f 104//104 102//102 106//106 
f 100//100 102//102 104//104 
f 105//105 106//106 98//98 
f 110//110 106//106 105//105 
f 103//103 100//100 101//101 
f 111//111 108//108 306//306 
f 111//111 109//109 108//108 
f 110//110 107//107 111//111 
f 112//112 117//117 107//107 
f 107//107 117//117 111//111 
f 306//306 110//110 111//111 
f 111//111 117//117 109//109 
f 117//117 307//307 109//109 
f 117//117 308//308 307//307 
f 112//112 105//105 98//98 
f 112//112 98//98 113//113 
f 114//114 115//115 113//113 
f 112//112 107//107 105//105 
f 105//105 107//107 110//110 
f 113//113 118//118 112//112 
f 113//113 115//115 118//118 
f 114//114 116//116 115//115 
f 116//116 114//114 155//155 
f 112//112 118//118 117//117 
f 118//118 119//119 308//308 
f 116//116 163//163 115//115 
f 163//163 118//118 115//115 
f 163//163 119//119 118//118 
f 365//365 119//119 163//163 
f 118//118 308//308 117//117 
f 122//122 126//126 121//121 
f 122//122 121//121 120//120 
f 124//124 120//120 16//16 
f 15//15 16//16 120//120 
f 123//123 120//120 124//124 
f 16//16 130//130 124//124 
f 120//120 123//123 122//122 
f 123//123 124//124 133//133 
f 24//24 126//126 125//125 
f 24//24 121//121 126//126 
f 125//125 89//89 28//28 
f 125//125 126//126 89//89 
f 122//122 129//129 126//126 
f 126//126 129//129 127//127 
f 90//90 89//89 127//127 
f 126//126 127//127 89//89 
f 128//128 127//127 129//129 
f 132//132 129//129 122//122 
f 90//90 127//127 91//91 
f 127//127 128//128 91//91 
f 91//91 128//128 154//154 
f 130//130 131//131 124//124 
f 122//122 123//123 132//132 
f 123//123 133//133 132//132 
f 134//134 124//124 131//131 
f 124//124 134//134 133//133 
f 133//133 134//134 140//140 
f 137//137 128//128 135//135 
f 129//129 135//135 128//128 
f 132//132 135//135 129//129 
f 136//136 137//137 135//135 
f 153//153 128//128 137//137 
f 128//128 153//153 154//154 
f 137//137 138//138 153//153 
f 136//136 138//138 137//137 
f 136//136 144//144 138//138 
f 132//132 139//139 135//135 
f 133//133 140//140 132//132 
f 139//139 132//132 140//140 
f 141//141 136//136 139//139 
f 135//135 139//139 136//136 
f 140//140 141//141 139//139 
f 141//141 144//144 136//136 
f 144//144 158//158 138//138 
f 140//140 143//143 141//141 
f 142//142 143//143 140//140 
f 141//141 143//143 144//144 
f 143//143 150//150 159//159 
f 143//143 159//159 144//144 
f 38//38 131//131 130//130 
f 38//38 145//145 131//131 
f 145//145 146//146 131//131 
f 146//146 134//134 131//131 
f 146//146 148//148 134//134 
f 148//148 142//142 134//134 
f 140//140 134//134 142//142 
f 147//147 146//146 40//40 
f 40//40 146//146 145//145 
f 71//71 147//147 40//40 
f 148//148 146//146 149//149 
f 147//147 149//149 146//146 
f 149//149 147//147 171//171 
f 148//148 150//150 142//142 
f 148//148 149//149 150//150 
f 150//150 143//143 142//142 
f 179//179 150//150 149//149 
f 151//151 177//177 152//152 
f 151//151 152//152 166//166 
f 156//156 153//153 138//138 
f 153//153 156//156 155//155 
f 138//138 158//158 156//156 
f 157//157 156//156 158//158 
f 155//155 114//114 153//153 
f 154//154 153//153 114//114 
f 155//155 156//156 116//116 
f 144//144 157//157 158//158 
f 159//159 157//157 144//144 
f 160//160 157//157 159//159 
f 151//151 160//160 159//159 
f 157//157 165//165 167//167 
f 157//157 160//160 165//165 
f 160//160 151//151 165//165 
f 151//151 166//166 165//165 
f 161//161 169//169 152//152 
f 166//166 152//152 169//169 
f 169//169 161//161 162//162 
f 169//169 162//162 368//368 
f 164//164 116//116 156//156 
f 157//157 167//167 156//156 
f 156//156 167//167 164//164 
f 164//164 163//163 116//116 
f 163//163 164//164 364//364 
f 163//163 364//364 365//365 
f 170//170 164//164 167//167 
f 165//165 170//170 167//167 
f 168//168 165//165 166//166 
f 165//165 168//168 170//170 
f 166//166 169//169 168//168 
f 169//169 368//368 168//168 
f 367//367 164//164 170//170 
f 168//168 370//370 170//170 
f 168//168 368//368 370//370 
f 170//170 370//370 367//367 
f 171//171 172//172 174//174 
f 71//71 172//172 147//147 
f 147//147 172//172 171//171 
f 171//171 179//179 149//149 
f 171//171 173//173 179//179 
f 173//173 174//174 177//177 
f 171//171 174//174 173//173 
f 179//179 177//177 151//151 
f 179//179 173//173 177//177 
f 176//176 174//174 175//175 
f 176//176 175//175 180//180 
f 176//176 177//177 174//174 
f 177//177 176//176 178//178 
f 177//177 178//178 152//152 
f 180//180 178//178 176//176 
f 150//150 179//179 159//159 
f 151//151 159//159 179//179 
f 178//178 180//180 161//161 
f 178//178 161//161 152//152 
f 161//161 180//180 181//181 
f 161//161 181//181 162//162 
f 162//162 181//181 182//182 
f 368//368 162//162 369//369 
f 383//383 369//369 162//162 
f 162//162 182//182 383//383 
f 200//200 184//184 183//183 
f 183//183 184//184 185//185 
f 184//184 291//291 185//185 
f 289//289 291//291 184//184 
f 335//335 185//185 291//291 
f 199//199 186//186 187//187 
f 186//186 199//199 203//203 
f 187//187 193//193 192//192 
f 192//192 189//189 190//190 
f 190//190 189//189 188//188 
f 191//191 187//187 192//192 
f 191//191 192//192 190//190 
f 192//192 193//193 189//189 
f 193//193 186//186 205//205 
f 187//187 186//186 193//193 
f 193//193 229//229 189//189 
f 229//229 193//193 205//205 
f 194//194 202//202 11//11 
f 194//194 198//198 202//202 
f 198//198 194//194 195//195 
f 11//11 8//8 194//194 
f 8//8 196//196 194//194 
f 8//8 101//101 196//196 
f 196//196 195//195 194//194 
f 197//197 198//198 200//200 
f 195//195 200//200 198//198 
f 197//197 183//183 199//199 
f 183//183 197//197 200//200 
f 202//202 197//197 187//187 
f 197//197 202//202 198//198 
f 187//187 197//197 199//199 
f 201//201 200//200 195//195 
f 304//304 201//201 195//195 
f 187//187 191//191 202//202 
f 191//191 11//11 202//202 
f 186//186 203//203 212//212 
f 186//186 212//212 204//204 
f 205//205 186//186 204//204 
f 204//204 212//212 206//206 
f 204//204 206//206 208//208 
f 204//204 208//208 205//205 
f 240//240 205//205 208//208 
f 208//208 206//206 207//207 
f 207//207 206//206 213//213 
f 208//208 209//209 240//240 
f 207//207 209//209 208//208 
f 220//220 207//207 213//213 
f 220//220 209//209 207//207 
f 244//244 209//209 220//220 
f 199//199 183//183 210//210 
f 203//203 199//199 210//210 
f 183//183 185//185 210//210 
f 210//210 185//185 211//211 
f 211//211 203//203 210//210 
f 203//203 211//211 212//212 
f 185//185 214//214 211//211 
f 211//211 215//215 212//212 
f 212//212 215//215 213//213 
f 214//214 215//215 211//211 
f 216//216 213//213 215//215 
f 216//216 215//215 214//214 
f 335//335 214//214 185//185 
f 337//337 214//214 335//335 
f 216//216 214//214 337//337 
f 213//213 206//206 212//212 
f 213//213 216//216 220//220 
f 216//216 337//337 217//217 
f 216//216 217//217 219//219 
f 336//336 217//217 337//337 
f 218//218 220//220 216//216 
f 216//216 219//219 218//218 
f 218//218 219//219 221//221 
f 218//218 221//221 273//273 
f 219//219 217//217 222//222 
f 222//222 221//221 219//219 
f 221//221 222//222 274//274 
f 274//274 222//222 343//343 
f 223//223 43//43 224//224 
f 43//43 223//223 225//225 
f 231//231 234//234 223//223 
f 225//225 223//223 234//234 
f 44//44 43//43 225//225 
f 225//225 226//226 44//44 
f 226//226 225//225 233//233 
f 234//234 233//233 225//225 
f 228//228 227//227 189//189 
f 228//228 62//62 227//227 
f 224//224 62//62 223//223 
f 62//62 228//228 223//223 
f 188//188 189//189 227//227 
f 229//229 228//228 189//189 
f 229//229 230//230 228//228 
f 232//232 230//230 229//229 
f 231//231 223//223 228//228 
f 230//230 231//231 228//228 
f 231//231 230//230 232//232 
f 231//231 232//232 241//241 
f 241//241 234//234 231//231 
f 234//234 241//241 238//238 
f 229//229 205//205 232//232 
f 234//234 235//235 233//233 
f 226//226 251//251 65//65 
f 233//233 236//236 226//226 
f 235//235 236//236 233//233 
f 251//251 226//226 236//236 
f 251//251 236//236 254//254 
f 238//238 235//235 234//234 
f 238//238 237//237 235//235 
f 235//235 237//237 236//236 
f 237//237 239//239 236//236 
f 254//254 236//236 239//239 
f 232//232 205//205 240//240 
f 232//232 240//240 242//242 
f 242//242 240//240 245//245 
f 232//232 242//242 241//241 
f 242//242 246//246 241//241 
f 238//238 241//241 246//246 
f 245//245 243//243 242//242 
f 242//242 243//243 246//246 
f 246//246 243//243 250//250 
f 240//240 209//209 245//245 
f 245//245 209//209 244//244 
f 245//245 244//244 272//272 
f 245//245 250//250 243//243 
f 272//272 271//271 245//245 
f 271//271 250//250 245//245 
f 247//247 238//238 246//246 
f 247//247 237//237 238//238 
f 237//237 247//247 239//239 
f 239//239 247//247 248//248 
f 247//247 269//269 248//248 
f 246//246 250//250 247//247 
f 269//269 247//247 250//250 
f 271//271 249//249 250//250 
f 250//250 249//249 269//269 
f 249//249 270//270 269//269 
f 254//254 253//253 251//251 
f 251//251 253//253 82//82 
f 253//253 254//254 255//255 
f 255//255 256//256 253//253 
f 82//82 253//253 252//252 
f 252//252 253//253 256//256 
f 256//256 263//263 252//252 
f 258//258 252//252 263//263 
f 261//261 263//263 256//256 
f 258//258 382//382 257//257 
f 263//263 259//259 258//258 
f 382//382 258//258 259//259 
f 254//254 260//260 255//255 
f 256//256 255//255 260//260 
f 256//256 260//260 261//261 
f 254//254 239//239 260//260 
f 260//260 239//239 248//248 
f 248//248 264//264 260//260 
f 264//264 261//261 260//260 
f 264//264 262//262 261//261 
f 261//261 262//262 263//263 
f 263//263 262//262 266//266 
f 266//266 259//259 263//263 
f 269//269 264//264 248//248 
f 264//264 269//269 265//265 
f 262//262 264//264 265//265 
f 265//265 267//267 262//262 
f 268//268 259//259 266//266 
f 266//266 262//262 267//267 
f 269//269 270//270 265//265 
f 267//267 265//265 270//270 
f 267//267 270//270 392//392 
f 266//266 267//267 268//268 
f 268//268 267//267 392//392 
f 275//275 244//244 220//220 
f 275//275 272//272 244//244 
f 220//220 218//218 275//275 
f 275//275 218//218 273//273 
f 271//271 272//272 276//276 
f 278//278 276//276 272//272 
f 275//275 278//278 272//272 
f 273//273 221//221 274//274 
f 273//273 415//415 275//275 
f 275//275 415//415 278//278 
f 412//412 273//273 274//274 
f 273//273 412//412 415//415 
f 249//249 271//271 276//276 
f 249//249 276//276 277//277 
f 270//270 249//249 277//277 
f 276//276 278//278 280//280 
f 415//415 279//279 278//278 
f 278//278 279//279 280//280 
f 277//277 276//276 280//280 
f 277//277 280//280 281//281 
f 280//280 424//424 281//281 
f 279//279 424//424 280//280 
f 270//270 277//277 281//281 
f 281//281 392//392 270//270 
f 425//425 392//392 281//281 
f 424//424 425//425 281//281 
f 201//201 282//282 200//200 
f 305//305 285//285 282//282 
f 283//283 286//286 108//108 
f 283//283 108//108 284//284 
f 318//318 317//317 284//284 
f 286//286 285//285 305//305 
f 287//287 286//286 283//283 
f 286//286 287//287 285//285 
f 287//287 296//296 294//294 
f 283//283 296//296 287//287 
f 283//283 284//284 296//296 
f 284//284 317//317 296//296 
f 184//184 288//288 289//289 
f 200//200 282//282 184//184 
f 184//184 282//282 288//288 
f 288//288 285//285 294//294 
f 288//288 282//282 285//285 
f 290//290 289//289 288//288 
f 288//288 294//294 290//290 
f 289//289 292//292 291//291 
f 292//292 289//289 290//290 
f 293//293 291//291 292//292 
f 293//293 335//335 291//291 
f 339//339 335//335 293//293 
f 292//292 290//290 295//295 
f 292//292 298//298 293//293 
f 293//293 298//298 332//332 
f 300//300 332//332 298//298 
f 294//294 295//295 290//290 
f 294//294 299//299 295//295 
f 285//285 287//287 294//294 
f 296//296 317//317 320//320 
f 296//296 299//299 294//294 
f 296//296 320//320 299//299 
f 320//320 297//297 299//299 
f 298//298 292//292 295//295 
f 295//295 299//299 298//298 
f 301//301 298//298 299//299 
f 300//300 298//298 301//301 
f 301//301 299//299 297//297 
f 301//301 297//297 324//324 
f 300//300 301//301 334//334 
f 301//301 302//302 334//334 
f 301//301 324//324 302//302 
f 196//196 304//304 195//195 
f 304//304 196//196 303//303 
f 101//101 303//303 196//196 
f 306//306 305//305 303//303 
f 306//306 108//108 305//305 
f 303//303 305//305 304//304 
f 286//286 305//305 108//108 
f 110//110 306//306 303//303 
f 282//282 201//201 304//304 
f 305//305 282//282 304//304 
f 109//109 284//284 108//108 
f 307//307 284//284 109//109 
f 284//284 307//307 318//318 
f 318//318 307//307 319//319 
f 307//307 309//309 319//319 
f 307//307 308//308 309//309 
f 319//319 312//312 327//327 
f 319//319 309//309 312//312 
f 310//310 312//312 309//309 
f 119//119 309//309 308//308 
f 119//119 365//365 309//309 
f 309//309 365//365 310//310 
f 310//310 365//365 311//311 
f 310//310 314//314 312//312 
f 310//310 315//315 314//314 
f 312//312 314//314 330//330 
f 311//311 315//315 310//310 
f 313//313 372//372 311//311 
f 311//311 372//372 315//315 
f 315//315 372//372 316//316 
f 399//399 316//316 372//372 
f 316//316 314//314 315//315 
f 314//314 316//316 355//355 
f 317//317 318//318 323//323 
f 318//318 321//321 323//323 
f 319//319 321//321 318//318 
f 320//320 322//322 297//297 
f 317//317 323//323 320//320 
f 329//329 323//323 321//321 
f 323//323 322//322 320//320 
f 322//322 324//324 297//297 
f 325//325 324//324 322//322 
f 322//322 323//323 325//325 
f 323//323 329//329 325//325 
f 329//329 326//326 325//325 
f 325//325 360//360 324//324 
f 360//360 325//325 326//326 
f 327//327 321//321 319//319 
f 330//330 327//327 312//312 
f 327//327 329//329 321//321 
f 330//330 328//328 327//327 
f 327//327 328//328 329//329 
f 361//361 326//326 329//329 
f 329//329 328//328 361//361 
f 330//330 355//355 328//328 
f 330//330 314//314 355//355 
f 331//331 339//339 293//293 
f 293//293 332//332 331//331 
f 331//331 332//332 345//345 
f 334//334 332//332 300//300 
f 332//332 334//334 345//345 
f 345//345 334//334 333//333 
f 302//302 333//333 334//334 
f 333//333 302//302 349//349 
f 336//336 337//337 339//339 
f 337//337 335//335 339//339 
f 217//217 336//336 338//338 
f 346//346 336//336 339//339 
f 346//346 339//339 331//331 
f 331//331 345//345 346//346 
f 346//346 340//340 336//336 
f 338//338 336//336 340//340 
f 340//340 342//342 338//338 
f 338//338 341//341 217//217 
f 217//217 341//341 222//222 
f 338//338 342//342 341//341 
f 359//359 341//341 342//342 
f 359//359 403//403 341//341 
f 222//222 341//341 343//343 
f 343//343 341//341 344//344 
f 344//344 341//341 403//403 
f 394//394 344//344 403//403 
f 340//340 346//346 348//348 
f 345//345 333//333 346//346 
f 346//346 333//333 348//348 
f 348//348 333//333 351//351 
f 340//340 348//348 347//347 
f 340//340 347//347 342//342 
f 351//351 333//333 349//349 
f 351//351 349//349 363//363 
f 351//351 356//356 348//348 
f 348//348 356//356 347//347 
f 350//350 356//356 363//363 
f 363//363 356//356 351//351 
f 342//342 347//347 352//352 
f 359//359 342//342 352//352 
f 352//352 347//347 353//353 
f 353//353 354//354 352//352 
f 359//359 352//352 354//354 
f 355//355 357//357 350//350 
f 316//316 357//357 355//355 
f 356//356 353//353 347//347 
f 350//350 357//357 356//356 
f 353//353 356//356 357//357 
f 316//316 399//399 357//357 
f 354//354 353//353 358//358 
f 358//358 353//353 357//357 
f 358//358 357//357 399//399 
f 324//324 360//360 302//302 
f 360//360 362//362 302//302 
f 349//349 302//302 362//362 
f 326//326 362//362 360//360 
f 361//361 362//362 326//326 
f 361//361 363//363 362//362 
f 362//362 363//363 349//349 
f 355//355 350//350 328//328 
f 328//328 350//350 361//361 
f 363//363 361//361 350//350 
f 364//364 366//366 365//365 
f 313//313 365//365 366//366 
f 365//365 313//313 311//311 
f 164//164 367//367 364//364 
f 371//371 364//364 367//367 
f 369//369 370//370 368//368 
f 367//367 370//370 371//371 
f 364//364 371//371 366//366 
f 370//370 369//369 388//388 
f 370//370 377//377 371//371 
f 377//377 370//370 388//388 
f 375//375 313//313 366//366 
f 373//373 372//372 313//313 
f 313//313 375//375 373//373 
f 375//375 381//381 373//373 
f 399//399 372//372 373//373 
f 374//374 373//373 381//381 
f 399//399 373//373 374//374 
f 366//366 371//371 375//375 
f 376//376 375//375 371//371 
f 377//377 388//388 391//391 
f 371//371 377//377 376//376 
f 376//376 381//381 375//375 
f 376//376 378//378 407//407 
f 391//391 380//380 378//378 
f 378//378 377//377 391//391 
f 376//376 377//377 378//378 
f 378//378 380//380 379//379 
f 381//381 407//407 374//374 
f 376//376 407//407 381//381 
f 257//257 384//384 182//182 
f 382//382 384//384 257//257 
f 386//386 369//369 383//383 
f 390//390 386//386 383//383 
f 384//384 383//383 182//182 
f 383//383 384//384 390//390 
f 259//259 385//385 382//382 
f 384//384 382//382 385//385 
f 385//385 387//387 384//384 
f 384//384 387//387 390//390 
f 369//369 386//386 388//388 
f 388//388 386//386 391//391 
f 385//385 259//259 268//268 
f 268//268 389//389 385//385 
f 385//385 389//389 387//387 
f 389//389 393//393 387//387 
f 393//393 390//390 387//387 
f 390//390 391//391 386//386 
f 390//390 393//393 380//380 
f 380//380 391//391 390//390 
f 422//422 421//421 392//392 
f 389//389 268//268 421//421 
f 389//389 421//421 393//393 
f 268//268 392//392 421//421 
f 393//393 396//396 380//380 
f 343//343 344//344 394//394 
f 274//274 343//343 394//394 
f 274//274 394//394 412//412 
f 412//412 394//394 417//417 
f 417//417 394//394 413//413 
f 403//403 395//395 394//394 
f 394//394 395//395 413//413 
f 414//414 413//413 395//395 
f 415//415 416//416 279//279 
f 419//419 424//424 279//279 
f 396//396 427//427 397//397 
f 411//411 398//398 418//418 
f 398//398 427//427 426//426 
f 419//419 398//398 426//426 
f 398//398 411//411 397//397 
f 398//398 397//397 427//427 
f 399//399 402//402 358//358 
f 400//400 358//358 402//402 
f 399//399 374//374 402//402 
f 401//401 402//402 374//374 
f 408//408 405//405 401//401 
f 400//400 402//402 401//401 
f 403//403 359//359 404//404 
f 395//395 403//403 404//404 
f 354//354 404//404 359//359 
f 405//405 406//406 400//400 
f 404//404 400//400 406//406 
f 414//414 404//404 406//406 
f 395//395 404//404 414//414 
f 406//406 410//410 414//414 
f 400//400 404//404 354//354 
f 400//400 354//354 358//358 
f 400//400 401//401 405//405 
f 378//378 379//379 407//407 
f 407//407 379//379 408//408 
f 379//379 409//409 408//408 
f 396//396 379//379 380//380 
f 374//374 407//407 401//401 
f 408//408 401//401 407//407 
f 409//409 405//405 408//408 
f 411//411 406//406 409//409 
f 406//406 411//411 410//410 
f 397//397 409//409 379//379 
f 411//411 409//409 397//397 
f 396//396 397//397 379//379 
f 406//406 405//405 409//409 
f 414//414 410//410 413//413 
f 415//415 412//412 416//416 
f 279//279 416//416 419//419 
f 416//416 412//412 417//417 
f 417//417 420//420 416//416 
f 420//420 418//418 416//416 
f 419//419 416//416 418//418 
f 417//417 413//413 420//420 
f 411//411 418//418 420//420 
f 413//413 410//410 420//420 
f 410//410 411//411 420//420 
f 419//419 418//418 398//398 
f 422//422 392//392 425//425 
f 421//421 422//422 423//423 
f 422//422 425//425 423//423 
f 423//423 393//393 421//421 
f 393//393 423//423 427//427 
f 427//427 396//396 393//393 
f 419//419 425//425 424//424 
f 419//419 426//426 425//425 
f 425//425 426//426 423//423 
f 426//426 427//427 423//423 
