# PIPER geometrical reference model based on a manual segmentation. See the
# documentation for more info.
# Author: CEESAR, SOTON, UCBL-Ifsttar
# Version: 1.0.0
# License: Creative Commons Attribution 4.0 International License.
# (https://creativecommons.org/licenses/by/4.0/)
# 
# This work has received funding from the European Union Seventh Framework
# Program ([FP7/2007-2013]) under grant agreement 605544 [PIPER project]).
# Contributors include Pierre Maillez, Christophe Lecomte (SOTON), Erwan
# Jolivet (CEESAR), Philippe Beillas (UCBL-Ifsttar)
# This work is derived from a CT scan provided by CEESAR under a CCBY-4.0
# License
# 
# wavefront obj file written by the visualization toolkit

mtllib C:/desktop/registration_reference_model/22_REF_LTE635_Assembly_hands_corr/CCTs635_BP044_Thoracic_T08.mtl

v 31.279 125.283 -529.534
v 29.657 123.579 -528.228
v 24.627 124.116 -529.137
v 36.255 91.055 -546.817
v 28.852 125 -530.22
v 26.532 124.168 -530.943
v 40.796 119.789 -530.524
v 37.608 122.579 -530.545
v 38.682 120.619 -529.26
v 17.395 58.378 -569.393
v 34.926 124.303 -529.54
v 34.015 123.153 -528.21
v 39.358 117.989 -529.159
v 39.898 114.898 -529.598
v 36.126 121.368 -528.228
v 39.103 121.082 -531.823
v 35.23 120.818 -533.148
v 37.399 119.514 -533.544
v 41.295 117.422 -531.129
v 39.865 118.745 -532.591
v 41.218 115.286 -532.297
v 39.566 115.706 -534.06
v 35.658 118.989 -535.659
v 28.809 121.6 -527.688
v 19.626 58.277 -569.797
v 27.165 124.116 -528.537
v 24.638 121.966 -527.249
v 25.171 119.803 -527.066
v 21.729 119.516 -526.924
v 33.225 120.645 -527.804
v 32.738 113.886 -528.899
v 29.401 119.187 -527.765
v 24.928 116.674 -527.392
v 28.024 114.291 -528.313
v 32.975 124.889 -531.519
v 32.402 123.703 -532.786
v 30.621 124.713 -531.755
v 16.572 61.567 -572.784
v 29.788 122.856 -533.662
v 26.209 122.508 -533.17
v 23.927 121.559 -532.995
v 24.849 122.219 -536.001
v 31.496 124.552 -546.102
v 29.028 125.203 -545.038
v 26.552 125.143 -544.016
v 26.396 124.645 -546.746
v 24.19 125.775 -545.169
v 34.729 119.045 -537.931
v 38.601 114.232 -536.346
v 35.637 117.728 -540.369
v 34.394 120.094 -543.471
v 35.401 121.67 -545.805
v 36.913 120.087 -547.005
v 36.605 117.444 -544.143
v 29.177 122.723 -535.668
v 30.579 122.205 -538.943
v 32.693 120.914 -539.741
v 28.329 122.779 -539.172
v 23.281 122.398 -540.596
v 25.152 122.635 -542.027
v 32.208 121.663 -542.419
v 30.544 123.27 -544.002
v 27.439 123.895 -542.981
v 33.173 122.845 -544.712
v 28.074 123.085 -541.561
v 40.781 110.299 -529.957
v 37.684 113.949 -529.102
v 27.365 76.934 -554.158
v 39.043 109.276 -529.53
v 20.756 67.883 -565.972
v 41.298 106.03 -530.276
v 15.432 62.641 -570.768
v 38.852 105.49 -529.457
v 41.468 113.377 -531.316
v 41.647 111.177 -531.9
v 40.474 113.045 -533.602
v 41.503 108.528 -532.304
v 39.893 108.564 -533.757
v 39.737 104.938 -534.247
v 38.538 106.415 -536.542
v 32.404 110.496 -528.967
v 31.104 105.667 -528.512
v 19.583 60.249 -572.941
v 24.171 108.819 -527.82
v 37.991 101.869 -529.195
v 39.191 99.336 -529.774
v 34.691 96.666 -527.981
v 37.026 92.099 -528.813
v 40.625 101.616 -530.849
v 18.453 63.527 -573.546
v 41.346 103.371 -532.991
v 39.336 96.259 -530.331
v 39.435 93.32 -532.251
v 40.694 95.899 -534.382
v 40.664 96.565 -536.153
v 32.375 100.454 -528.452
v 28.938 75.084 -553.823
v 28.13 102.393 -527.889
v 26.377 97.472 -527.413
v 25.147 99.734 -527.165
v 21.04 63.02 -571.954
v 29.238 97.773 -527.451
v 33.906 94.447 -528.216
v 28.67 95.914 -528.664
v 24.981 95.845 -528.771
v 29.341 94.497 -532.243
v 21.064 60.496 -571.817
v 25.725 95.648 -531.152
v 27.003 95.337 -533.845
v 24.984 95.525 -534.008
v 7.52299 106.656 -543.271
v 39.018 112.657 -536.526
v 39.508 109.157 -536.288
v 12.077 99.286 -530.717
v 39.125 104.754 -538.509
v 39.722 102.891 -537.287
v 38.752 108.26 -538.366
v 38.082 113.118 -540.039
v 38.416 110.964 -542.386
v 37.642 114.48 -543.399
v 38.318 113.739 -545.25
v 39.227 105.309 -540.77
v 37.98 109.771 -540.252
v 17.139 65.046 -572.59
v 39.456 106.417 -543.532
v 40.241 103.013 -547.191
v 40.87 101.003 -535.607
v 39.299 98.606 -539.409
v 29.727 77.586 -553.059
v 39.027 93.976 -537.309
v 38.698 95.299 -539.731
v 39.038 100.651 -541.831
v 39.891 101.066 -543.978
v 38.924 101.063 -539.948
v 37.349 96.357 -528.589
v 39.27 95.842 -541.395
v 19.61 65.683 -572.415
v 40.844 97.491 -545.21
v 39.927 93.587 -544.29
v 31.145 92.984 -533.189
v 31.925 91.338 -536.507
v 30.518 93.762 -536.493
v 28.681 95.108 -538.369
v 30.782 93.042 -539.773
v 17.497 65.875 -571.171
v 24.426 96.101 -538.29
v 26.286 95.814 -539.973
v 29.961 93.645 -543.394
v 31.245 93.384 -545.524
v 28.131 94.688 -544.484
v 23.212 95.694 -543.099
v 22.874 96.64 -547.25
v 25.774 95.462 -543.687
v 22.446 122.195 -527.939
v 19.438 66.777 -569.952
v 22.616 122.095 -529.654
v 19.819 117.81 -527.037
v 20.662 114.532 -526.865
v 19.391 118.809 -528.534
v 18.971 117.015 -530.65
v 20.586 118.694 -532.404
v 17.001 113.69 -531.278
v 22.321 124.589 -543.632
v 21.857 124.249 -546.319
v 22.026 120.268 -535.023
v 21.431 121.602 -540.487
v 19.188 119.903 -540.894
v 18.494 117.367 -535.705
v 17.856 117.721 -538.298
v 15.662 117.342 -540.208
v 21.714 123.132 -542.385
v 19.502 123.45 -544.612
v 18.153 120.278 -545.966
v 18.415 120.939 -542.615
v 16.586 120.253 -544.45
v 13.573 117.317 -541.287
v 15.235 119.138 -542.731
v 14.532 116.158 -545.541
v 14.275 117.791 -544.478
v 10.974 115.561 -541.524
v 11.886 116.757 -543.351
v 10.37 115.072 -543.974
v 9.12499 113.696 -542.291
v 18.064 113.759 -526.955
v 25.315 112.374 -528.077
v 20.435 109.647 -527.081
v 16.044 111.804 -527.03
v 16.25 113.364 -529.005
v 14.87 110.975 -529.064
v 16.075 108.074 -526.512
v 14.609 109.737 -526.938
v 17.689 111.214 -526.731
v 18.558 101.703 -526.283
v 15.666 103.059 -526.27
v 40.065 105.121 -545.611
v 13.833 104.52 -527.364
v 14.319 108.415 -529.309
v 40.486 98.842 -531.793
v 16.414 111.065 -532.539
v 15.668 109.921 -531.181
v 17.314 115.037 -533.945
v 16.371 114.542 -535.731
v 14.283 106.83 -531.96
v 13.471 105.275 -529.793
v 14.313 107.785 -534.5
v 23.092 101.704 -527.085
v 20.057 57.501 -563.357
v 21.057 97.793 -526.149
v 17.462 66.273 -566.193
v 14.336 100.766 -527.357
v 17.237 98.152 -526.104
v 13.126 100.78 -528.919
v 23.087 96.473 -526.791
v 19.665 95.615 -526.647
v 21.783 58.427 -565.101
v 19.159 92.858 -527.688
v 15.038 97.088 -526.908
v 17.424 93.438 -526.632
v 16.151 90.894 -525.472
v 15.194 93.042 -526.739
v 13.68 94.974 -527.877
v 12.626 102.098 -530.602
v 13.048 103.018 -535.54
v 21.453 94.121 -530.004
v 21.377 94.529 -528.215
v 22.47 94.712 -533.395
v 12.172 97.391 -535.079
v 12.981 95.188 -534.98
v 12.472 96.336 -529.705
v 12.119 99.745 -535.276
v 14.949 114.628 -537.905
v 14.489 109.307 -535.66
v 18.104 57.521 -562.229
v 13.396 113.267 -545.969
v 16.101 114.284 -546.217
v 13.153 114.469 -539.401
v 10.566 113.003 -540.101
v 17.6 58.712 -559.845
v 8.56899 110.86 -540.616
v 12.765 107.584 -537.19
v 11.114 107.941 -538.563
v 8.55099 106.79 -540.775
v 10.548 103.909 -539.766
v 10.854 114.188 -544.965
v 8.09699 111.409 -543.405
v 7.48999 109.149 -541.789
v 10.575 109.863 -545.481
v 8.01699 108.404 -544.646
v 9.12699 103.792 -542.171
v 10.957 106.262 -545.962
v 9.09899 105.133 -544.357
v 9.17399 102.591 -543.964
v 12.783 103.834 -536.96
v 20.308 93.989 -535.954
v 22.054 95.52 -538.298
v 13.34 100.718 -546.915
v 13.327 97.6 -546.452
v 18.01 93.146 -540.067
v 20.672 95.163 -545.665
v 18.417 95.823 -546.67
v 18.234 93.853 -542.383
v 14.469 92.024 -542.419
v 12.289 93.228 -543.718
v 16.42 94.516 -544.147
v 15.559 95.832 -545.557
v 16.205 97.72 -547.168
v 32.127 122.043 -535.267
v 15.464 59.962 -570.229
v 13.037 95.332 -544.868
v 11.552 99.695 -537.484
v 9.98499 99.8 -539.97
v 11.418 96.789 -538.409
v 12.87 93.009 -535.532
v 9.73399 96.456 -540.24
v 10.929 94.261 -539.115
v 12.158 91.701 -538.733
v 9.34499 98.692 -541.341
v 9.82099 99.582 -543.921
v 10.41 101.54 -546.302
v 10.112 94.135 -542.056
v 11.729 91.872 -541.248
v 11.284 98.508 -545.136
v 37.246 86.314 -524.697
v 37.15 84.022 -524.078
v 34.701 83.33 -524.948
v 44.701 81.9 -535.75
v 46.244 79.742 -534.675
v 48.485 77.309 -536.478
v 21.675 72.228 -561.348
v 47.72 75.618 -534.427
v 48.131 71.396 -533.416
v 16.162 58.848 -564.994
v 49.777 74.376 -535.519
v 45.698 73.264 -533.325
v 46.39 81.065 -537.07
v 51.353 75.355 -539.018
v 36.183 122.331 -531.991
v 47.691 79.335 -539.521
v 49.875 76.879 -541.097
v 23.473 68.226 -556.715
v 51.19 72.649 -536.921
v 52.051 72.454 -539.77
v 51.652 70.515 -540.504
v 45.56 80.889 -540.397
v 47.784 77.626 -542.41
v 51.113 74.501 -541.893
v 51.353 72.18 -541.964
v 50.108 70.313 -542.462
v 49.572 73.686 -543.096
v 47.535 70.741 -543.165
v 44.946 71.609 -542.847
v 15.534 61.762 -564.449
v 38.247 86.951 -526.393
v 36.972 88.258 -527.638
v 40.002 85.286 -527.272
v 38.598 91.369 -530.999
v 35.467 89.808 -528.63
v 34.199 92.266 -529.203
v 38.616 87.048 -528.562
v 21.357 59.317 -569.809
v 35.623 87.193 -527.074
v 39.503 85.563 -524.608
v 38.764 83.242 -526.002
v 39.574 82.741 -528.308
v 35.399 85.486 -524.68
v 32.125 82.862 -526.503
v 35.454 82.477 -526.831
v 37.633 81.21 -529.621
v 39.188 91.346 -535.014
v 38.069 89.343 -529.398
v 39.357 86.914 -534.837
v 39.043 89.664 -533.789
v 39.46 84.937 -529.932
v 40.259 84.328 -532.553
v 41.001 80.61 -531.918
v 44.545 79.012 -533.211
v 39.925 82.27 -530.66
v 21.973 61.369 -569.566
v 42.388 82.036 -533.021
v 38.998 86.197 -531.859
v 38.589 79.928 -531.684
v 33.709 85.067 -526.491
v 22.292 74.135 -559.293
v 34.151 87.146 -529.06
v 22.412 63.692 -567.092
v 32.386 92.912 -530.453
v 33.62 90.246 -530.394
v 33.199 88.49 -531.849
v 32.41 90.955 -532.766
v 32.772 89.001 -535.732
v 32.986 87.051 -536.051
v 32.812 86.219 -531.846
v 31.361 84.056 -533.153
v 17.375 65.94 -568.466
v 30.773 82.5 -529.676
v 28.786 81.513 -531.433
v 26.729 80.851 -532.505
v 23.91 80.33 -531.609
v 24.61 81.573 -534.029
v 42.906 78.393 -532.717
v 43.423 73.662 -533.432
v 40.662 77.984 -532.885
v 38.705 77.381 -533.702
v 35.882 78.043 -534
v 41.143 74.09 -534.167
v 39.347 74.718 -535.757
v 32.016 79.753 -528.516
v 30.309 80.948 -528.463
v 29.046 77.823 -530.346
v 33.627 79.316 -530.48
v 34.138 78.168 -533.634
v 31.635 77.217 -531.625
v 27.347 79.458 -530.938
v 22.928 78.388 -530.935
v 18.582 68.269 -565.36
v 25.157 78.762 -532.22
v 27.168 77.508 -532.252
v 29.501 76.172 -532.788
v 25.117 76.456 -534.753
v 38.411 92.409 -537.25
v 37.956 87.901 -538.279
v 39.125 85.98 -537.449
v 38.29 92.556 -540.777
v 37.356 89.193 -539.529
v 21.296 65.677 -568.927
v 34.343 89.069 -540.562
v 24.586 70.083 -553.809
v 19.078 67.31 -567.545
v 35.768 87.411 -539.875
v 41.495 84.268 -535.494
v 42 83.549 -537.789
v 41.323 81.86 -540.88
v 37.46 85.717 -539.523
v 35.507 84.923 -540.457
v 38.037 90.794 -542.815
v 36.169 89.184 -541.418
v 17.976 74.039 -556.396
v 34.727 90.121 -544.055
v 23.531 67.69 -552.919
v 37.691 83.705 -540.981
v 19.243 74.45 -557.7
v 37.216 82.649 -543.247
v 24.32 76.585 -554.783
v 32.869 89.949 -539.176
v 32.707 90.97 -541.653
v 33.627 87.705 -538.54
v 32.363 85.252 -537.18
v 30.208 83.135 -535.756
v 28.186 81.989 -535.313
v 21.823 67.435 -564.02
v 25.491 81.72 -537.925
v 26.448 81.738 -539.296
v 18.217 69.149 -563.103
v 33.87 85.211 -539.605
v 31.494 84.152 -539.871
v 28.329 81.387 -543.164
v 34.386 83.381 -542.868
v 36.969 76.396 -535.646
v 25.23 70.51 -550.47
v 39.682 74.116 -539.114
v 42.909 70.571 -536.183
v 41.606 72.413 -539.34
v 20.405 69.749 -564.13
v 37.713 75.329 -537.951
v 41.915 80.051 -542.662
v 43.196 78.492 -543.495
v 44.766 76.111 -543.734
v 41.263 78.647 -545.425
v 41.259 79.898 -543.771
v 41.974 76.712 -544.717
v 39.644 76.947 -545.951
v 37.742 75.555 -541.708
v 35.003 76.122 -539.832
v 45.121 73.932 -543.555
v 19.394 71.313 -562.022
v 41.538 75.228 -543.655
v 41.839 73.706 -542.068
v 32.09 76.135 -536.823
v 33.934 76.382 -537.242
v 30.444 75.336 -535.86
v 26.949 74.243 -538.031
v 33.729 76.204 -544.88
v 30.464 75.674 -541.439
v 30.392 81.904 -545.359
v 26.426 80.601 -544.381
v 22.389 69.646 -562.118
v 31.129 75.635 -545.463
v 29.346 74.695 -545.641
v 28.148 74.447 -540.071
v 26.696 73.109 -542.79
v 23.716 73.391 -539.171
v 15.708 59.448 -562.532
v 24.155 71.516 -543.1
v 25.448 71.281 -545.102
v 50.18 70.586 -534.408
v 48.413 68.909 -534.574
v 45.536 70.179 -533.544
v 16.204 60.636 -560.927
v 43.69 70.224 -534.618
v 50.736 69.114 -536.718
v 48.807 68.009 -538.468
v 17.608 73.632 -552.253
v 47.969 68.008 -539.689
v 45.574 68.969 -535.86
v 48.318 68.706 -541.961
v 45.283 69.427 -541.054
v 17.525 75.536 -552.449
v 18.42 87.11 -522.95
v 21.446 76.107 -555.976
v 17.27 86.294 -520.275
v 16.042 88.322 -522.543
v 17.457 64.83 -561.554
v 14.248 86.762 -521.265
v 15.092 89.318 -524.695
v 18.557 76.409 -553.186
v 13.675 87.595 -523.77
v 18.91 85.216 -521.972
v 19.971 85.286 -523.944
v 16.476 75.646 -548.076
v 17.853 84.047 -522.193
v 13.138 85.033 -523.113
v 15.155 84.11 -521.485
v 18.934 71.039 -551.089
v 0.460994 73.847 -524.248
v 17.652 89.429 -525.084
v 18.97 87.828 -526.435
v 19.615 91.8 -530.018
v 18.977 89.04 -528.133
v 17.657 61.333 -558.984
v 14.511 90.159 -526.728
v 13.936 87.917 -526.318
v 13.408 92.465 -528.932
v 13.594 88.727 -528.864
v 20.372 85.169 -526.496
v 20.349 82.876 -525.341
v 17.104 82.825 -525.357
v 22.456 81.592 -529.775
v 12.898 85.776 -525.596
v 13.298 83.597 -525.211
v 21.905 58.408 -562.522
v 13.941 82.122 -527.392
v 15.504 81.443 -528.497
v 18.844 89.453 -530.735
v 20.623 93.314 -532.136
v 13.393 91.173 -531.416
v 18.054 90.128 -534.112
v 12.638 88.893 -532.074
v 17.592 87.738 -534.196
v 12.777 89.777 -535.176
v 27.134 74.764 -555.486
v 19.394 86.237 -530.648
v 20.828 83.715 -531.209
v 22.915 81.775 -532.328
v 17.794 85.883 -535.778
v 20.839 83.219 -533.908
v 12.62 86.548 -528
v 11.565 83.764 -527.421
v 9.84999 85.521 -529.868
v 6.83199 84.201 -529.706
v 8.93799 83.887 -528.701
v 6.62999 82.287 -528.15
v 9.31399 81.657 -528.155
v 4.69999 83.912 -528.694
v 4.85799 84.518 -530.863
v 20.004 60.018 -558.834
v 2.69499 85.045 -529.607
v 11.023 87.18 -533.322
v 7.50299 84.919 -532.028
v 7.81999 84.851 -533.819
v 4.31999 83.951 -533.104
v 4.07499 82.851 -534.773
v 1.02699 82.595 -534.018
v 21.946 80.094 -528.336
v 20.633 78.047 -529.376
v 18.828 81.295 -526.884
v 13.641 80.273 -529.449
v 22.308 60.21 -560.707
v 20.097 76.754 -531.441
v 22.851 76.724 -533.361
v 15.934 79.537 -530.608
v 17.883 78.42 -530.456
v 13.393 78.507 -531.299
v 14.92 77.58 -534.101
v 20.257 75.967 -534.647
v 7.76399 77.321 -527.701
v 11.155 80.633 -528.564
v 17.801 63.792 -559.12
v 10.824 77.782 -529.758
v 4.24399 76.799 -526.688
v 2.42799 75.653 -525.405
v 5.85699 78.863 -527.651
v 19.804 62.527 -557.699
v 2.92299 82.199 -527.881
v 6.86299 74.002 -527.316
v 7.14899 73.009 -529.183
v 4.76999 74.8 -525.692
v 3.24799 73.104 -525.073
v 4.32499 71.827 -527.435
v 10.818 76.72 -531.56
v 10.176 76.138 -533.511
v 12.649 77.339 -533.87
v 8.16099 75.393 -535.447
v 22.544 63.326 -559.778
v 7.28999 72.955 -531.874
v 4.32699 71.149 -530.94
v 4.59299 71.666 -534.94
v 2.40799 71.491 -535.856
v 15.725 89.024 -536.944
v 17.449 91.129 -536.915
v 12.662 91.265 -536.815
v 13.86 90.2 -538.229
v 16.561 86.622 -536.85
v 13.309 88.996 -536.888
v 14.615 86.746 -537.911
v 12.396 86.825 -536.967
v 17.255 65.613 -564.173
v 15.994 91.098 -538.938
v 14.072 91.014 -540.163
v 18.256 84.744 -540.052
v 22.883 81.837 -539.763
v 20.905 82.959 -538.952
v 20.454 82.238 -541.437
v 22.572 65.888 -561.109
v 17.38 83.049 -542.378
v 18.169 81.422 -544.939
v 15.833 82.384 -542.879
v 12.967 81.806 -542.272
v 9.27699 83.653 -537.47
v 10.269 85.678 -535.248
v 6.14099 82.163 -537.151
v 12.228 85.419 -538.583
v 13.939 84.297 -540.467
v 10.353 82.527 -541.039
v 17.929 71.419 -558.76
v 9.35199 83.113 -539.659
v 8.62099 80.786 -541.149
v 20.199 75.127 -538.304
v 18.121 67.282 -560.37
v 17.249 77.044 -535.499
v 12.932 77.433 -536.808
v 14.394 77.577 -538.734
v 16.703 76.926 -538.887
v 13.908 78.192 -541.97
v 22.569 74.877 -536.889
v 15.834 78.231 -548.125
v 21.407 80.99 -543.933
v 16.264 80.66 -545.638
v 14.157 79.528 -544.177
v 15.244 77.504 -544.797
v 17.542 75.96 -543.469
v 22.333 72.527 -541.816
v 19.933 73.962 -542.349
v 18.719 74.001 -545.48
v 21.205 71.458 -544.797
v 18.772 72.689 -547.889
v 10.791 77.649 -538.691
v 9.88799 76.844 -536.721
v 11.196 78.856 -540.908
v 4.32799 80.435 -537.774
v 4.83299 78.607 -538.855
v 3.89899 76.851 -538.393
v 6.53099 81.004 -539.881
v 7.46799 78.843 -540.381
v 7.11899 77.345 -538.813
v 6.92599 75.61 -537.143
v 19.067 78.284 -550.545
v 3.73899 73.46 -537.299
v 11.719 80.225 -541.851
v 0.180993 85.27 -530.835
v 1.52699 83.706 -528.438
v -3.67501 82.687 -530.9
v -1.87701 83.565 -529.404
v -1.92401 83.94 -532.319
v 0.876993 80.602 -535.64
v 1.28199 77.303 -527.674
v -2.34501 75.609 -527.608
v 1.55399 79.532 -528.273
v 24.211 68.991 -548.863
v -4.11001 79.781 -530.379
v -1.82601 77.33 -528.519
v -4.20301 75.927 -529.159
v -2.02101 73.787 -525.616
v -0.251006 71.91 -525.201
v -1.52601 71.627 -527.243
v -3.70101 73.07 -528.316
v -2.98701 82.351 -533.036
v -3.98701 79.277 -533.816
v 21.849 62.77 -558.424
v 0.926993 78.442 -536.759
v -4.15601 80.951 -532.308
v -5.07701 79.248 -531.464
v -5.21901 76.65 -531.775
v 1.02099 70.912 -528.262
v -0.965006 71.174 -532.405
v -3.74701 73.64 -530.142
v -3.28001 76.589 -534.037
v 1.52499 70.575 -533.427
v 21.102 64.169 -556.254
v -0.307006 71.858 -535.161
v -2.37101 73.393 -533.569
v -0.566007 76.373 -536.329
v 0.198994 73.304 -536.341
v 19.115 64.967 -557.19
v 34.011 123.584 -547.383
v 39.2 115.929 -547.023
v 39.375 113.043 -546.723
v 39.715 113.811 -549.253
v 37.721 118.064 -545.968
v 38.055 118.369 -548.432
v 35.558 120.604 -548.254
v 38.041 116.003 -549.844
v 18.22 79.522 -547.854
v 36.395 114.332 -550.098
v 19.885 65.967 -554.995
v 29.148 123.554 -547.501
v 28.669 120.992 -548.089
v 32.047 122.995 -548.183
v 34.903 118.947 -549.135
v 24.505 123.342 -547.075
v 22.648 65.183 -557.576
v 31.506 117.943 -548.63
v 40.194 111.512 -548.348
v 40.472 109.97 -549.837
v 39.988 109.972 -547.128
v 38.931 111.572 -550.106
v 40.573 108.003 -551.134
v 36.632 110.848 -550.056
v 41.227 108.031 -549.096
v 40.964 103.868 -549.427
v 41.457 106.316 -549.392
v 26.876 72.798 -554.138
v 32.667 108.5 -548.722
v 38.323 105.655 -551.011
v 39.693 103.777 -551.256
v 37.614 102.558 -550.542
v 27.835 114.527 -547.63
v 18.961 68.319 -555.271
v 21.45 79.582 -547.128
v 25.771 109.606 -547.7
v 29.992 103.245 -548.576
v 39.444 101.822 -549.159
v 40.424 100.231 -546.943
v 39.178 99.393 -548.773
v 25.154 74.151 -557.357
v 35.842 102.463 -550.13
v 22.61 66.045 -555.018
v 37.552 100.255 -549.925
v 41.036 95.826 -545.986
v 39.307 92.515 -546.992
v 39.988 96.085 -548.517
v 37.788 93.443 -548.906
v 23.078 60.007 -563.804
v 34.82 92.439 -548.368
v 35.232 97.369 -550.165
v 36.47 94.699 -549.898
v 32.463 103.276 -549.104
v 25.6 72.283 -556.27
v 30.324 99.374 -548.929
v 26.146 103.249 -548.082
v 25.569 97.424 -548.35
v 31.761 96.985 -549.187
v 31.174 94.969 -548.355
v 28.721 95.104 -547.727
v 33.317 94.265 -549.016
v 24.962 96.199 -546.952
v 19.968 119.256 -546.77
v 20.702 122.118 -546.695
v 25.788 119.465 -547.731
v 22.772 113.954 -546.835
v 21.395 104.949 -547.251
v 18.398 105.645 -546.822
v 14.153 106.016 -546.543
v 23.001 67.469 -550.416
v 22.515 98.952 -548.032
v 20.833 66.907 -552.377
v 20.65 97.394 -547.774
v 17.356 102.02 -547.122
v 18.53 98.579 -547.51
v 12.544 102.934 -546.821
v 23.123 61.462 -563.793
v 37.165 90.111 -544.958
v 38.111 80.658 -547.781
v 39.898 78.525 -547.498
v 22.716 68.895 -547.264
v 35.402 81.875 -545.667
v 36.031 79.986 -548.945
v 37.579 78.137 -548.977
v 37.265 76.211 -544.624
v 34.352 76.664 -548.05
v 35.062 77.871 -549.786
v 33.615 79.969 -548.203
v 20.758 68.917 -549.032
v 29.55 80.604 -548.19
v 32.976 77.754 -549.992
v 23.582 69.783 -559.415
v 31.243 77.232 -550.998
v 29.596 79.284 -550.2
v 24.571 80.384 -545.025
v 27.162 79.582 -549.155
v 24.273 78.791 -549.417
v 25.453 77.519 -553.237
v 21.439 77.469 -553.122
v 30.777 75.825 -549.538
v 27.059 72.606 -548.393
v 29.684 75.26 -551.887
v 20.313 57.847 -560.747
v 38.564 109.423 -550.761
v 50.192 68.595 -540.594
v 17.71 59.123 -571.901
v 19.424 58.13 -560.451
v 29.657 123.579 -528.228
v 18.118 60.556 -572.703
v 17.023 109.919 -526.641
v 40.14 105.888 -529.888
v 26.885 98.109 -527.363
v 11.845 110.398 -545.755
v 26.396 124.645 -546.746
v 38.268 108.363 -550.762
v 23.241 98.226 -547.969
v 50.604 69.11 -540.059
v -3.96301 74.722 -529.677
vn 0.00626498 0.934274 0.3565
vn -0.0417419 0.606545 0.793953
vn -0.38111 0.909566 0.165665
vn 0.0131503 -0.83024 -0.557252
vn -0.190908 0.981607 0.00155056
vn -0.259646 0.905383 -0.335954
vn 0.869072 0.450335 0.204726
vn 0.580166 0.812924 0.0506146
vn 0.558582 0.465604 0.686439
vn -0.361692 -0.917118 -0.167552
vn 0.476475 0.830649 0.288088
vn 0.200194 0.423653 0.883426
vn 0.472581 0.00971872 0.881234
vn 0.572445 -0.00672598 0.819915
vn 0.344236 0.259102 0.902423
vn 0.597254 0.683985 -0.41887
vn 0.397528 0.62911 -0.667977
vn 0.433582 0.534737 -0.725302
vn 0.989963 0.106708 0.0926633
vn 0.637443 0.351477 -0.685661
vn 0.966404 0.106394 -0.233975
vn 0.713508 0.305039 -0.63076
vn 0.643668 0.6393 -0.420698
vn 0.0686765 0.158945 0.984896
vn 0.220817 -0.926816 -0.30373
vn -0.0566186 0.784029 0.618137
vn -0.0475448 0.387191 0.920773
vn 0.106249 0.00720036 0.994313
vn -0.274353 0.262025 0.925243
vn 0.0867249 -0.00261202 0.996229
vn 0.0780984 -0.103334 0.991576
vn 0.100147 -0.0899809 0.990896
vn 0.174378 -0.130208 0.976032
vn 0.138306 -0.103314 0.984986
vn 0.254254 0.87582 -0.410236
vn 0.208843 0.703432 -0.679388
vn -0.132417 0.854354 -0.502539
vn -0.595747 -0.178723 -0.783035
vn -0.0531916 0.91494 -0.40007
vn -0.255689 0.919878 -0.297401
vn -0.550533 0.815192 -0.179934
vn -0.306925 0.947949 0.0847882
vn 0.25515 0.966566 -0.0254701
vn 0.233637 0.96451 0.123024
vn 0.0552016 0.90108 0.430124
vn 0.0250683 0.874823 -0.483794
vn -0.109915 0.991614 -0.067976
vn 0.730011 0.666693 -0.150344
vn 0.843216 0.382053 -0.378184
vn 0.816225 0.576617 0.0359171
vn 0.7127 0.585038 0.387026
vn 0.760476 0.575292 0.30119
vn 0.758017 0.650324 0.049896
vn 0.825858 0.407962 0.389264
vn 0.0622096 0.997034 -0.045311
vn 0.357792 0.933437 -0.0260727
vn 0.637556 0.770085 0.0221841
vn 0.0554292 0.996678 0.059663
vn -0.165693 0.954459 0.248101
vn -0.0609462 0.898674 0.434363
vn 0.505763 0.806462 0.306305
vn 0.345678 0.763175 0.545958
vn 0.109053 0.768362 0.630656
vn 0.48412 0.708547 0.51341
vn 0.0870742 0.956244 0.279311
vn 0.658258 -0.0123576 0.752691
vn 0.145894 -0.0810439 0.985975
vn 0.208143 0.630106 -0.748093
vn 0.182576 -0.0189868 0.983008
vn 0.47305 0.742538 -0.474195
vn 0.796135 -0.0463705 0.60334
vn -0.952965 0.209429 -0.219082
vn 0.221738 0.0156551 0.974981
vn 0.975572 0.132983 0.174858
vn 0.991133 -0.0143069 -0.132101
vn 0.862277 0.0526364 -0.503694
vn 0.950416 0.0505413 -0.306847
vn 0.84581 -0.0164948 -0.533229
vn 0.823621 0.250218 -0.508959
vn 0.98883 0.0449665 -0.142106
vn 0.108915 0.0100379 0.994
vn 0.129444 0.0562006 0.989993
vn 0.279472 -0.446423 -0.85006
vn 0.162282 0.0430152 0.985806
vn 0.310291 0.0250908 0.95031
vn 0.657775 -0.044833 0.751879
vn 0.148825 -0.00661141 0.988841
vn 0.400132 -0.0672945 0.913984
vn 0.822141 -0.143083 0.551009
vn 0.0329931 0.129601 -0.991017
vn 0.987988 0.0429111 -0.148453
vn 0.809325 -0.146312 0.568846
vn 0.941915 -0.223299 0.250865
vn 0.971658 -0.23385 0.0345604
vn 0.949558 -0.202334 -0.239585
vn 0.134866 0.123439 0.983145
vn 0.772058 -0.246909 -0.58563
vn 0.147829 0.0904027 0.984873
vn 0.107455 -0.372766 0.921683
vn 0.153798 0.0633264 0.986071
vn 0.790908 0.13849 -0.596057
vn 0.0537986 -0.160917 0.985501
vn -0.10185 -0.347276 0.932216
vn -0.17582 -0.762288 0.622899
vn 0.248665 -0.876498 0.41221
vn -0.457243 -0.881974 0.11424
vn 0.750572 -0.336589 -0.568638
vn 0.0607364 -0.993585 0.0953932
vn -0.222446 -0.974212 -0.0377934
vn 0.104144 -0.991431 -0.0788558
vn -0.949258 -0.279049 -0.145055
vn 0.936648 0.157483 -0.312874
vn 0.973204 -0.0708803 -0.218747
vn -0.976239 0.0520202 0.210361
vn 0.958566 0.267161 0.0988744
vn 0.938701 0.223781 -0.262226
vn 0.984702 0.0459976 -0.168065
vn 0.960497 0.249916 -0.122425
vn 0.977087 0.144761 0.15603
vn 0.926657 0.346801 0.145035
vn 0.890577 0.21444 0.401108
vn 0.995297 0.0887131 0.0389207
vn 0.994145 0.0985119 -0.0443997
vn -0.560851 0.5575 -0.612079
vn 0.96863 0.116139 0.219698
vn 0.990495 -0.12301 0.0615447
vn 0.957402 0.0632043 -0.281755
vn 0.972968 -0.00182554 -0.230934
vn 0.557912 0.44794 -0.69863
vn 0.874825 -0.350089 -0.334842
vn 0.972434 -0.230207 -0.0371109
vn 0.978822 0.0499731 0.198519
vn 0.956671 0.091398 0.276455
vn 0.989099 0.0339873 -0.143279
vn 0.420472 -0.0444884 0.906214
vn 0.951789 -0.121214 0.281789
vn 0.360818 0.652314 -0.666556
vn 0.975362 0.067562 0.210008
vn 0.911618 -0.366733 0.185635
vn -0.7487 -0.650409 0.128129
vn -0.889403 -0.457035 0.00897213
vn -0.734031 -0.678588 0.0267625
vn -0.461678 -0.886414 0.0335258
vn -0.735638 -0.676652 0.0312914
vn -0.543582 0.807135 -0.230331
vn 0.033461 -0.998396 -0.0456706
vn -0.20701 -0.97721 0.0469835
vn -0.528352 -0.84208 -0.108373
vn -0.465077 -0.818701 -0.336798
vn -0.398671 -0.914303 -0.0714972
vn 0.141823 -0.988013 -0.0609556
vn -0.0238126 -0.727241 -0.685969
vn -0.215601 -0.976294 -0.019148
vn -0.559296 0.680586 0.473277
vn 0.130275 0.959211 -0.250884
vn -0.687132 0.686639 -0.237438
vn -0.466218 0.3141 0.827032
vn 0.0723171 -0.0213128 0.997154
vn -0.794898 0.591846 0.133625
vn -0.803614 0.575873 -0.150249
vn -0.727892 0.68473 -0.0363044
vn -0.915685 0.389953 -0.0972538
vn -0.258024 0.847611 0.463659
vn -0.372062 0.683318 -0.628209
vn -0.601902 0.783214 0.155852
vn -0.494268 0.774576 0.394627
vn -0.528606 0.699287 0.48122
vn -0.705256 0.660554 0.257454
vn -0.609905 0.715067 0.341607
vn -0.455943 0.67582 0.579123
vn -0.292629 0.749878 0.59334
vn -0.638149 0.768805 -0.0412923
vn -0.489461 0.356604 -0.795777
vn -0.525897 0.690459 0.496689
vn -0.66784 0.698895 -0.256001
vn -0.472995 0.701118 0.533581
vn -0.557815 0.797424 0.230124
vn -0.335432 0.3092 -0.889877
vn -0.524595 0.620387 -0.583027
vn -0.636392 0.638238 0.433194
vn -0.629476 0.753625 -0.189233
vn -0.726067 0.536298 -0.430362
vn -0.843068 0.523461 0.12339
vn -0.397483 0.267618 0.877717
vn 0.169954 -0.0511285 0.984125
vn -0.252398 -0.957649 0.138575
vn -0.53777 0.40978 0.736806
vn -0.862177 0.501277 0.0732952
vn -0.896822 0.415375 -0.152228
vn -0.141056 0.0462687 0.98892
vn -0.721023 0.264095 0.640608
vn -0.0140651 0.0643754 0.997827
vn 0.0890401 0.0670264 0.99377
vn -0.284784 -0.00384577 0.958584
vn 0.967332 0.0224052 0.252522
vn -0.790926 0.0692886 0.607977
vn -0.943145 0.29495 -0.153239
vn 0.916546 -0.150517 0.370523
vn -0.927349 0.369524 0.058958
vn -0.886919 0.407408 -0.217699
vn -0.853353 0.478312 0.207378
vn -0.799319 0.42461 0.4252
vn -0.937392 0.346056 -0.0392555
vn -0.968348 0.245828 0.0432589
vn -0.912051 0.312252 0.265823
vn 0.163655 0.106443 0.980758
vn 0.192559 -0.980963 -0.0251495
vn 0.120057 -0.0747073 0.989952
vn -0.871628 0.484366 -0.0751954
vn -0.652758 -0.0847688 0.752809
vn -0.140431 -0.0328292 0.989546
vn -0.863457 0.0247373 0.503816
vn 0.27983 -0.448907 0.848633
vn 0.198101 -0.328928 0.923343
vn 0.628656 -0.767054 -0.128138
vn 0.732992 -0.262415 0.627584
vn -0.50898 0.0355008 0.860046
vn 0.204635 0.0627488 0.976825
vn -0.213139 0.422914 0.880747
vn -0.500065 0.113141 0.858565
vn -0.747061 -0.05104 0.662793
vn -0.971527 0.189469 0.142254
vn -0.955834 0.253795 0.148217
vn 0.565343 -0.814928 0.12759
vn 0.440301 -0.750455 0.492901
vn 0.406884 -0.906184 -0.115223
vn -0.977 -0.17293 0.124762
vn -0.970865 -0.17382 0.164944
vn -0.952538 -0.0940679 0.289522
vn -0.983972 0.134893 0.116633
vn -0.675264 0.470077 0.568371
vn -0.827666 0.344033 0.443407
vn -0.309362 -0.940229 0.142352
vn -0.219297 0.142487 -0.965198
vn -0.14975 0.0833163 -0.985207
vn -0.507869 0.441015 0.739983
vn -0.524348 0.365549 0.769047
vn -0.450748 -0.604234 0.657059
vn -0.743647 0.255919 0.617653
vn -0.759402 0.142557 0.634812
vn -0.600228 0.0445404 0.798588
vn -0.775338 -0.202567 0.598178
vn -0.79059 -0.0360941 0.611281
vn -0.532993 0.329336 -0.779394
vn -0.880978 0.335414 -0.333728
vn -0.956855 0.0757563 0.280516
vn -0.363936 0.137644 -0.921198
vn -0.743237 0.062288 -0.666122
vn -0.956792 -0.189608 0.22045
vn -0.370008 0.063618 -0.926848
vn -0.805565 -0.212827 -0.552964
vn -0.969144 -0.101222 -0.224754
vn -0.870453 0.137353 0.472701
vn 0.609023 -0.770846 -0.186781
vn 0.375234 -0.922626 -0.089218
vn -0.221845 -0.098335 -0.970111
vn -0.38849 -0.347885 -0.85326
vn 0.620548 -0.755254 -0.210977
vn 0.189852 -0.883261 -0.428726
vn -0.103224 -0.648899 -0.75384
vn 0.357037 -0.88682 -0.293386
vn 0.133267 -0.821301 -0.554711
vn -0.321455 -0.597135 -0.734912
vn 0.0546058 -0.77865 -0.625078
vn -0.163944 -0.672857 -0.721378
vn -0.172942 -0.308965 -0.935217
vn 0.418811 0.854012 -0.308643
vn -0.862653 -0.445334 -0.239805
vn -0.246104 -0.474536 -0.845132
vn -0.912906 0.0601882 0.403708
vn -0.86709 0.0236534 0.497589
vn -0.865073 -0.0624885 0.497739
vn -0.969994 -0.0363361 0.2404
vn -0.917299 -0.132706 0.375435
vn -0.885876 -0.254367 0.387972
vn -0.781651 -0.61873 0.0787133
vn -0.992941 -0.0648147 0.0993305
vn -0.875988 -0.254102 -0.409973
vn -0.607949 -0.167004 -0.776214
vn -0.875187 -0.423553 -0.233773
vn -0.576976 -0.793434 -0.193809
vn -0.617126 -0.320031 -0.718844
vn -0.0290441 0.678395 0.734123
vn 0.0801198 -0.390485 0.917116
vn -0.352595 -0.477907 0.804538
vn 0.577175 0.768927 0.274992
vn 0.679007 0.45468 0.576382
vn 0.762261 0.502064 0.408522
vn 0.278217 0.625566 -0.728877
vn 0.548109 0.274324 0.790141
vn 0.275958 -0.0486592 0.959937
vn -0.758223 -0.649665 -0.0550831
vn 0.711015 0.356256 0.606251
vn 0.104489 0.0200008 0.994325
vn 0.688787 0.717721 0.102217
vn 0.8833 0.447968 0.138228
vn 0.351511 0.658908 -0.665042
vn 0.719023 0.690844 -0.0757641
vn 0.698972 0.59741 -0.393117
vn 0.945418 -0.317541 -0.0731601
vn 0.913891 0.110559 0.390614
vn 0.999831 0.0183824 -0.000380138
vn 0.899668 -0.376707 -0.220657
vn 0.445307 0.771903 -0.453725
vn 0.432834 0.506482 -0.745742
vn 0.75228 0.338661 -0.56514
vn 0.785638 -0.0710613 -0.614592
vn 0.478282 -0.389839 -0.786938
vn 0.366244 0.113943 -0.923516
vn -0.0463694 -0.366135 -0.929406
vn -0.380226 -0.455575 -0.80491
vn -0.983868 0.150335 0.0969751
vn 0.418257 0.846706 0.328861
vn 0.256991 0.648817 0.716234
vn 0.978319 0.196739 0.0647005
vn 0.914666 -0.102104 0.391102
vn -0.295836 0.236612 0.925471
vn -0.455965 -0.27357 0.846909
vn 0.84975 0.51044 0.131823
vn 0.734711 -0.595077 -0.325703
vn -0.433311 0.664467 0.608872
vn 0.716988 0.217884 0.66216
vn 0.522945 -0.737247 0.42778
vn 0.784284 -0.556055 0.27514
vn -0.469587 0.41521 0.779159
vn -0.624913 -0.00840287 0.780649
vn 0.13452 -0.834852 0.533784
vn 0.339605 -0.788207 0.513224
vn 0.96758 -0.181203 -0.175939
vn 0.808127 0.243781 0.536191
vn 0.919027 0.391616 -0.0450177
vn 0.998077 -0.0506229 0.0357642
vn 0.963745 0.26628 0.0170594
vn 0.817296 0.472056 0.330438
vn 0.400606 -0.2139 0.890933
vn 0.417584 0.181873 0.890251
vn 0.789094 -0.232204 0.568693
vn 0.958909 -0.0666522 -0.275772
vn 0.625788 0.431861 0.649527
vn 0.925629 0.352606 0.137403
vn 0.142956 -0.649355 0.746928
vn -0.712459 0.512832 0.478963
vn 0.133644 0.757969 -0.638453
vn -0.823241 0.363195 0.436306
vn 0.963177 0.177354 -0.202076
vn -0.62562 -0.584084 0.517151
vn -0.82348 -0.14346 0.548908
vn -0.965112 -0.00356339 0.261813
vn -0.905635 -0.36478 0.216242
vn -0.975314 -0.215009 -0.0503416
vn -0.984444 0.14335 -0.101588
vn -0.924615 0.333315 0.184359
vn -0.751667 0.653687 0.0876905
vn -0.736678 0.673728 -0.0582752
vn -0.729234 0.620822 0.287747
vn -0.597968 0.720359 0.35145
vn -0.257373 0.769652 0.584291
vn 0.638653 0.350366 0.685103
vn 0.188901 0.953389 0.235297
vn 0.155717 -0.0590778 0.986033
vn -0.221872 -0.235134 0.946301
vn -0.0948195 -0.372542 0.923158
vn -0.298454 -0.588849 0.751121
vn -0.0918809 -0.803905 0.587618
vn -0.520053 -0.476104 0.709133
vn -0.618881 -0.707469 0.341284
vn 0.0483025 -0.672299 0.738702
vn -0.648676 0.0228849 0.760721
vn -0.288358 -0.630703 0.720461
vn 0.397623 -0.809052 0.432817
vn 0.290527 -0.868392 0.401857
vn 0.34492 -0.825466 0.446808
vn -0.616423 0.0707816 0.784228
vn 0.584206 -0.546094 0.600403
vn -0.559757 0.711198 -0.425288
vn 0.0587403 -0.402959 0.913331
vn -0.391875 -0.663994 0.636825
vn -0.0169847 -0.89157 0.452564
vn -0.0386425 -0.833062 0.551828
vn 0.928361 -0.229013 -0.292743
vn 0.839264 0.0981708 -0.534789
vn 0.727466 0.540664 -0.422463
vn 0.957095 -0.258722 0.130505
vn 0.847559 -0.37168 -0.37881
vn 0.785246 0.534826 -0.312008
vn -0.514088 -0.706259 -0.486736
vn 0.84851 -0.515561 -0.119276
vn -0.188274 0.908413 -0.373281
vn 0.0780418 -0.190069 -0.978664
vn 0.69113 0.716902 0.091595
vn 0.502277 0.808993 -0.305366
vn 0.328434 0.754911 -0.567663
vn 0.520528 0.398194 -0.755309
vn 0.0277342 0.61526 -0.787836
vn 0.800564 -0.598419 0.0314921
vn 0.245627 -0.878072 -0.410679
vn -0.864863 0.400724 -0.302378
vn -0.370481 -0.864202 -0.340438
vn 0.72638 -0.683099 0.0758142
vn 0.362329 0.727087 -0.583148
vn -0.47578 0.719289 -0.506218
vn 0.313751 0.858314 -0.406027
vn 0.105613 0.81521 -0.569455
vn -0.827913 -0.518071 -0.214852
vn -0.682776 -0.703357 -0.19775
vn -0.857693 -0.112216 -0.501767
vn -0.802019 0.579072 -0.146429
vn -0.591888 0.803674 0.0614527
vn -0.309644 0.939973 0.143425
vn 0.901594 0.305852 -0.305914
vn -0.0257941 0.999582 0.0130872
vn -0.182019 0.978286 -0.0991211
vn -0.837637 0.463713 -0.288676
vn -0.470583 0.619178 -0.628625
vn -0.413257 0.880271 -0.233113
vn -0.370103 0.906662 -0.202455
vn 0.00347261 0.879323 -0.476212
vn -0.356879 -0.809779 0.465721
vn 0.788176 -0.613752 -0.0456715
vn -0.566402 -0.821102 -0.0705692
vn -0.679015 -0.730898 0.0687529
vn -0.693075 -0.690234 -0.207903
vn 0.174678 0.701711 -0.690716
vn -0.462122 -0.879751 0.111722
vn 0.408409 0.719719 -0.561433
vn 0.440317 0.482522 -0.757161
vn 0.195008 0.0754214 -0.977897
vn 0.704345 0.2443 -0.666495
vn 0.555876 0.720909 -0.413875
vn 0.423728 -0.289102 -0.858414
vn 0.329345 -0.72652 -0.603076
vn -0.324749 -0.928414 -0.180515
vn -0.114717 -0.99329 0.0146208
vn -0.089939 -0.196811 -0.976308
vn -0.462349 0.692713 -0.553518
vn -0.0887821 -0.711833 -0.696715
vn -0.473282 -0.694175 -0.542333
vn 0.338082 -0.929144 0.14964
vn 0.0689596 -0.959287 0.273884
vn 0.336662 -0.925113 0.175572
vn 0.14427 -0.931575 0.333698
vn 0.111543 -0.992452 -0.0509587
vn 0.35778 -0.933475 0.0248512
vn -0.178024 0.913846 -0.364957
vn -0.173829 0.962418 -0.208651
vn 0.823356 0.176424 -0.539407
vn 0.341121 -0.939949 -0.0115132
vn 0.569982 -0.820456 0.0444218
vn 0.445218 -0.892139 0.0766032
vn 0.558761 -0.807393 0.189482
vn -0.10279 -0.877313 0.468782
vn -0.907893 -0.379929 0.177156
vn 0.126687 -0.898769 0.41972
vn 0.575881 -0.774857 0.260686
vn 0.688711 -0.179781 0.702393
vn 0.168348 -0.783482 0.598176
vn -0.191059 -0.520848 0.831994
vn -0.898379 -0.0016872 0.439218
vn -0.555989 -0.672935 0.487888
vn 0.742551 -0.611778 0.272664
vn 0.147412 -0.98509 0.0887017
vn -0.970122 -0.242618 2.86894e-005
vn -0.135733 -0.982143 -0.130275
vn -0.338773 -0.921112 0.191795
vn -0.000985507 -0.779271 -0.626687
vn -0.490202 -0.775787 -0.397311
vn -0.907504 0.288264 -0.305517
vn 0.690485 0.591251 0.416716
vn -0.126462 0.8746 -0.468062
vn 0.292462 0.174174 0.940282
vn -0.00504649 0.829427 0.558592
vn -0.943553 0.262643 0.201809
vn -0.592843 0.328604 0.735225
vn -0.4986 0.706624 0.502077
vn -0.551388 0.737452 -0.390046
vn -0.799894 0.549362 0.241602
vn 0.785974 -0.174879 0.593011
vn 0.906475 0.136833 0.399475
vn -0.887394 -0.460772 -0.0148315
vn 0.32138 -0.75136 0.576344
vn -0.900051 -0.216435 0.378238
vn -0.287127 -0.674598 0.680056
vn -0.873879 -0.431217 0.224473
vn -0.142755 0.140633 0.979716
vn 0.589856 0.515002 0.621967
vn 0.892626 0.421994 0.158557
vn 0.904944 -0.420159 0.0674092
vn 0.986412 0.0417763 0.158893
vn -0.592947 -0.127917 0.795016
vn -0.842356 0.248412 0.478254
vn -0.880023 0.439975 0.178835
vn -0.932682 -0.0917345 0.348839
vn -0.922463 0.278374 0.267525
vn 0.926216 0.362622 0.103096
vn 0.659578 -0.425325 0.619722
vn -0.0961991 -0.889326 0.447039
vn 0.870008 0.396469 0.293084
vn -0.945944 0.233412 0.225188
vn -0.628064 -0.652188 0.424484
vn 0.680616 -0.714674 0.161253
vn -0.139151 -0.768737 0.624244
vn -0.0956766 -0.800424 0.59175
vn 0.975288 -0.0808219 -0.205624
vn 0.710382 -0.697818 -0.0916974
vn -0.994783 0.0299283 0.0975205
vn 0.868276 -0.354892 -0.346623
vn -0.852975 0.488063 0.185009
vn 0.894417 0.149922 -0.421357
vn -0.973429 0.21282 -0.0845166
vn 0.628723 0.1164 -0.768869
vn 0.905936 0.378399 -0.189985
vn 0.775894 0.615165 -0.139858
vn 0.61758 0.749078 0.239744
vn 0.726354 0.639917 -0.250831
vn 0.594325 0.802184 -0.0572666
vn -0.774419 0.510664 0.373494
vn -0.58852 -0.00696964 0.808453
vn -0.487914 0.738593 0.465211
vn -0.109024 0.849313 0.516509
vn -0.255636 0.501049 0.826801
vn 0.0457134 0.329542 0.943034
vn 0.00468467 0.00209842 0.999987
vn 0.148878 0.690003 0.70833
vn 0.0346578 0.999244 0.0176191
vn 0.186204 -0.499303 0.846182
vn 0.0766467 0.937762 0.338714
vn -0.737186 0.675501 -0.0159965
vn -0.333369 0.942182 0.0340235
vn -0.372419 0.888195 -0.269098
vn -0.159497 0.898793 -0.408328
vn -0.295464 0.783279 -0.546969
vn -0.157325 0.673446 -0.722301
vn 0.644989 -0.331764 0.688419
vn 0.0896239 -0.746133 0.659737
vn -0.124026 -0.729012 0.673171
vn 0.202803 -0.688192 0.696608
vn 0.819302 -0.374998 0.433728
vn -0.10768 -0.910312 0.399671
vn 0.247723 -0.845746 0.472596
vn -0.174176 -0.768855 0.615243
vn -0.38881 -0.758432 0.523075
vn 0.355164 -0.807718 0.470584
vn -0.0126878 -0.975411 0.220029
vn -0.185476 -0.942577 0.277756
vn 0.394132 0.0439938 0.918001
vn 0.161816 -0.365153 0.916776
vn -0.846283 0.1185 0.519387
vn 0.579292 -0.531833 0.617718
vn 0.0533627 0.54142 0.839057
vn 0.03564 0.563448 0.825382
vn 0.0586986 0.186496 0.980701
vn -0.190803 -0.422662 0.885975
vn -0.0921042 0.159705 0.982859
vn 0.649726 -0.408241 0.641245
vn 0.649447 -0.71879 0.248114
vn 0.405033 0.130433 0.90495
vn 0.35454 -0.372912 0.85746
vn 0.386101 -0.835682 0.390591
vn 0.630622 -0.743192 0.223565
vn 0.560979 -0.816692 -0.135337
vn 0.292941 -0.951585 0.0931233
vn 0.550099 -0.750727 -0.365788
vn 0.97217 -0.127556 0.196506
vn 0.635409 -0.76643 -0.0940186
vn 0.348221 -0.936212 0.0474319
vn 0.43617 -0.82011 -0.370372
vn -0.00151218 -0.783016 -0.622
vn 0.538796 -0.258777 -0.801707
vn 0.709038 -0.611461 -0.351256
vn -0.974461 -0.224396 0.00846054
vn -0.338022 -0.774344 -0.534914
vn 0.627071 0.606049 -0.489372
vn -0.668881 -0.0233793 -0.743002
vn 0.00241842 0.604822 -0.796357
vn -0.579465 0.512977 -0.633305
vn -0.933039 0.355908 0.0526154
vn 0.426456 -0.785938 -0.447702
vn -0.0455795 -0.940694 -0.336181
vn 0.360549 0.816692 -0.450576
vn 0.233961 0.956872 -0.172214
vn 0.53761 0.826061 -0.16911
vn 0.404654 0.838334 -0.36531
vn 0.994133 -0.00210648 -0.108147
vn 0.0816872 0.811859 -0.578111
vn 0.0519844 0.858488 -0.510192
vn -0.195844 0.76695 -0.611091
vn -0.405338 0.470512 -0.783786
vn -0.501334 0.799649 -0.330492
vn -0.630277 0.680849 -0.37309
vn -0.440762 0.772729 -0.456748
vn -0.398332 0.72637 -0.560105
vn -0.170388 0.714343 -0.678735
vn -0.341561 0.540572 -0.768842
vn -0.971662 0.173143 -0.160917
vn -0.458577 0.749013 -0.478212
vn -0.353946 0.133973 -0.925621
vn -0.416483 -0.875823 0.243879
vn -0.986291 0.0613385 0.153193
vn -0.306213 -0.93827 0.16088
vn 0.0980061 -0.992844 -0.0682289
vn -0.167072 -0.980012 -0.108
vn -0.397146 -0.915691 0.0615223
vn -0.542331 -0.800335 -0.25562
vn -0.0932779 -0.894979 0.436248
vn -0.817131 0.30161 -0.491253
vn 0.195369 0.917707 -0.345897
vn -0.369681 0.724537 -0.581706
vn -0.817594 -0.0487355 -0.573729
vn -0.788953 -0.604452 -0.110411
vn -0.616645 -0.770965 0.159256
vn -0.350191 -0.846202 0.401632
vn -0.636986 -0.712982 0.293094
vn -0.725591 -0.63254 0.270946
vn -0.538398 -0.71541 0.445327
vn -0.794989 -0.551409 0.252865
vn 0.0685619 -0.925004 -0.37372
vn 0.295184 -0.902784 -0.312805
vn -0.20587 -0.699837 -0.683993
vn -0.516212 0.503699 -0.692685
vn -0.442808 -0.0249729 -0.896269
vn -0.207901 -0.205716 -0.956273
vn -0.573818 0.417359 -0.704659
vn -0.31793 -0.402524 -0.858426
vn -0.0134761 -0.709585 -0.704491
vn 0.364786 -0.653372 -0.663352
vn -0.256867 0.846919 -0.465561
vn 0.116224 -0.500285 -0.858025
vn -0.456366 -0.167648 -0.873856
vn -0.206973 0.978346 0.00115174
vn -0.176496 0.464512 0.867801
vn -0.827048 0.524874 0.201243
vn -0.505638 0.520616 0.68796
vn -0.439194 0.796803 -0.414986
vn -0.367808 0.516115 -0.773526
vn -0.213982 0.514437 0.830401
vn -0.519004 0.475924 0.710022
vn -0.227201 0.131709 0.9649
vn 0.669457 -0.722338 0.173363
vn -0.703642 0.24572 0.666715
vn -0.331789 0.410894 0.849166
vn -0.815244 0.0777627 0.573873
vn -0.673306 0.103834 0.732037
vn -0.229796 -0.705354 0.670575
vn -0.49707 -0.826728 0.263519
vn -0.850431 -0.479506 0.216428
vn -0.587731 0.5178 -0.621656
vn -0.711605 0.174638 -0.680529
vn 0.687288 -0.456357 0.565131
vn -0.454104 0.254571 -0.853805
vn -0.897035 0.37804 -0.22894
vn -0.959444 0.222664 0.17288
vn -0.97814 -0.162173 -0.130165
vn -0.00783095 -0.982218 0.187581
vn -0.509533 -0.84814 -0.145031
vn -0.839315 -0.536209 -0.0896083
vn -0.702462 -0.19573 -0.684279
vn -0.0428502 -0.984576 -0.169629
vn 0.140745 -0.692617 0.707441
vn -0.511286 -0.64585 -0.566978
vn -0.753584 -0.468382 -0.461226
vn -0.529302 -0.0185463 -0.848231
vn -0.459386 -0.329077 -0.825029
vn -0.801375 -0.26851 0.53451
vn 0.510391 0.78827 -0.343704
vn 0.931999 0.298719 0.205294
vn 0.905152 0.130761 0.404477
vn 0.832254 0.232872 -0.503115
vn 0.806949 0.406693 0.428291
vn 0.740203 0.522689 -0.42296
vn 0.483439 0.554687 -0.677207
vn 0.459184 0.271736 -0.84576
vn -0.129 0.840146 -0.526795
vn -0.0744069 0.0519639 -0.995873
vn -0.569545 -0.601495 0.560198
vn -0.0434324 0.566013 -0.823252
vn -0.143091 0.133624 -0.980647
vn 0.00463582 0.499932 -0.866052
vn 0.0455611 0.266315 -0.962808
vn -0.144909 0.341657 -0.928586
vn 0.914891 -0.366797 0.168627
vn -0.197143 0.0121169 -0.9803
vn 0.981 0.192789 -0.0216977
vn 0.794942 0.418706 -0.439035
vn 0.930718 0.175456 0.320905
vn 0.365896 0.230355 -0.901697
vn 0.526103 0.190415 -0.828829
vn -0.228983 0.0525492 -0.972011
vn 0.974374 0.215417 0.0647345
vn 0.917095 -0.356262 -0.178926
vn 0.993117 -0.0551511 -0.103331
vn 0.751718 -0.596207 -0.281881
vn -0.252554 0.0321758 -0.967048
vn -0.249013 0.024658 -0.968186
vn 0.33176 -0.335061 -0.881856
vn -0.0151162 -0.297604 -0.95457
vn -0.179168 -0.016354 -0.983683
vn -0.926664 -0.28492 0.245185
vn 0.0567645 0.917589 -0.393457
vn -0.146131 0.0657605 -0.987077
vn -0.163191 0.069228 -0.984163
vn 0.724231 -0.388806 -0.56949
vn 0.975978 0.0756102 -0.20433
vn 0.70342 0.000636504 -0.710774
vn 0.646056 0.369695 -0.667786
vn -0.231056 -0.0238224 -0.972649
vn 0.631658 -0.699432 0.334369
vn 0.299567 -0.106332 -0.948131
vn 0.986976 -0.159587 -0.0202365
vn 0.691772 -0.608812 -0.388329
vn 0.728259 -0.133684 -0.672136
vn 0.348015 -0.518287 -0.781194
vn 0.955352 -0.295256 0.0112309
vn -0.299671 -0.692903 -0.655807
vn -0.0894229 -0.0648806 -0.993878
vn 0.0984276 -0.297452 -0.94965
vn -0.238089 0.0721378 -0.968561
vn 0.835783 -0.381787 -0.394595
vn -0.169268 0.0452897 -0.984529
vn -0.131749 0.0736476 -0.988543
vn -0.187302 -0.340087 -0.921552
vn -0.244391 -0.166852 -0.955214
vn -0.319786 -0.585554 -0.744891
vn -0.279945 -0.747741 -0.602092
vn -0.36992 -0.497382 -0.784711
vn -0.224222 -0.876824 -0.425328
vn -0.222241 0.0539526 -0.973498
vn -0.377931 0.291064 -0.878891
vn -0.16133 0.0119077 -0.986829
vn -0.135623 0.00474931 -0.990749
vn -0.135071 0.0825919 -0.987388
vn -0.0902944 0.0794552 -0.992741
vn -0.109556 0.100178 -0.98892
vn 0.321558 -0.908455 0.267039
vn -0.110307 -0.0615045 -0.991993
vn -0.375492 -0.839128 0.393534
vn -0.0658796 -0.350613 -0.9342
vn -0.084297 0.0908475 -0.992291
vn -0.134313 -0.0796804 -0.98773
vn -0.168703 0.0720344 -0.983031
vn 0.999796 0.0195687 -0.00491621
vn 0.325922 -0.900077 -0.289199
vn 0.396522 0.687626 -0.608228
vn 0.728043 -0.0666406 -0.682285
vn -0.0200684 -0.880019 0.474515
vn -0.0230122 0.883261 -0.468316
vn 0.0459095 0.593627 -0.80343
vn 0.412824 -0.309681 -0.856548
vn -0.0280417 -0.97445 -0.222849
vn 0.21606 -0.9106 -0.352316
vn 0.141026 -0.25534 -0.956511
vn -0.00213269 0.753619 -0.657308
vn -0.616815 -0.689474 0.379691
vn -0.0566544 0.887868 -0.456597
vn 0.369644 -0.06097 -0.927171
vn 0.936633 -0.202095 -0.286142
vn 0.735857 -0.0387603 -0.676026
vn 0.139611 0.808474 -0.571733
vn -0.0118763 0.95976 -0.280572
vn -0.182323 0.909109 -0.374539
vn -0.10409 0.934927 -0.33923
vn -0.0328598 0.889068 -0.456595
vn -0.122139 0.901754 -0.414634
vn 0.582473 -0.780691 -0.226379
vn 0.712561 -0.701152 0.0253726
vn 0.794425 -0.546918 -0.264139
vn 0.299655 -0.829308 0.471652
vn -0.0387016 0.227781 -0.972943
vn 0.531517 -0.797247 -0.286157
vn -0.252622 -0.754123 -0.606202
vn -0.275574 -0.957197 0.0885026
vn 0.0209231 0.254837 0.966758
vn -0.231212 -0.423889 -0.875705
vn -0.383944 0.259132 0.886249
vn 0.317491 0.000269027 0.948261
vn 0.0233586 -0.0964391 0.995065
vn -0.231706 0.0527529 -0.971354
vn -0.101704 0.379745 -0.919484
vn -0.288551 0.0817862 -0.953965
vn -0.26665 -0.345127 -0.899881
vn 0.796192 -0.604245 -0.031097
vn -0.644843 0.18969 -0.740402

g grp1
usemtl mtl1
f 714//714 705//705 707//707 
f 36//36 17//17 267//267 
f 764//764 419//419 765//765 
f 3//3 26//26 6//6 
f 36//36 297//297 17//17 
f 6//6 5//5 39//39 
f 97//97 510//510 68//68 
f 239//239 183//183 245//245 
f 445//445 759//759 758//758 
f 443//443 442//442 438//438 
f 1//1 12//12 11//11 
f 725//725 720//720 723//723 
f 186//186 158//158 192//192 
f 40//40 6//6 39//39 
f 297//297 11//11 8//8 
f 197//197 189//189 200//200 
f 3//3 156//156 154//154 
f 36//36 35//35 297//297 
f 236//236 170//170 176//176 
f 673//673 681//681 678//678 
f 191//191 192//192 187//187 
f 24//24 2//2 26//26 
f 48//48 50//50 57//57 
f 149//149 405//405 148//148 
f 37//37 1//1 35//35 
f 467//467 462//462 479//479 
f 6//6 26//26 5//5 
f 267//267 23//23 48//48 
f 688//688 684//684 195//195 
f 297//297 18//18 17//17 
f 710//710 711//711 715//715 
f 688//688 683//683 684//684 
f 29//29 27//27 154//154 
f 66//66 14//14 67//67 
f 8//8 9//9 16//16 
f 203//203 197//197 200//200 
f 675//675 44//44 43//43 
f 677//677 670//670 678//678 
f 669//669 53//53 668//668 
f 20//20 7//7 19//19 
f 8//8 11//11 15//15 
f 14//14 13//13 67//67 
f 610//610 603//603 609//609 
f 446//446 410//410 423//423 
f 7//7 9//9 13//13 
f 708//708 139//139 709//709 
f 121//121 54//54 120//120 
f 297//297 16//16 18//18 
f 53//53 51//51 668//668 
f 74//74 14//14 66//66 
f 74//74 66//66 75//75 
f 26//26 3//3 27//27 
f 15//15 11//11 12//12 
f 28//28 32//32 24//24 
f 1//1 11//11 35//35 
f 41//41 3//3 6//6 
f 156//156 3//3 41//41 
f 32//32 33//33 34//34 
f 30//30 12//12 24//24 
f 712//712 537//537 500//500 
f 81//81 34//34 185//185 
f 24//24 27//27 28//28 
f 24//24 26//26 27//27 
f 30//30 24//24 32//32 
f 32//32 28//28 33//33 
f 189//189 187//187 188//188 
f 29//29 154//154 159//159 
f 30//30 15//15 12//12 
f 300//300 755//755 387//387 
f 297//297 8//8 16//16 
f 158//158 29//29 157//157 
f 69//69 67//67 31//31 
f 79//79 78//78 77//77 
f 410//410 446//446 583//583 
f 162//162 160//160 201//201 
f 67//67 15//15 30//30 
f 29//29 28//28 27//27 
f 78//78 75//75 77//77 
f 67//67 13//13 15//15 
f 516//516 491//491 493//493 
f 623//623 618//618 624//624 
f 84//84 81//81 185//185 
f 605//605 479//479 609//609 
f 2//2 1//1 5//5 
f 155//155 137//137 145//145 
f 267//267 17//17 23//23 
f 42//42 41//41 40//40 
f 41//41 6//6 40//40 
f 13//13 9//9 15//15 
f 2//2 5//5 26//26 
f 55//55 267//267 56//56 
f 176//176 170//170 177//177 
f 122//122 115//115 116//116 
f 62//62 43//43 44//44 
f 728//728 676//676 681//681 
f 167//167 166//166 174//174 
f 664//664 52//52 670//670 
f 7//7 13//13 19//19 
f 51//51 52//52 64//64 
f 54//54 50//50 120//120 
f 61//61 62//62 65//65 
f 669//669 668//668 665//665 
f 671//671 669//669 665//665 
f 50//50 49//49 118//118 
f 51//51 57//57 50//50 
f 48//48 49//49 50//50 
f 22//22 76//76 49//49 
f 5//5 1//1 37//37 
f 39//39 5//5 37//37 
f 163//163 164//164 172//172 
f 430//430 426//426 427//427 
f 20//20 19//19 21//21 
f 132//132 122//122 134//134 
f 58//58 56//56 65//65 
f 90//90 38//38 124//124 
f 668//668 51//51 54//54 
f 62//62 44//44 63//63 
f 62//62 61//61 64//64 
f 675//675 43//43 677//677 
f 172//172 164//164 727//727 
f 711//711 709//709 4//4 
f 111//111 246//246 248//248 
f 120//120 50//50 118//118 
f 23//23 22//22 49//49 
f 121//121 668//668 54//54 
f 47//47 60//60 45//45 
f 231//231 169//169 170//170 
f 43//43 64//64 664//664 
f 62//62 64//64 43//43 
f 34//34 33//33 185//185 
f 138//138 139//139 708//708 
f 157//157 159//159 188//188 
f 365//365 362//362 363//363 
f 158//158 28//28 29//29 
f 154//154 27//27 3//3 
f 22//22 20//20 21//21 
f 155//155 145//145 354//354 
f 171//171 60//60 163//163 
f 37//37 35//35 36//36 
f 166//166 59//59 171//171 
f 174//174 166//166 171//171 
f 157//157 29//29 159//159 
f 63//63 45//45 60//60 
f 39//39 37//37 36//36 
f 65//65 56//56 61//61 
f 55//55 58//58 42//42 
f 22//22 21//21 76//76 
f 46//46 45//45 44//44 
f 45//45 63//63 44//44 
f 55//55 40//40 39//39 
f 38//38 268//268 72//72 
f 39//39 36//36 267//267 
f 39//39 267//267 55//55 
f 74//74 75//75 76//76 
f 9//9 8//8 15//15 
f 18//18 20//20 22//22 
f 135//135 86//86 85//85 
f 16//16 7//7 20//20 
f 18//18 16//16 20//20 
f 19//19 13//13 14//14 
f 21//21 19//19 14//14 
f 658//658 648//648 680//680 
f 16//16 9//9 7//7 
f 73//73 69//69 81//81 
f 537//537 712//712 740//740 
f 89//89 71//71 85//85 
f 592//592 574//574 579//579 
f 112//112 49//49 76//76 
f 347//347 317//317 318//318 
f 82//82 81//81 84//84 
f 238//238 233//233 766//766 
f 403//403 761//761 68//68 
f 38//38 769//769 268//268 
f 48//48 57//57 267//267 
f 297//297 35//35 11//11 
f 23//23 17//17 18//18 
f 112//112 76//76 78//78 
f 82//82 84//84 98//98 
f 702//702 133//133 138//138 
f 23//23 18//18 22//22 
f 134//134 127//127 128//128 
f 80//80 115//115 117//117 
f 54//54 51//51 50//50 
f 127//127 116//116 91//91 
f 69//69 66//66 67//67 
f 69//69 31//31 81//81 
f 91//91 77//77 71//71 
f 83//83 38//38 90//90 
f 67//67 30//30 32//32 
f 194//194 190//190 196//196 
f 25//25 10//10 769//769 
f 338//338 320//320 107//107 
f 206//206 84//84 193//193 
f 34//34 31//31 32//32 
f 100//100 102//102 98//98 
f 569//569 254//254 504//504 
f 193//193 190//190 194//194 
f 355//355 342//342 353//353 
f 66//66 71//71 77//77 
f 71//71 73//73 85//85 
f 66//66 69//69 71//71 
f 127//127 91//91 94//94 
f 21//21 14//14 74//74 
f 75//75 66//66 77//77 
f 403//403 68//68 510//510 
f 376//376 358//358 374//374 
f 76//76 21//21 74//74 
f 338//338 101//101 345//345 
f 356//356 373//373 368//368 
f 96//96 85//85 73//73 
f 138//138 132//132 136//136 
f 347//347 318//318 346//346 
f 492//492 220//220 221//221 
f 83//83 90//90 101//101 
f 404//404 141//141 144//144 
f 398//398 386//386 405//405 
f 101//101 90//90 137//137 
f 680//680 563//563 583//583 
f 131//131 128//128 95//95 
f 449//449 438//438 440//440 
f 134//134 122//122 116//116 
f 134//134 128//128 132//132 
f 144//144 141//141 142//142 
f 98//98 84//84 206//206 
f 106//106 109//109 143//143 
f 125//125 122//122 132//132 
f 106//106 143//143 142//142 
f 133//133 125//125 132//132 
f 139//139 138//138 136//136 
f 320//320 25//25 83//83 
f 263//263 282//282 269//269 
f 226//226 504//504 254//254 
f 87//87 85//85 96//96 
f 320//320 83//83 107//107 
f 96//96 82//82 98//98 
f 87//87 96//96 102//102 
f 225//225 216//216 224//224 
f 107//107 101//101 338//338 
f 348//348 347//347 349//349 
f 350//350 348//348 349//349 
f 141//141 350//350 349//349 
f 94//94 91//91 198//198 
f 89//89 86//86 198//198 
f 98//98 102//102 96//96 
f 96//96 73//73 82//82 
f 356//356 355//355 353//353 
f 73//73 81//81 82//82 
f 369//369 367//367 368//368 
f 91//91 89//89 198//198 
f 359//359 411//411 580//580 
f 423//423 70//70 375//375 
f 107//107 83//83 101//101 
f 109//109 106//106 108//108 
f 216//216 485//485 488//488 
f 105//105 99//99 213//213 
f 103//103 87//87 102//102 
f 103//103 102//102 104//104 
f 406//406 350//350 404//404 
f 226//226 110//110 108//108 
f 263//263 281//281 280//280 
f 48//48 23//23 49//49 
f 119//119 118//118 123//123 
f 268//268 10//10 233//233 
f 123//123 113//113 117//117 
f 708//708 702//702 138//138 
f 282//282 278//278 279//279 
f 130//130 94//94 329//329 
f 115//115 80//80 116//116 
f 710//710 709//709 711//711 
f 122//122 117//117 115//115 
f 91//91 116//116 79//79 
f 125//125 684//684 121//121 
f 685//685 667//667 682//682 
f 64//64 61//61 51//51 
f 666//666 121//121 684//684 
f 112//112 78//78 113//113 
f 664//664 64//64 52//52 
f 120//120 118//118 119//119 
f 678//678 676//676 677//677 
f 80//80 79//79 116//116 
f 78//78 79//79 80//80 
f 121//121 120//120 119//119 
f 117//117 113//113 80//80 
f 396//396 389//389 386//386 
f 489//489 458//458 238//238 
f 113//113 78//78 80//80 
f 131//131 95//95 130//130 
f 594//594 413//413 598//598 
f 695//695 693//693 694//694 
f 705//705 695//695 707//707 
f 709//709 710//710 708//708 
f 381//381 329//329 332//332 
f 130//130 329//329 380//380 
f 131//131 380//380 383//383 
f 389//389 384//384 381//381 
f 383//383 136//136 131//131 
f 176//176 177//177 181//181 
f 718//718 716//716 714//714 
f 132//132 128//128 136//136 
f 95//95 94//94 130//130 
f 147//147 143//143 146//146 
f 139//139 395//395 709//709 
f 92//92 93//93 198//198 
f 131//131 136//136 128//128 
f 329//329 93//93 332//332 
f 198//198 86//86 92//92 
f 131//131 130//130 380//380 
f 398//398 396//396 386//386 
f 395//395 396//396 741//741 
f 94//94 93//93 329//329 
f 116//116 127//127 134//134 
f 85//85 86//86 89//89 
f 133//133 132//132 138//138 
f 91//91 71//71 89//89 
f 697//697 663//663 674//674 
f 703//703 710//710 707//707 
f 151//151 147//147 146//146 
f 395//395 139//139 383//383 
f 139//139 136//136 383//383 
f 748//748 433//433 442//442 
f 4//4 741//741 398//398 
f 383//383 380//380 384//384 
f 395//395 383//383 384//384 
f 407//407 351//351 406//406 
f 713//713 398//398 724//724 
f 101//101 137//137 385//385 
f 331//331 330//330 340//340 
f 317//317 88//88 318//318 
f 755//755 300//300 583//583 
f 152//152 259//259 736//736 
f 406//406 386//386 389//389 
f 149//149 722//722 724//724 
f 573//573 571//571 568//568 
f 149//149 724//724 398//398 
f 404//404 350//350 141//141 
f 226//226 255//255 110//110 
f 109//109 108//108 110//110 
f 272//272 274//274 275//275 
f 224//224 216//216 487//487 
f 146//146 109//109 110//110 
f 259//259 261//261 264//264 
f 736//736 259//259 260//260 
f 213//213 208//208 214//214 
f 492//492 229//229 505//505 
f 144//144 405//405 404//404 
f 276//276 281//281 578//578 
f 724//724 715//715 713//713 
f 614//614 613//613 615//615 
f 715//715 711//711 713//713 
f 265//265 257//257 266//266 
f 573//573 509//509 570//570 
f 509//509 507//507 505//505 
f 739//739 732//732 737//737 
f 281//281 263//263 262//262 
f 509//509 273//273 570//570 
f 273//273 228//228 272//272 
f 228//228 227//227 272//272 
f 738//738 734//734 736//736 
f 266//266 260//260 265//265 
f 239//239 245//245 246//246 
f 184//184 158//158 157//157 
f 242//242 239//239 246//246 
f 245//245 248//248 246//246 
f 215//215 320//320 712//712 
f 184//184 157//157 188//188 
f 188//188 159//159 160//160 
f 268//268 769//769 10//10 
f 185//185 158//158 186//186 
f 161//161 156//156 41//41 
f 162//162 188//188 160//160 
f 200//200 188//188 162//162 
f 201//201 161//161 168//168 
f 165//165 41//41 42//42 
f 202//202 201//201 168//168 
f 161//161 165//165 168//168 
f 161//161 41//41 165//165 
f 159//159 154//154 156//156 
f 160//160 159//159 156//156 
f 199//199 200//200 162//162 
f 108//108 104//104 105//105 
f 568//568 569//569 506//506 
f 234//234 235//235 732//732 
f 52//52 51//51 53//53 
f 552//552 525//525 648//648 
f 664//664 670//670 677//677 
f 675//675 677//677 676//676 
f 58//58 55//55 56//56 
f 42//42 40//40 55//55 
f 56//56 267//267 57//57 
f 247//247 248//248 245//245 
f 458//458 452//452 238//238 
f 60//60 58//58 65//65 
f 270//270 223//223 253//253 
f 160//160 156//156 161//161 
f 181//181 179//179 244//244 
f 244//244 183//183 182//182 
f 239//239 237//237 183//183 
f 388//388 155//155 354//354 
f 388//388 209//209 375//375 
f 201//201 160//160 161//161 
f 726//726 729//729 235//235 
f 410//410 70//70 423//423 
f 500//500 215//215 712//712 
f 65//65 63//63 60//60 
f 475//475 467//467 626//626 
f 172//172 727//727 173//173 
f 180//180 176//176 181//181 
f 175//175 172//172 173//173 
f 42//42 58//58 59//59 
f 165//165 42//42 166//166 
f 181//181 177//177 179//179 
f 180//180 236//236 176//176 
f 256//256 257//257 282//282 
f 479//479 462//462 615//615 
f 594//594 435//435 413//413 
f 183//183 180//180 182//182 
f 547//547 312//312 458//458 
f 279//279 256//256 282//282 
f 166//166 42//42 59//59 
f 729//729 726//726 728//728 
f 178//178 173//173 726//726 
f 279//279 250//250 739//739 
f 178//178 175//175 173//173 
f 165//165 166//166 169//169 
f 177//177 170//170 174//174 
f 177//177 174//174 175//175 
f 199//199 162//162 201//201 
f 232//232 199//199 201//201 
f 31//31 67//67 32//32 
f 547//547 458//458 489//489 
f 33//33 28//28 158//158 
f 81//81 31//31 34//34 
f 197//197 191//191 189//189 
f 191//191 187//187 189//189 
f 104//104 102//102 99//99 
f 185//185 33//33 158//158 
f 188//188 200//200 189//189 
f 204//204 191//191 197//197 
f 222//222 204//204 223//223 
f 190//190 193//193 192//192 
f 145//145 124//124 72//72 
f 473//473 471//471 476//476 
f 270//270 243//243 271//271 
f 207//207 215//215 500//500 
f 222//222 114//114 212//212 
f 481//481 473//473 476//476 
f 473//473 470//470 471//471 
f 193//193 84//84 192//192 
f 84//84 186//186 192//192 
f 232//232 201//201 202//202 
f 196//196 190//190 191//191 
f 241//241 237//237 239//239 
f 223//223 203//203 205//205 
f 716//716 705//705 714//714 
f 242//242 246//246 111//111 
f 204//204 197//197 203//203 
f 204//204 203//203 223//223 
f 230//230 222//222 223//223 
f 104//104 99//99 105//105 
f 192//192 158//158 184//184 
f 205//205 200//200 199//199 
f 578//578 571//571 276//276 
f 506//506 508//508 568//568 
f 192//192 184//184 187//187 
f 577//577 568//568 571//571 
f 569//569 504//504 506//506 
f 203//203 200//200 205//205 
f 578//578 577//577 571//571 
f 272//272 270//270 271//271 
f 253//253 205//205 240//240 
f 504//504 487//487 506//506 
f 212//212 196//196 222//222 
f 224//224 108//108 105//105 
f 225//225 214//214 216//216 
f 498//498 481//481 476//476 
f 223//223 205//205 253//253 
f 312//312 72//72 268//268 
f 226//226 108//108 224//224 
f 226//226 224//224 504//504 
f 485//485 474//474 471//471 
f 218//218 214//214 211//211 
f 220//220 211//211 217//217 
f 658//658 552//552 648//648 
f 219//219 218//218 220//220 
f 221//221 220//220 217//217 
f 490//490 219//219 220//220 
f 211//211 208//208 193//193 
f 227//227 230//230 270//270 
f 272//272 227//227 270//270 
f 346//346 318//318 103//103 
f 487//487 216//216 488//488 
f 346//346 103//103 104//104 
f 517//517 498//498 516//516 
f 518//518 517//517 516//516 
f 106//106 346//346 104//104 
f 487//487 504//504 224//224 
f 282//282 257//257 269//269 
f 216//216 214//214 218//218 
f 487//487 488//488 503//503 
f 213//213 100//100 208//208 
f 496//496 482//482 499//499 
f 211//211 193//193 194//194 
f 220//220 218//218 211//211 
f 589//589 528//528 527//527 
f 243//243 253//253 240//240 
f 240//240 231//231 236//236 
f 210//210 211//211 194//194 
f 210//210 196//196 212//212 
f 251//251 111//111 248//248 
f 230//230 223//223 270//270 
f 241//241 240//240 236//236 
f 108//108 106//106 104//104 
f 99//99 100//100 213//213 
f 100//100 98//98 206//206 
f 258//258 254//254 569//569 
f 208//208 100//100 206//206 
f 214//214 208//208 211//211 
f 373//373 356//356 357//357 
f 262//262 578//578 281//281 
f 243//243 270//270 253//253 
f 243//243 240//240 241//241 
f 575//575 509//509 573//573 
f 230//230 114//114 222//222 
f 268//268 233//233 292//292 
f 505//505 229//229 228//228 
f 221//221 217//217 212//212 
f 188//188 187//187 184//184 
f 178//178 726//726 235//235 
f 232//232 202//202 231//231 
f 169//169 168//168 165//165 
f 169//169 166//166 167//167 
f 492//492 221//221 229//229 
f 232//232 231//231 240//240 
f 205//205 232//232 240//240 
f 274//274 272//272 271//271 
f 172//172 171//171 163//163 
f 731//731 235//235 729//729 
f 179//179 177//177 175//175 
f 732//732 235//235 731//731 
f 726//726 727//727 728//728 
f 179//179 175//175 178//178 
f 320//320 215//215 25//25 
f 247//247 732//732 250//250 
f 234//234 178//178 235//235 
f 261//261 258//258 577//577 
f 261//261 577//577 262//262 
f 244//244 178//178 234//234 
f 241//241 236//236 237//237 
f 169//169 167//167 170//170 
f 277//277 271//271 249//249 
f 243//243 241//241 242//242 
f 221//221 212//212 229//229 
f 249//249 243//243 242//242 
f 227//227 229//229 114//114 
f 111//111 249//249 242//242 
f 271//271 243//243 249//249 
f 170//170 167//167 174//174 
f 732//732 731//731 737//737 
f 237//237 180//180 183//183 
f 231//231 168//168 169//169 
f 236//236 180//180 237//237 
f 248//248 250//250 251//251 
f 280//280 277//277 278//278 
f 241//241 239//239 242//242 
f 231//231 202//202 168//168 
f 244//244 179//179 178//178 
f 231//231 170//170 236//236 
f 245//245 244//244 247//247 
f 739//739 737//737 256//256 
f 254//254 255//255 226//226 
f 280//280 282//282 263//263 
f 269//269 257//257 265//265 
f 213//213 214//214 225//225 
f 123//123 117//117 122//122 
f 269//269 264//264 263//263 
f 405//405 386//386 404//404 
f 276//276 275//275 281//281 
f 736//736 734//734 152//152 
f 153//153 147//147 151//151 
f 114//114 230//230 227//227 
f 196//196 191//191 204//204 
f 577//577 258//258 569//569 
f 229//229 212//212 114//114 
f 228//228 229//229 227//227 
f 384//384 329//329 381//381 
f 279//279 739//739 256//256 
f 249//249 111//111 251//251 
f 407//407 352//352 351//351 
f 151//151 255//255 261//261 
f 674//674 663//663 658//658 
f 146//146 110//110 255//255 
f 723//723 149//149 150//150 
f 276//276 273//273 275//275 
f 723//723 150//150 725//725 
f 680//680 300//300 706//706 
f 264//264 261//261 262//262 
f 570//570 571//571 573//573 
f 723//723 720//720 721//721 
f 144//144 143//143 150//150 
f 148//148 144//144 150//150 
f 259//259 152//152 151//151 
f 264//264 262//262 263//263 
f 273//273 272//272 275//275 
f 725//725 150//150 153//153 
f 153//153 152//152 725//725 
f 84//84 185//185 186//186 
f 691//691 419//419 387//387 
f 452//452 233//233 238//238 
f 245//245 183//183 244//244 
f 248//248 247//247 250//250 
f 212//212 217//217 210//210 
f 194//194 196//196 210//210 
f 251//251 250//250 279//279 
f 266//266 257//257 256//256 
f 205//205 199//199 232//232 
f 260//260 259//259 264//264 
f 217//217 211//211 210//210 
f 265//265 264//264 269//269 
f 251//251 279//279 252//252 
f 265//265 260//260 264//264 
f 79//79 77//77 91//91 
f 576//576 312//312 472//472 
f 570//570 273//273 276//276 
f 252//252 249//249 251//251 
f 606//606 580//580 758//758 
f 277//277 249//249 252//252 
f 78//78 76//76 75//75 
f 118//118 49//49 112//112 
f 739//739 250//250 732//732 
f 282//282 280//280 278//278 
f 370//370 328//328 367//367 
f 697//697 735//735 483//483 
f 284//284 283//283 325//325 
f 319//319 314//314 313//313 
f 288//288 287//287 290//290 
f 293//293 288//288 290//290 
f 390//390 286//286 391//391 
f 382//382 381//381 331//331 
f 393//393 382//382 400//400 
f 343//343 401//401 469//469 
f 391//391 382//382 390//390 
f 334//334 331//331 340//340 
f 368//368 367//367 326//326 
f 302//302 301//301 460//460 
f 466//466 311//311 310//310 
f 286//286 339//339 287//287 
f 455//455 293//293 290//290 
f 455//455 290//290 291//291 
f 307//307 302//302 303//303 
f 390//390 339//339 286//286 
f 307//307 303//303 308//308 
f 290//290 336//336 294//294 
f 410//410 345//345 385//385 
f 336//336 287//287 339//339 
f 456//456 455//455 291//291 
f 459//459 457//457 361//361 
f 697//697 483//483 462//462 
f 459//459 464//464 457//457 
f 466//466 464//464 421//421 
f 150//150 147//147 153//153 
f 310//310 309//309 308//308 
f 465//465 768//768 463//463 
f 765//765 756//756 763//763 
f 381//381 332//332 331//331 
f 304//304 298//298 299//299 
f 296//296 288//288 293//293 
f 286//286 287//287 295//295 
f 437//437 436//436 434//434 
f 382//382 331//331 390//390 
f 295//295 288//288 298//298 
f 303//303 302//302 460//460 
f 345//345 101//101 385//385 
f 466//466 465//465 463//463 
f 421//421 365//365 366//366 
f 464//464 456//456 457//457 
f 421//421 422//422 466//466 
f 460//460 301//301 455//455 
f 460//460 455//455 456//456 
f 435//435 401//401 343//343 
f 427//427 305//305 309//309 
f 765//765 763//763 764//764 
f 768//768 460//460 461//461 
f 756//756 754//754 763//763 
f 304//304 299//299 305//305 
f 765//765 97//97 129//129 
f 456//456 291//291 457//457 
f 301//301 296//296 293//293 
f 311//311 434//434 310//310 
f 426//426 304//304 305//305 
f 302//302 296//296 301//301 
f 583//583 300//300 680//680 
f 426//426 305//305 427//427 
f 420//420 424//424 432//432 
f 319//319 313//313 315//315 
f 342//342 285//285 325//325 
f 697//697 674//674 735//735 
f 313//313 283//283 322//322 
f 321//321 314//314 317//317 
f 322//322 323//323 315//315 
f 349//349 347//347 346//346 
f 327//327 326//326 367//367 
f 327//327 324//324 323//323 
f 712//712 320//320 338//338 
f 88//88 103//103 318//318 
f 92//92 86//86 135//135 
f 397//397 467//467 475//475 
f 368//368 355//355 356//356 
f 766//766 207//207 500//500 
f 291//291 290//290 294//294 
f 88//88 92//92 135//135 
f 369//369 368//368 373//373 
f 337//337 333//333 324//324 
f 764//764 448//448 454//454 
f 315//315 313//313 322//322 
f 459//459 421//421 464//464 
f 341//341 337//337 328//328 
f 712//712 338//338 740//740 
f 364//364 341//341 328//328 
f 285//285 284//284 325//325 
f 371//371 364//364 328//328 
f 448//448 443//443 449//449 
f 348//348 344//344 347//347 
f 321//321 283//283 313//313 
f 349//349 140//140 141//141 
f 103//103 88//88 135//135 
f 423//423 375//375 413//413 
f 340//340 319//319 333//333 
f 334//334 333//333 337//337 
f 756//756 757//757 754//754 
f 349//349 346//346 140//140 
f 140//140 346//346 106//106 
f 142//142 140//140 106//106 
f 340//340 330//330 319//319 
f 94//94 198//198 93//93 
f 324//324 328//328 337//337 
f 333//333 315//315 324//324 
f 124//124 38//38 72//72 
f 334//334 339//339 390//390 
f 93//93 92//92 316//316 
f 135//135 87//87 103//103 
f 766//766 500//500 537//537 
f 92//92 88//88 316//316 
f 330//330 332//332 316//316 
f 332//332 93//93 316//316 
f 314//314 330//330 317//317 
f 330//330 88//88 317//317 
f 457//457 294//294 361//361 
f 354//354 72//72 312//312 
f 344//344 317//317 347//347 
f 352//352 348//348 350//350 
f 333//333 319//319 315//315 
f 677//677 43//43 664//664 
f 324//324 315//315 323//323 
f 740//740 345//345 583//583 
f 353//353 342//342 352//352 
f 457//457 291//291 294//294 
f 342//342 344//344 352//352 
f 289//289 435//435 343//343 
f 371//371 328//328 370//370 
f 376//376 373//373 357//357 
f 323//323 322//322 284//284 
f 135//135 85//85 87//87 
f 407//407 353//353 352//352 
f 316//316 88//88 330//330 
f 352//352 344//344 348//348 
f 328//328 327//327 367//367 
f 323//323 284//284 327//327 
f 327//327 285//285 326//326 
f 715//715 724//724 714//714 
f 408//408 353//353 407//407 
f 359//359 409//409 411//411 
f 356//356 408//408 409//409 
f 758//758 580//580 412//412 
f 584//584 579//579 582//582 
f 412//412 416//416 445//445 
f 354//354 312//312 576//576 
f 580//580 411//411 412//412 
f 572//572 514//514 579//579 
f 574//574 572//572 579//579 
f 583//583 345//345 410//410 
f 572//572 508//508 514//514 
f 415//415 414//414 417//417 
f 450//450 448//448 449//449 
f 314//314 321//321 313//313 
f 413//413 375//375 576//576 
f 360//360 335//335 362//362 
f 372//372 438//438 371//371 
f 459//459 365//365 421//421 
f 402//402 400//400 425//425 
f 466//466 422//422 437//437 
f 438//438 372//372 440//440 
f 375//375 209//209 576//576 
f 354//354 209//209 388//388 
f 375//375 70//70 388//388 
f 360//360 339//339 335//335 
f 466//466 437//437 311//311 
f 393//393 381//381 382//382 
f 361//361 294//294 360//360 
f 576//576 209//209 354//354 
f 400//400 382//382 391//391 
f 299//299 298//298 296//296 
f 377//377 369//369 373//373 
f 385//385 155//155 388//388 
f 321//321 317//317 344//344 
f 322//322 283//283 284//284 
f 358//358 533//533 374//374 
f 327//327 284//284 285//285 
f 326//326 285//285 342//342 
f 326//326 342//342 355//355 
f 328//328 324//324 327//327 
f 612//612 611//611 597//597 
f 378//378 372//372 369//369 
f 372//372 367//367 369//369 
f 438//438 439//439 371//371 
f 370//370 367//367 372//372 
f 368//368 326//326 355//355 
f 377//377 376//376 379//379 
f 359//359 358//358 357//357 
f 663//663 598//598 547//547 
f 444//444 415//415 417//417 
f 407//407 414//414 415//415 
f 401//401 397//397 475//475 
f 377//377 373//373 376//376 
f 534//534 533//533 535//535 
f 539//539 376//376 374//374 
f 544//544 538//538 599//599 
f 597//597 544//544 599//599 
f 539//539 374//374 534//534 
f 602//602 597//597 599//599 
f 451//451 441//441 379//379 
f 414//414 407//407 406//406 
f 334//334 340//340 333//333 
f 390//390 331//331 334//334 
f 339//339 334//334 337//337 
f 339//339 337//337 335//335 
f 423//423 413//413 435//435 
f 697//697 462//462 594//594 
f 384//384 380//380 329//329 
f 128//128 127//127 95//95 
f 394//394 400//400 417//417 
f 709//709 395//395 741//741 
f 389//389 381//381 393//393 
f 342//342 325//325 321//321 
f 4//4 713//713 711//711 
f 394//394 389//389 393//393 
f 325//325 283//283 321//321 
f 385//385 388//388 70//70 
f 394//394 393//393 400//400 
f 391//391 286//286 295//295 
f 295//295 287//287 288//288 
f 424//424 418//418 433//433 
f 287//287 336//336 290//290 
f 400//400 391//391 392//392 
f 391//391 295//295 304//304 
f 344//344 342//342 321//321 
f 330//330 314//314 319//319 
f 406//406 389//389 414//414 
f 400//400 392//392 425//425 
f 396//396 384//384 389//389 
f 149//149 398//398 405//405 
f 127//127 94//94 95//95 
f 489//489 238//238 525//525 
f 143//143 109//109 146//146 
f 709//709 741//741 4//4 
f 148//148 405//405 144//144 
f 392//392 391//391 304//304 
f 304//304 295//295 298//298 
f 395//395 384//384 396//396 
f 332//332 330//330 331//331 
f 343//343 469//469 403//403 
f 351//351 350//350 406//406 
f 417//417 400//400 402//402 
f 751//751 417//417 745//745 
f 765//765 129//129 756//756 
f 431//431 747//747 743//743 
f 397//397 594//594 462//462 
f 745//745 417//417 402//402 
f 398//398 741//741 396//396 
f 722//722 721//721 724//724 
f 598//598 472//472 547//547 
f 415//415 408//408 407//407 
f 740//740 338//338 345//345 
f 359//359 357//357 409//409 
f 590//590 588//588 595//595 
f 488//488 485//485 486//486 
f 581//581 515//515 580//580 
f 628//628 608//608 603//603 
f 409//409 408//408 415//415 
f 537//537 740//740 563//563 
f 598//598 663//663 697//697 
f 409//409 357//357 356//356 
f 511//511 497//497 512//512 
f 416//416 412//412 415//415 
f 412//412 409//409 415//415 
f 763//763 749//749 447//447 
f 356//356 353//353 408//408 
f 429//429 428//428 743//743 
f 459//459 361//361 365//365 
f 749//749 748//748 442//442 
f 420//420 366//366 424//424 
f 454//454 448//448 450//450 
f 437//437 422//422 420//420 
f 418//418 363//363 364//364 
f 432//432 424//424 433//433 
f 437//437 434//434 311//311 
f 365//365 363//363 366//366 
f 294//294 336//336 360//360 
f 336//336 339//339 360//360 
f 547//547 489//489 552//552 
f 309//309 299//299 306//306 
f 335//335 337//337 341//341 
f 427//427 434//434 436//436 
f 361//361 360//360 362//362 
f 433//433 418//418 439//439 
f 475//475 626//626 762//762 
f 361//361 362//362 365//365 
f 362//362 341//341 363//363 
f 547//547 552//552 663//663 
f 434//434 427//427 309//309 
f 362//362 335//335 341//341 
f 463//463 461//461 464//464 
f 436//436 430//430 427//427 
f 426//426 425//425 304//304 
f 299//299 296//296 306//306 
f 735//735 399//399 733//733 
f 296//296 298//298 288//288 
f 763//763 447//447 448//448 
f 306//306 302//302 307//307 
f 463//463 768//768 461//461 
f 392//392 304//304 425//425 
f 309//309 307//307 308//308 
f 410//410 385//385 70//70 
f 413//413 576//576 598//598 
f 305//305 299//299 309//309 
f 145//145 72//72 354//354 
f 306//306 307//307 309//309 
f 432//432 437//437 420//420 
f 366//366 363//363 418//418 
f 306//306 296//296 302//302 
f 420//420 422//422 366//366 
f 648//648 563//563 680//680 
f 638//638 419//419 764//764 
f 433//433 439//439 438//438 
f 424//424 366//366 418//418 
f 363//363 341//341 364//364 
f 461//461 456//456 464//464 
f 432//432 436//436 437//437 
f 434//434 309//309 310//310 
f 371//371 370//370 372//372 
f 440//440 378//378 441//441 
f 418//418 364//364 439//439 
f 447//447 443//443 448//448 
f 440//440 372//372 378//378 
f 757//757 751//751 754//754 
f 441//441 378//378 379//379 
f 378//378 369//369 377//377 
f 483//483 735//735 752//752 
f 585//585 606//606 698//698 
f 752//752 615//615 483//483 
f 378//378 377//377 379//379 
f 757//757 753//753 751//751 
f 698//698 606//606 758//758 
f 706//706 300//300 399//399 
f 754//754 751//751 750//750 
f 749//749 431//431 748//748 
f 450//450 449//449 441//441 
f 312//312 268//268 292//292 
f 691//691 387//387 717//717 
f 742//742 429//429 743//743 
f 233//233 10//10 25//25 
f 759//759 444//444 753//753 
f 137//137 90//90 124//124 
f 742//742 743//743 747//747 
f 447//447 442//442 443//443 
f 691//691 97//97 765//765 
f 419//419 733//733 399//399 
f 438//438 449//449 443//443 
f 453//453 450//450 441//441 
f 733//733 638//638 744//744 
f 233//233 207//207 766//766 
f 539//539 538//538 544//544 
f 614//614 612//612 613//613 
f 479//479 610//610 609//609 
f 733//733 744//744 752//752 
f 449//449 440//440 441//441 
f 465//465 308//308 768//768 
f 463//463 464//464 466//466 
f 421//421 366//366 422//422 
f 308//308 303//303 768//768 
f 460//460 456//456 461//461 
f 293//293 455//455 301//301 
f 452//452 292//292 233//233 
f 742//742 402//402 429//429 
f 426//426 430//430 428//428 
f 310//310 308//308 465//465 
f 454//454 450//450 453//453 
f 466//466 310//310 465//465 
f 752//752 735//735 733//733 
f 508//508 506//506 503//503 
f 480//480 478//478 477//477 
f 477//477 468//468 470//470 
f 208//208 206//206 193//193 
f 514//514 515//515 581//581 
f 672//672 585//585 698//698 
f 613//613 479//479 615//615 
f 755//755 717//717 387//387 
f 507//507 493//493 505//505 
f 506//506 487//487 503//503 
f 482//482 481//481 499//499 
f 754//754 749//749 763//763 
f 478//478 468//468 477//477 
f 468//468 471//471 470//470 
f 137//137 124//124 145//145 
f 493//493 491//491 490//490 
f 485//485 218//218 219//219 
f 482//482 470//470 473//473 
f 648//648 525//525 537//537 
f 486//486 468//468 478//478 
f 516//516 493//493 507//507 
f 538//538 534//534 541//541 
f 717//717 510//510 691//691 
f 617//617 561//561 560//560 
f 526//526 530//530 629//629 
f 637//637 551//551 553//553 
f 630//630 629//629 632//632 
f 554//554 548//548 545//545 
f 635//635 549//549 551//551 
f 207//207 25//25 215//215 
f 642//642 484//484 635//635 
f 411//411 409//409 412//412 
f 485//485 216//216 218//218 
f 608//608 607//607 605//605 
f 495//495 478//478 480//480 
f 480//480 470//470 482//482 
f 615//615 752//752 614//614 
f 480//480 477//477 470//470 
f 105//105 213//213 225//225 
f 224//224 105//105 225//225 
f 497//497 358//358 513//513 
f 496//496 495//495 480//480 
f 501//501 496//496 499//499 
f 493//493 492//492 505//505 
f 528//528 518//518 527//527 
f 527//527 518//518 507//507 
f 490//490 474//474 219//219 
f 490//490 220//220 492//492 
f 490//490 492//492 493//493 
f 568//568 508//508 572//572 
f 574//574 568//568 572//572 
f 579//579 514//514 581//581 
f 600//600 601//601 543//543 
f 507//507 518//518 516//516 
f 616//616 600//600 617//617 
f 491//491 474//474 490//490 
f 497//497 533//533 358//358 
f 414//414 389//389 394//394 
f 471//471 468//468 485//485 
f 494//494 486//486 478//478 
f 495//495 494//494 478//478 
f 536//536 502//502 501//501 
f 502//502 496//496 501//501 
f 462//462 483//483 615//615 
f 376//376 357//357 358//358 
f 233//233 25//25 207//207 
f 275//275 274//274 280//280 
f 496//496 480//480 482//482 
f 569//569 568//568 577//577 
f 589//589 527//527 509//509 
f 505//505 228//228 273//273 
f 505//505 273//273 509//509 
f 597//597 602//602 610//610 
f 612//612 597//597 610//610 
f 497//497 494//494 495//495 
f 485//485 468//468 486//486 
f 512//512 497//497 513//513 
f 582//582 580//580 606//606 
f 582//582 579//579 581//581 
f 497//497 495//495 533//533 
f 498//498 491//491 516//516 
f 474//474 485//485 219//219 
f 524//524 523//523 519//519 
f 481//481 482//482 473//473 
f 476//476 474//474 491//491 
f 469//469 401//401 475//475 
f 614//614 611//611 612//612 
f 521//521 522//522 520//520 
f 589//589 591//591 588//588 
f 476//476 471//471 474//474 
f 536//536 501//501 546//546 
f 613//613 612//612 610//610 
f 522//522 517//517 520//520 
f 642//642 636//636 645//645 
f 587//587 586//586 607//607 
f 608//608 587//587 607//607 
f 521//521 520//520 519//519 
f 637//637 632//632 639//639 
f 526//526 524//524 530//530 
f 524//524 519//519 528//528 
f 526//526 523//523 524//524 
f 661//661 649//649 621//621 
f 527//527 507//507 509//509 
f 589//589 509//509 575//575 
f 591//591 589//589 575//575 
f 529//529 528//528 589//589 
f 517//517 518//518 520//520 
f 525//525 766//766 537//537 
f 510//510 704//704 403//403 
f 623//623 596//596 618//618 
f 562//562 566//566 625//625 
f 635//635 640//640 636//636 
f 524//524 528//528 530//530 
f 498//498 476//476 491//491 
f 453//453 611//611 614//614 
f 642//642 635//635 636//636 
f 598//598 576//576 472//472 
f 633//633 629//629 530//530 
f 553//553 523//523 630//630 
f 653//653 643//643 644//644 
f 654//654 644//644 655//655 
f 533//533 495//495 535//535 
f 541//541 534//534 535//535 
f 374//374 533//533 534//534 
f 548//548 554//554 559//559 
f 540//540 502//502 536//536 
f 548//548 536//536 546//546 
f 540//540 541//541 535//535 
f 538//538 539//539 534//534 
f 379//379 376//376 539//539 
f 758//758 412//412 445//445 
f 599//599 538//538 541//541 
f 735//735 706//706 399//399 
f 604//604 544//544 597//597 
f 540//540 536//536 542//542 
f 662//662 661//661 621//621 
f 542//542 536//536 548//548 
f 564//564 560//560 559//559 
f 599//599 541//541 543//543 
f 451//451 604//604 597//597 
f 561//561 542//542 559//559 
f 489//489 525//525 552//552 
f 566//566 627//627 625//625 
f 616//616 601//601 600//600 
f 634//634 531//531 590//590 
f 562//562 560//560 564//564 
f 567//567 627//627 566//566 
f 501//501 499//499 517//517 
f 519//519 518//518 528//528 
f 647//647 634//634 649//649 
f 519//519 520//520 518//518 
f 551//551 546//546 522//522 
f 625//625 617//617 562//562 
f 643//643 484//484 642//642 
f 562//562 564//564 566//566 
f 535//535 495//495 496//496 
f 661//661 647//647 649//649 
f 556//556 549//549 550//550 
f 556//556 545//545 549//549 
f 499//499 481//481 498//498 
f 546//546 501//501 517//517 
f 561//561 559//559 560//560 
f 636//636 640//640 641//641 
f 522//522 546//546 517//517 
f 640//640 635//635 637//637 
f 640//640 637//637 639//639 
f 499//499 498//498 517//517 
f 637//637 553//553 632//632 
f 521//521 519//519 523//523 
f 755//755 446//446 704//704 
f 549//549 545//545 551//551 
f 521//521 523//523 553//553 
f 559//559 554//554 555//555 
f 617//617 560//560 562//562 
f 706//706 658//658 680//680 
f 564//564 559//559 555//555 
f 567//567 566//566 657//657 
f 564//564 555//555 565//565 
f 566//566 564//564 565//565 
f 601//601 599//599 543//543 
f 535//535 496//496 502//502 
f 535//535 502//502 540//540 
f 543//543 541//541 540//540 
f 559//559 542//542 548//548 
f 655//655 652//652 660//660 
f 635//635 484//484 550//550 
f 551//551 522//522 521//521 
f 548//548 546//546 545//545 
f 659//659 567//567 657//657 
f 662//662 627//627 567//567 
f 558//558 554//554 557//557 
f 565//565 558//558 653//653 
f 653//653 644//644 654//654 
f 281//281 275//275 280//280 
f 261//261 255//255 258//258 
f 262//262 577//577 578//578 
f 571//571 570//570 276//276 
f 222//222 196//196 204//204 
f 591//591 575//575 574//574 
f 573//573 568//568 574//574 
f 255//255 254//254 258//258 
f 515//515 512//512 513//513 
f 513//513 358//358 359//359 
f 488//488 486//486 511//511 
f 663//663 552//552 658//658 
f 511//511 486//486 494//494 
f 618//618 603//603 601//601 
f 581//581 580//580 582//582 
f 401//401 594//594 397//397 
f 515//515 513//513 359//359 
f 674//674 658//658 706//706 
f 580//580 515//515 359//359 
f 575//575 573//573 574//574 
f 503//503 488//488 511//511 
f 508//508 503//503 511//511 
f 592//592 579//579 584//584 
f 592//592 584//584 586//586 
f 514//514 508//508 511//511 
f 511//511 494//494 497//497 
f 753//753 444//444 751//751 
f 444//444 417//417 751//751 
f 586//586 584//584 585//585 
f 607//607 586//586 585//585 
f 626//626 605//605 672//672 
f 605//605 607//607 672//672 
f 698//698 626//626 672//672 
f 596//596 595//595 593//593 
f 563//563 740//740 583//583 
f 514//514 511//511 512//512 
f 624//624 620//620 623//623 
f 514//514 512//512 515//515 
f 588//588 591//591 595//595 
f 618//618 596//596 628//628 
f 634//634 590//590 619//619 
f 609//609 603//603 608//608 
f 530//530 528//528 529//529 
f 596//596 593//593 628//628 
f 749//749 442//442 447//447 
f 604//604 379//379 539//539 
f 451//451 379//379 604//604 
f 619//619 590//590 622//622 
f 620//620 619//619 622//622 
f 620//620 622//622 623//623 
f 652//652 651//651 647//647 
f 661//661 656//656 647//647 
f 603//603 602//602 601//601 
f 744//744 453//453 614//614 
f 633//633 532//532 634//634 
f 617//617 600//600 561//561 
f 543//543 561//561 600//600 
f 609//609 608//608 605//605 
f 759//759 761//761 760//760 
f 531//531 529//529 590//590 
f 618//618 616//616 624//624 
f 764//764 454//454 638//638 
f 621//621 620//620 624//624 
f 607//607 585//585 672//672 
f 608//608 628//628 587//587 
f 628//628 603//603 618//618 
f 599//599 601//601 602//602 
f 584//584 582//582 606//606 
f 704//704 343//343 403//403 
f 751//751 746//746 750//750 
f 584//584 606//606 585//585 
f 453//453 451//451 611//611 
f 479//479 613//613 610//610 
f 462//462 467//467 397//397 
f 733//733 419//419 638//638 
f 617//617 624//624 616//616 
f 618//618 601//601 616//616 
f 610//610 602//602 603//603 
f 757//757 129//129 761//761 
f 129//129 68//68 761//761 
f 453//453 441//441 451//451 
f 744//744 454//454 453//453 
f 744//744 614//614 752//752 
f 626//626 467//467 605//605 
f 646//646 633//633 634//634 
f 543//543 540//540 542//542 
f 634//634 532//532 531//531 
f 657//657 565//565 653//653 
f 624//624 617//617 625//625 
f 561//561 543//543 542//542 
f 590//590 595//595 622//622 
f 590//590 529//529 588//588 
f 629//629 630//630 526//526 
f 532//532 530//530 531//531 
f 530//530 529//529 531//531 
f 529//529 589//589 588//588 
f 553//553 551//551 521//521 
f 634//634 619//619 649//649 
f 595//595 591//591 592//592 
f 593//593 595//595 592//592 
f 630//630 523//523 526//526 
f 621//621 624//624 625//625 
f 657//657 654//654 659//659 
f 761//761 403//403 762//762 
f 621//621 625//625 627//627 
f 662//662 567//567 659//659 
f 650//650 646//646 647//647 
f 759//759 753//753 757//757 
f 660//660 662//662 659//659 
f 592//592 586//586 587//587 
f 385//385 137//137 155//155 
f 479//479 605//605 467//467 
f 649//649 620//620 621//621 
f 653//653 558//558 643//643 
f 558//558 557//557 643//643 
f 631//631 632//632 633//633 
f 621//621 627//627 662//662 
f 633//633 530//530 532//532 
f 639//639 631//631 650//650 
f 655//655 641//641 652//652 
f 647//647 656//656 652//652 
f 645//645 636//636 641//641 
f 652//652 639//639 651//651 
f 545//545 546//546 551//551 
f 639//639 650//650 651//651 
f 635//635 551//551 637//637 
f 644//644 642//642 645//645 
f 644//644 643//643 642//642 
f 641//641 639//639 652//652 
f 550//550 549//549 635//635 
f 454//454 744//744 638//638 
f 649//649 619//619 620//620 
f 632//632 553//553 630//630 
f 633//633 632//632 629//629 
f 554//554 545//545 556//556 
f 557//557 554//554 556//556 
f 659//659 654//654 660//660 
f 632//632 631//631 639//639 
f 555//555 554//554 558//558 
f 550//550 557//557 556//556 
f 641//641 640//640 639//639 
f 660//660 654//654 655//655 
f 647//647 651//651 650//650 
f 594//594 598//598 697//697 
f 660//660 652//652 656//656 
f 650//650 631//631 646//646 
f 593//593 587//587 628//628 
f 593//593 592//592 587//587 
f 660//660 656//656 662//662 
f 655//655 644//644 645//645 
f 631//631 633//633 646//646 
f 566//566 565//565 657//657 
f 643//643 557//557 484//484 
f 557//557 550//550 484//484 
f 622//622 595//595 596//596 
f 555//555 558//558 565//565 
f 446//446 423//423 289//289 
f 622//622 596//596 623//623 
f 662//662 656//656 661//661 
f 399//399 387//387 419//419 
f 312//312 452//452 458//458 
f 653//653 654//654 657//657 
f 591//591 574//574 592//592 
f 646//646 634//634 647//647 
f 163//163 60//60 47//47 
f 726//726 173//173 727//727 
f 47//47 46//46 679//679 
f 129//129 757//757 756//756 
f 63//63 65//65 62//62 
f 670//670 669//669 678//678 
f 681//681 673//673 687//687 
f 57//57 51//51 61//61 
f 174//174 171//171 172//172 
f 175//175 174//174 172//172 
f 678//678 669//669 671//671 
f 118//118 113//113 123//123 
f 760//760 698//698 758//758 
f 673//673 678//678 671//671 
f 671//671 665//665 667//667 
f 673//673 671//671 667//667 
f 708//708 710//710 702//702 
f 668//668 121//121 665//665 
f 670//670 53//53 669//669 
f 164//164 163//163 47//47 
f 164//164 47//47 679//679 
f 761//761 759//759 757//757 
f 727//727 164//164 679//679 
f 755//755 583//583 446//446 
f 47//47 45//45 46//46 
f 729//729 728//728 696//696 
f 675//675 676//676 679//679 
f 727//727 679//679 728//728 
f 118//118 112//112 113//113 
f 760//760 762//762 698//698 
f 673//673 685//685 687//687 
f 673//673 667//667 685//685 
f 686//686 690//690 694//694 
f 728//728 679//679 676//676 
f 692//692 687//687 705//705 
f 59//59 58//58 60//60 
f 700//700 696//696 692//692 
f 61//61 56//56 57//57 
f 666//666 684//684 682//682 
f 195//195 133//133 126//126 
f 670//670 52//52 53//53 
f 713//713 4//4 398//398 
f 125//125 133//133 195//195 
f 121//121 119//119 125//125 
f 665//665 121//121 666//666 
f 667//667 665//665 666//666 
f 119//119 123//123 125//125 
f 689//689 195//195 126//126 
f 762//762 626//626 698//698 
f 714//714 707//707 715//715 
f 705//705 693//693 695//695 
f 126//126 133//133 702//702 
f 694//694 689//689 701//701 
f 694//694 701//701 695//695 
f 693//693 767//767 686//686 
f 701//701 689//689 126//126 
f 690//690 689//689 694//694 
f 721//721 718//718 714//714 
f 690//690 195//195 689//689 
f 692//692 716//716 700//700 
f 682//682 667//667 666//666 
f 122//122 125//125 123//123 
f 737//737 731//731 734//734 
f 401//401 435//435 594//594 
f 681//681 692//692 696//696 
f 684//684 125//125 195//195 
f 46//46 44//44 675//675 
f 686//686 688//688 690//690 
f 683//683 682//682 684//684 
f 686//686 683//683 688//688 
f 734//734 719//719 718//718 
f 699//699 696//696 700//700 
f 701//701 126//126 702//702 
f 701//701 702//702 703//703 
f 688//688 195//195 690//690 
f 685//685 682//682 683//683 
f 685//685 683//683 767//767 
f 730//730 719//719 734//734 
f 563//563 648//648 537//537 
f 700//700 716//716 718//718 
f 699//699 719//719 730//730 
f 722//722 149//149 723//723 
f 734//734 718//718 720//720 
f 274//274 271//271 277//277 
f 703//703 702//702 710//710 
f 760//760 758//758 759//759 
f 694//694 693//693 686//686 
f 692//692 705//705 716//716 
f 767//767 683//683 686//686 
f 687//687 685//685 767//767 
f 142//142 143//143 144//144 
f 704//704 446//446 289//289 
f 715//715 707//707 710//710 
f 149//149 148//148 150//150 
f 394//394 417//417 414//414 
f 452//452 312//312 292//292 
f 707//707 701//701 703//703 
f 404//404 386//386 406//406 
f 352//352 350//350 351//351 
f 141//141 140//140 142//142 
f 289//289 423//423 435//435 
f 714//714 724//724 721//721 
f 707//707 695//695 701//701 
f 256//256 737//737 738//738 
f 705//705 687//687 693//693 
f 259//259 151//151 261//261 
f 737//737 734//734 738//738 
f 469//469 475//475 762//762 
f 279//279 278//278 252//252 
f 720//720 718//718 721//721 
f 738//738 260//260 266//266 
f 718//718 719//719 700//700 
f 150//150 143//143 147//147 
f 153//153 151//151 152//152 
f 260//260 738//738 736//736 
f 734//734 731//731 730//730 
f 151//151 146//146 255//255 
f 59//59 60//60 171//171 
f 687//687 692//692 681//681 
f 681//681 676//676 678//678 
f 699//699 700//700 719//719 
f 728//728 681//681 696//696 
f 280//280 274//274 277//277 
f 278//278 277//277 252//252 
f 256//256 738//738 266//266 
f 244//244 234//234 247//247 
f 152//152 720//720 725//725 
f 729//729 696//696 699//699 
f 731//731 729//729 730//730 
f 723//723 721//721 722//722 
f 730//730 729//729 699//699 
f 182//182 180//180 181//181 
f 244//244 182//182 181//181 
f 746//746 742//742 747//747 
f 750//750 749//749 754//754 
f 428//428 429//429 426//426 
f 750//750 746//746 747//747 
f 445//445 416//416 444//444 
f 97//97 68//68 129//129 
f 364//364 371//371 439//439 
f 747//747 431//431 749//749 
f 445//445 444//444 759//759 
f 472//472 312//312 547//547 
f 748//748 436//436 432//432 
f 442//442 433//433 438//438 
f 762//762 760//760 761//761 
f 755//755 704//704 717//717 
f 431//431 428//428 430//430 
f 745//745 742//742 746//746 
f 425//425 426//426 429//429 
f 748//748 431//431 436//436 
f 747//747 749//749 750//750 
f 431//431 430//430 436//436 
f 402//402 425//425 429//429 
f 416//416 415//415 444//444 
f 469//469 762//762 403//403 
f 743//743 428//428 431//431 
f 745//745 746//746 751//751 
f 745//745 402//402 742//742 
f 343//343 704//704 289//289 
f 704//704 510//510 717//717 
f 510//510 97//97 691//691 
f 763//763 448//448 764//764 
f 748//748 432//432 433//433 
f 539//539 544//544 604//604 
f 735//735 674//674 706//706 
f 399//399 300//300 387//387 
f 419//419 691//691 765//765 
f 451//451 597//597 611//611 
f 1//1 2//2 12//12 
f 83//83 25//25 769//769 
f 525//525 238//238 770//770 
f 238//238 766//766 770//770 
f 766//766 525//525 770//770 
f 24//24 12//12 771//771 
f 12//12 2//2 771//771 
f 2//2 24//24 771//771 
f 769//769 38//38 772//772 
f 38//38 83//83 772//772 
f 83//83 769//769 772//772 
f 190//190 192//192 773//773 
f 192//192 191//191 773//773 
f 191//191 190//190 773//773 
f 71//71 69//69 774//774 
f 69//69 73//73 774//774 
f 73//73 71//71 774//774 
f 99//99 102//102 775//775 
f 102//102 100//100 775//775 
f 100//100 99//99 775//775 
f 247//247 234//234 776//776 
f 234//234 732//732 776//776 
f 732//732 247//247 776//776 
f 679//679 46//46 777//777 
f 46//46 675//675 777//777 
f 675//675 679//679 777//777 
f 693//693 687//687 778//778 
f 687//687 767//767 778//778 
f 767//767 693//693 778//778 
f 734//734 720//720 779//779 
f 720//720 152//152 779//779 
f 152//152 734//734 779//779 
f 303//303 460//460 780//780 
f 460//460 768//768 780//780 
f 768//768 303//303 780//780 
f 645//645 641//641 781//781 
f 641//641 655//655 781//781 
f 655//655 645//645 781//781 
