# PIPER geometrical reference model based on a manual segmentation. See the
# documentation for more info.
# Author: CEESAR, SOTON, UCBL-Ifsttar
# Version: 1.0.0
# License: Creative Commons Attribution 4.0 International License.
# (https://creativecommons.org/licenses/by/4.0/)
# 
# This work has received funding from the European Union Seventh Framework
# Program ([FP7/2007-2013]) under grant agreement 605544 [PIPER project]).
# Contributors include Pierre Maillez, Christophe Lecomte (SOTON), Erwan
# Jolivet (CEESAR), Philippe Beillas (UCBL-Ifsttar)
# This work is derived from a CT scan provided by CEESAR under a CCBY-4.0
# License
# 
# wavefront obj file written by the visualization toolkit

mtllib C:/desktop/registration_reference_model/22_REF_LTE635_Assembly_hands_corr/CCTs635_BP063_Rib_r01R.mtl

v 62.787 145.876 -404.708
v 65.479 144.493 -405.648
v 100.331 182.32 -418.622
v 66.724 143.887 -404.72
v 108.48 196.759 -424.99
v 66.28 146.398 -405.968
v 64.34 146.896 -406.084
v 63.249 147.559 -405.234
v 94.476 197.559 -422.033
v 66.311 148.338 -405.566
v 92.39 137.431 -386.053
v 97.729 199.616 -414.671
v 92.109 138.855 -386.998
v 65.544 150.033 -405.023
v 91.934 139.192 -388.842
v 91.534 142.727 -392.866
v 93.873 139.223 -391.565
v 93.016 138.229 -389.98
v 92.122 139.782 -390.617
v 94.195 137.256 -390.956
v 92.976 135.73 -387.926
v 92.765 137.603 -388.261
v 102.483 199.075 -417.042
v 92.231 134.732 -386.991
v 93.544 136.512 -389.481
v 95.302 134.848 -392.603
v 92.953 205.441 -414.267
v 67.489 149.492 -404.028
v 102.079 203.056 -427.714
v 103.649 144.196 -398.087
v 66.771 151.624 -402.752
v 108.507 151.99 -404.27
v 102.897 149.033 -399.911
v 104.882 150.383 -401.261
v 106.965 148.361 -402.057
v 102.801 141.787 -404.371
v 104.833 141.829 -404.784
v 106.571 142.972 -405.441
v 95.639 205.342 -426.355
v 103.219 146.765 -398.824
v 100.727 154.815 -408.49
v 104.933 147.712 -400.383
v 106.115 146.245 -400.865
v 108.008 146.39 -402.726
v 99.289 146.542 -396.97
v 97.322 146.746 -396.665
v 97.121 145.295 -404.575
v 101.52 145.655 -397.295
v 99.32 147.314 -406.109
v 95.507 147.085 -396.744
v 93.124 147.758 -397.569
v 98.715 143.525 -404.169
v 91.637 146.353 -396.005
v 97.158 147.331 -405.118
v 93.068 145.585 -395.55
v 100.946 150.039 -399.99
v 101.068 151.713 -401.405
v 98.316 150.863 -405.765
v 103.277 151.926 -401.624
v 102.887 154.047 -403.479
v 99.403 149.611 -406.711
v 100.126 152.384 -407.593
v 99.814 153.499 -406.809
v 96.948 149.822 -404.32
v 99.86 151.315 -401.303
v 96.51 149.72 -400.837
v 98.564 150.842 -401.292
v 99.129 152.92 -405.184
v 96.23 149.694 -402.64
v 98.779 149.129 -398.862
v 100.796 148.051 -398.528
v 96.936 148.833 -398.608
v 94.339 148.565 -400.112
v 95.081 148.546 -398.702
v 98.148 151.39 -403.067
v 91.847 146.211 -400.873
v 94.184 148.032 -401.777
v 96.535 148.49 -404.611
v 101.49 154.479 -404.288
v 93.665 146.899 -402.278
v 94.187 145.561 -402.951
v 93.112 207.484 -415.919
v 110.966 148.428 -408.93
v 94.688 144.283 -402.97
v 91.832 144.742 -401.404
v 102.385 149.5 -408.37
v 103.207 141.838 -397.418
v 104.494 152.691 -410.467
v 104.883 142.497 -398.92
v 104.714 140.54 -399.575
v 103.894 139.343 -400.117
v 102.792 138.716 -400.855
v 106.568 142.923 -401.088
v 106.819 142.208 -402.063
v 107.296 142.612 -403.931
v 105.635 141.02 -403.542
v 103.996 140.265 -402.899
v 109.931 152.64 -412.455
v 105.679 150.638 -410.068
v 95.818 141.644 -393.716
v 110.251 150.527 -411.341
v 112.238 151.077 -411.333
v 100.227 140.373 -395.305
v 101.044 142.986 -396.088
v 99.572 138.058 -395.339
v 97.794 140.862 -393.957
v 98.528 139.36 -393.964
v 98.079 143.192 -395.223
v 99.81 144.453 -396.096
v 102.34 139.732 -397.154
v 102.559 138.647 -398.383
v 94.95 144.129 -395.152
v 76.047 141.554 -391.413
v 93.007 141.135 -392.494
v 95.47 139.746 -392.638
v 101.554 146.435 -406.579
v 95.543 137.898 -392.277
v 105.205 147.375 -408.24
v 99.473 136.939 -396.655
v 104.961 143.681 -406.141
v 97.341 135.893 -398.035
v 107.982 144.418 -406.35
v 96.656 136.679 -393.3
v 107.97 147.261 -408.646
v 110.224 146.86 -407.264
v 97.298 135.906 -394.778
v 111.952 149.814 -409.689
v 94.96 133.815 -393.366
v 97.437 135.519 -396.181
v 108.782 144.597 -404.821
v 107.703 144.706 -402.4
v 93.582 132.807 -393.08
v 110.183 146.95 -405.454
v 92.445 133.913 -396.586
v 95.743 134.414 -395.876
v 110.333 148.757 -405.197
v 101.594 152.492 -408.822
v 94.508 134.334 -396.717
v 93.365 133.156 -395.313
v 90.974 132.035 -394.675
v 106.606 144.338 -406.678
v 96.336 137.933 -400.36
v 98.028 139.14 -401.312
v 101.3 139.29 -402.002
v 100.145 140.041 -402.374
v 96.203 142.765 -402.857
v 94.034 138.574 -399.899
v 90.011 138.924 -399.037
v 93.403 141.396 -401.295
v 95.695 140.401 -401.4
v 92.273 143.147 -401.496
v 100.411 137.097 -398.393
v 99.376 136.885 -399.36
v 99.226 137.833 -400.569
v 112.23 151.321 -407.972
v 97.241 136.509 -399.113
v 94.999 136.434 -398.717
v 90.55 137.286 -398.13
v 87.296 139.008 -381.297
v 88.479 137.74 -381.135
v 87.165 137.032 -381.243
v 111.546 152.569 -407.331
v 84.225 143.219 -390.907
v 79.909 143.912 -390.602
v 105.253 140.343 -401.85
v 77.865 142.844 -390.927
v 90.919 140.151 -385.274
v 87.724 140.822 -382.428
v 85.584 141.53 -383.935
v 109.286 150.19 -404.319
v 89.015 139.425 -381.752
v 88.99 140.733 -383.008
v 90.619 139.382 -383.591
v 110.245 153.651 -406.365
v 86.398 140.125 -382.068
v 89.572 141.332 -386.333
v 86.467 142.372 -385.169
v 106.135 152.679 -403.233
v 84.71 142.604 -387.034
v 88.541 141.639 -384.531
v 87.583 142.226 -386.133
v 84.261 141.843 -385.562
v 113.331 151.895 -410.782
v 82.142 142.813 -387.156
v 110.223 149.055 -410.109
v 82.443 141.415 -386.33
v 83.641 140.442 -385.466
v 84.492 139.097 -384.477
v 112.1 149.903 -408.306
v 114.018 153.508 -410.205
v 83.281 139.178 -385.973
v 90.655 136.264 -383.168
v 90.385 137.736 -382.499
v 85.699 139.093 -382.193
v 86.291 136.45 -382.287
v 89.214 135.58 -382.027
v 87.835 135.12 -382.279
v 86.524 135.045 -384.428
v 102.77 205.987 -421.207
v 110.157 164.36 -417.176
v 90.772 134.339 -384.9
v 111.34 161.703 -416.61
v 87.675 133.595 -384.796
v 108.392 161.596 -415.501
v 85.161 137.019 -384.556
v 109.465 147.134 -408.371
v 88.574 141.695 -388.946
v 91.02 140.2 -389.381
v 90.5 141.559 -391.613
v 88.463 141.962 -390.695
v 100.485 176.087 -415.843
v 86.274 142.46 -389.79
v 82.118 143.487 -388.498
v 84.776 142.733 -388.751
v 80.86 142.457 -387.841
v 107.494 149.377 -409.911
v 81.141 141.21 -387.846
v 80.307 143.297 -389.44
v 81.787 143.571 -390.053
v 109.557 175.692 -421.032
v 85.207 143.558 -391.781
v 85.274 132.677 -388.631
v 82.893 137.99 -387.464
v 85.041 134.009 -386.999
v 93.228 134.661 -389.451
v 84.348 134.529 -388.308
v 83.322 136.08 -389.135
v 81.63 138.666 -389.371
v 106.855 165.453 -416.194
v 104.306 166.635 -415.348
v 102.525 169.648 -414.951
v 79.554 137.384 -393.242
v 94.636 135.563 -391.34
v 83.105 134.704 -390.563
v 84.543 133.2 -390.361
v 83.729 133.659 -391.813
v 82.272 134.778 -391.894
v 79.503 141.907 -389.69
v 77.634 140.59 -391.315
v 79.67 140.488 -390.217
v 113.176 168.911 -420.114
v 109.568 167.858 -418.234
v 108.282 171.399 -418.992
v 106.425 169.203 -417.095
v 75.509 143.156 -391.845
v 80.424 138.419 -391.258
v 80.636 136.782 -392.217
v 78.06 138.773 -392.889
v 74.112 142.603 -391.897
v 91.453 144.652 -393.981
v 89.54 145.454 -394.585
v 86.2 144.367 -392.977
v 104.17 177.362 -418.673
v 105.627 172.508 -417.483
v 90.328 146.86 -397.001
v 90.736 147.104 -398.798
v 107.115 174.715 -419.514
v 86.915 145.702 -394.733
v 105.793 177.969 -419.944
v 87.514 146.507 -396.491
v 83.82 146.153 -395.098
v 103.198 172.643 -416.256
v 83.692 145.321 -393.641
v 80.213 144.78 -392.67
v 81.25 146.195 -394.434
v 83.196 146.365 -396.272
v 102.065 176.255 -416.99
v 101.392 187.61 -421.073
v 92.508 147.317 -400.286
v 111.176 170.461 -420.179
v 88.334 146.675 -398.083
v 90.112 145.034 -400.433
v 89.636 146.196 -399.514
v 111.272 172.562 -415.6
v 86.474 145.678 -398.492
v 83.594 145.64 -397.564
v 78.479 146.347 -394.589
v 76.919 144.434 -392.55
v 76.387 146.147 -394.256
v 108.367 174.948 -415.193
v 80.506 146.748 -395.406
v 80.602 146.526 -396.98
v 78.035 146.953 -396.052
v 74.696 147.148 -396.017
v 76.977 146.962 -397.237
v 86.687 146.446 -397.261
v 100.589 155.563 -407.292
v 101.778 180.222 -415.296
v 72.101 144.976 -392.939
v 74.123 145.552 -393.442
v 72.637 146.929 -395.057
v 100.896 154.869 -405.359
v 71.384 148.109 -396.831
v 91.929 196.391 -419.677
v 78.348 146.16 -398.033
v 107.658 157.356 -413.544
v 76.005 145.608 -399.506
v 71.093 148.424 -398.22
v 73.23 147.69 -398.093
v 73.294 146.642 -399.859
v 74.795 146.932 -398.649
v 93.066 192.942 -420.465
v 104.113 179.784 -415.603
v 69.448 148.978 -397.903
v 69.952 148.741 -399.563
v 103.873 155.653 -411.217
v 70.805 147.809 -400.249
v 102.717 157.011 -410.951
v 74.071 145.047 -400.304
v 72.64 144.26 -400.841
v 106.566 188.118 -417.628
v 92.158 195.102 -420.491
v 101.818 158.563 -409.137
v 102.155 160.141 -410.819
v 71.192 146.383 -401.254
v 109.243 154.884 -413.281
v 70.364 145.476 -402.286
v 112.473 154.586 -413.794
v 110.6 159.156 -415.47
v 111.575 154.909 -413.99
v 88.223 143.367 -392.476
v 75.227 139.903 -392.421
v 85.433 138.737 -397.242
v 94.097 194.928 -421.849
v 83.451 139.793 -397.795
v 81.429 138.608 -396.765
v 86.671 133.69 -393.903
v 87.34 135.244 -395.43
v 101.862 157.655 -410.144
v 102.738 160.004 -411.977
v 90.566 135.453 -397.068
v 87.736 137.578 -397.176
v 104.189 159.552 -412.941
v 105.111 162.141 -414.387
v 89.733 133.523 -395.869
v 103.155 163.237 -413.519
v 102.82 166.185 -413.936
v 85.566 137.083 -395.692
v 102.506 166.016 -412.752
v 102.581 160.851 -409.653
v 83.879 136.624 -394.965
v 102.502 162.279 -411.209
v 102.532 163.058 -412.392
v 94.394 191.632 -420.585
v 81.233 136.589 -394.629
v 80.333 137.825 -395.768
v 103.353 162.956 -410.293
v 84.939 133.974 -393.42
v 106.032 165.071 -410.534
v 82.379 135.796 -394.214
v 85.457 133.016 -392.076
v 81.888 135.091 -393.077
v 88.861 141.184 -399.791
v 89.624 143.244 -400.477
v 85.8 140.127 -398.358
v 85.734 144.164 -398.962
v 84.482 142.906 -398.691
v 83.001 144.72 -398.161
v 95.087 195.74 -422.91
v 111.117 162.182 -410.413
v 81.418 143.774 -398.464
v 109.958 164.475 -411.285
v 83.326 141.608 -398.359
v 108.453 162.754 -409.561
v 73.553 141.21 -392.06
v 73.69 139.649 -393.405
v 75.405 138.895 -394.229
v 93.92 196.356 -421.722
v 102.49 156.251 -405.638
v 101.85 157.84 -407.603
v 71.428 143.838 -392.57
v 70.791 142.334 -392.83
v 71.468 140.635 -393.433
v 104.116 156.526 -405.296
v 105.202 154.785 -404.272
v 71.862 139.738 -394.744
v 74.985 139.179 -396.231
v 72.659 139.457 -395.866
v 108.411 156.391 -406.008
v 112.888 156.086 -409.429
v 69.451 140.525 -397.577
v 68.772 141.099 -395.916
v 78.236 138.163 -394.222
v 79.34 137.697 -394.971
v 80.337 142.555 -398.686
v 79.572 144.964 -398.532
v 110.773 157.545 -408.249
v 77.784 143.54 -399.446
v 75.306 142.899 -399.805
v 108.972 158.979 -407.723
v 78.926 139.809 -397.861
v 80.718 140.612 -398.114
v 74.893 140.102 -397.97
v 106.724 158.27 -406.341
v 71.871 143.232 -400.875
v 74.545 141.935 -399.44
v 72.062 141.388 -399.416
v 71.205 140.446 -398.124
v 69.592 142.63 -401.582
v 68.431 144.19 -403.735
v 103.021 159.277 -407.762
v 104.059 161.025 -408.569
v 104.597 163.033 -409.709
v 105.074 159.569 -407.106
v 107.657 160.514 -408.08
v 106.1 161.978 -408.896
v 67.524 150.09 -397.692
v 101.394 171.109 -414.238
v 101.989 169.612 -412.721
v 101.276 174.038 -415.43
v 65.123 150.21 -396.083
v 101.113 173.781 -413.103
v 100.901 171.83 -413.472
v 100.447 174.675 -414.509
v 100.002 176.514 -414.428
v 99.745 177.486 -415.813
v 101.103 175.702 -413.392
v 65.789 151.053 -397.418
v 63.408 149.63 -396.508
v 95.715 199.527 -423.088
v 102.12 168.364 -413.649
v 102.163 171.328 -412.136
v 69.571 146.774 -394.269
v 68.414 147.881 -395.101
v 108.894 168.363 -412.737
v 66.477 148.234 -394.866
v 106.759 169.254 -412.315
v 104.455 166.032 -411.084
v 103.914 167.838 -411.823
v 64.023 148.978 -395.229
v 107.686 166.657 -411.693
v 103.141 167.38 -412.082
v 95.989 194.196 -422.368
v 105.535 168.05 -411.779
v 67.484 146.936 -394.076
v 68.302 144.615 -393.475
v 110.874 169.393 -414.217
v 65.603 146.68 -394.339
v 68.08 148.646 -395.865
v 113.196 169.873 -415.456
v 111.077 166.553 -412.836
v 63.813 147.143 -395.182
v 64.493 145.051 -395.22
v 92.391 198.52 -415.701
v 62.926 149.627 -397.605
v 104.079 188.355 -416.207
v 62.64 147.119 -396.401
v 63.001 144.583 -397.235
v 65.356 152.874 -399.76
v 64.371 151.654 -397.776
v 108.143 171.406 -413.773
v 105.357 171.296 -412.441
v 63.207 152.188 -399.185
v 63.137 152.017 -400.716
v 102.789 172.531 -412.264
v 68.417 149.883 -399.308
v 103.777 173.089 -412.642
v 64.934 152.981 -400.765
v 65.245 152.024 -403.326
v 68.904 149.189 -401.001
v 66.531 152.012 -400.584
v 69.215 148.166 -402.262
v 63.125 150.595 -403.272
v 64.107 152.12 -402.612
v 64.159 149.627 -404.913
v 62.44 151.278 -399.783
v 67.526 147.068 -404.902
v 112.924 163.639 -417.7
v 69.707 144.461 -402.707
v 102.948 186.293 -415.612
v 115.086 161.177 -416.391
v 61.977 147.736 -398.123
v 61.737 148.592 -400.107
v 113.453 161.512 -416.863
v 116 163.398 -417.202
v 116.768 165.592 -416.512
v 62.297 144.742 -399.468
v 115.447 170.024 -419.733
v 114.606 170.373 -420.37
v 61.882 146.564 -398.686
v 112.822 173.713 -421.404
v 63.178 142.803 -400.626
v 62.162 147.35 -403.646
v 114.128 172.924 -421.224
v 62.04 146.042 -402.818
v 115.303 173.104 -420.673
v 115.749 175.003 -420.784
v 62.436 144.409 -401.863
v 114.589 164.002 -417.88
v 115.135 167.587 -419.162
v 62.885 144.247 -403.795
v 112.114 166.529 -418.876
v 69.064 142.637 -393.643
v 67.259 143.317 -394.599
v 115.929 168.556 -418.78
v 67.428 142.154 -395.663
v 67.118 141.102 -397.827
v 64.179 143.392 -396.521
v 65.398 142.126 -397.044
v 68.195 140.805 -399.391
v 115.923 168.059 -416.499
v 116.569 166.642 -417.703
v 116.154 168.989 -417.76
v 115.331 170.688 -417.285
v 105.231 185.61 -416.67
v 115.499 173.352 -418.222
v 116.005 171.043 -418.607
v 115.89 171.969 -419.75
v 106.286 182.155 -416.737
v 64.824 141.234 -399.611
v 65.609 140.892 -400.099
v 94.042 190.477 -419.307
v 115.839 174.038 -419.468
v 69.441 141.197 -399.791
v 114.055 171.197 -416.498
v 67.51 142.479 -402.773
v 64.717 141.646 -401.564
v 112.738 159.748 -416.213
v 65.377 142.615 -403.861
v 114.374 156.017 -414.009
v 114.222 158.73 -415.688
v 115.196 158.638 -415.078
v 66.579 141.212 -401.16
v 63.699 142.732 -398.413
v 63.501 142.829 -402.649
v 92.57 133.32 -389.86
v 91.671 131.739 -391.068
v 92.491 132.201 -393.378
v 115.098 156.283 -413.255
v 115.29 157.512 -414.096
v 89.012 133.473 -384.566
v 90.115 130.984 -388.064
v 115.785 158.992 -413.778
v 88.666 130.433 -388.862
v 115.914 160.534 -415.22
v 91.003 131.377 -389.013
v 89.984 130.344 -389.48
v 86.273 132.576 -386.905
v 86.985 131.295 -388.426
v 113.407 161.37 -411.792
v 103.473 183.754 -416.024
v 90.713 131.147 -391.981
v 87.806 130.812 -390.426
v 89.031 130.522 -390.671
v 87.707 132.031 -392.478
v 86.11 131.918 -390.502
v 89.579 132.26 -394.804
v 114.934 156.218 -411.96
v 94.961 205.154 -414.129
v 92.748 192.19 -418.475
v 98.508 202.04 -414.325
v 91.68 196.711 -417.731
v 113.436 154.365 -409.355
v 96.835 202.555 -414.036
v 94.914 203.121 -414.154
v 96.503 197.735 -414.83
v 94.74 199.861 -414.733
v 114.52 158.489 -411.684
v 104.972 197.593 -419.194
v 115.229 157.808 -412.376
v 104.001 204.544 -421.337
v 107.147 201.714 -423.334
v 92.499 198.366 -418.586
v 105.017 204.688 -423.677
v 112.11 159.641 -409.884
v 103.472 206.708 -423.284
v 94.347 189.564 -417.606
v 108.141 198.95 -424.382
v 114.992 160.414 -412.809
v 105.587 203.968 -424.316
v 106.699 201.127 -422.141
v 115.967 161.14 -414.341
v 114.97 164.638 -414.045
v 107.276 201.254 -424.682
v 116.079 163.729 -414.683
v 116.491 163.359 -415.917
v 94.532 198.273 -420.392
v 112.158 163.834 -412.146
v 97.524 204.477 -414.431
v 115.699 166.602 -415.239
v 98.778 205.521 -415.593
v 101.17 206.711 -418.528
v 99.213 207.064 -417.386
v 105.381 195.131 -425.373
v 97.559 207.483 -416.905
v 107.295 197.775 -425.85
v 101.548 206.745 -421.1
v 95.84 203.823 -426.575
v 100.938 204.219 -416.803
v 95.575 203.035 -424.974
v 102.947 201.654 -418.279
v 103.174 203.811 -419.527
v 100.117 191.689 -422.28
v 100.909 196.158 -424.768
v 95.697 207.001 -414.966
v 94.253 206.714 -417.016
v 100.224 207.629 -418.776
v 99.55 203.042 -427.715
v 92.139 205.855 -416.319
v 98.789 201.196 -426.966
v 97.226 204.371 -427.395
v 96.386 202.162 -426.456
v 100.613 201.102 -427.316
v 95.345 206.106 -417.73
v 93.763 206.974 -414.518
v 93.023 203.459 -414.569
v 95.992 207.328 -417.365
v 97.054 206.745 -418.508
v 99.539 203.15 -415.073
v 99.814 199.237 -415.433
v 98.166 197.467 -415.01
v 100.684 196.299 -415.563
v 91.923 203.876 -415.999
v 92.306 202.276 -415.238
v 98.56 206.348 -427.413
v 96.664 206.554 -426.787
v 92.551 202.959 -417.052
v 93.434 192.497 -416.864
v 91.916 200.845 -416.295
v 91.975 198.667 -416.953
v 100.513 204.758 -428.019
v 111.324 178.678 -417.76
v 97.027 203.601 -419.327
v 95.151 202.587 -418.21
v 96.644 201.195 -419.994
v 93.734 200.158 -418.547
v 92.596 200.198 -417.658
v 100.213 209.106 -423.582
v 99.762 208.327 -422.821
v 100.284 206.557 -421.02
v 98.838 205.733 -420.6
v 100.634 206.81 -421.904
v 99.243 208.144 -426.575
v 108.461 191.876 -424.899
v 99.361 205.381 -421.597
v 103.402 200.411 -426.911
v 98.901 206.073 -422.432
v 101.578 208.58 -424.651
v 100.062 209.114 -425.272
v 98.014 208.47 -425.575
v 102.654 197.909 -426.103
v 98.67 208.93 -423.752
v 104.204 202.386 -426.781
v 107.117 199.875 -425.611
v 104.979 203.639 -426.009
v 102.07 205.68 -427.729
v 102.781 206.574 -426.992
v 103.786 204.283 -426.979
v 110.916 187.455 -420.925
v 104.048 206.035 -425.66
v 98.031 207.725 -423.441
v 96.738 207.33 -425.582
v 95.668 205.537 -425.318
v 98.037 202.334 -421.002
v 98.216 204.066 -422.441
v 97.662 202.04 -422.148
v 96.198 202.453 -423.84
v 99.272 180.235 -415.501
v 92.176 195.177 -416.995
v 99.29 179.998 -416.823
v 99.259 178.901 -415.75
v 97.044 197.16 -424.258
v 100.347 178.653 -417.038
v 99.051 182.186 -417.85
v 98.669 181.937 -416.406
v 96.719 200.465 -421.207
v 100.22 180.471 -415.385
v 96.367 204.913 -424.209
v 97.155 184.378 -417.977
v 96.226 188.631 -419.908
v 109.918 181.715 -418.014
v 95.755 186.607 -418.065
v 95.794 189.928 -415.625
v 96.065 200.556 -423.154
v 98.881 185.997 -419.73
v 99.424 207.196 -420.273
v 95.88 201.137 -425.049
v 98.665 190.153 -414.68
v 95.995 198.935 -424.109
v 94.891 196.795 -414.974
v 101.534 183.738 -419.776
v 97.17 199.94 -425.66
v 113.671 179.238 -419.275
v 96.713 186.28 -418.961
v 113.49 175.127 -417.498
v 114.406 176.12 -418.473
v 97.288 190.412 -421.054
v 108.788 178.378 -416.735
v 111.179 183.926 -419.529
v 98.078 182.896 -417.102
v 113.548 182.876 -420.822
v 111.664 189.173 -424.193
v 114.447 182.361 -421.678
v 101.538 182.701 -415.729
v 99.604 182.721 -415.768
v 95.382 187.605 -416.963
v 96.243 185.42 -416.894
v 97.881 184.052 -416.031
v 96.299 186.893 -416.009
v 97.185 188.77 -415.153
v 97.864 186.182 -415.328
v 99.139 186.755 -414.93
v 113.496 184.705 -422.183
v 114.622 180.732 -421.007
v 107.524 181.097 -421.469
v 115.068 178.771 -420.799
v 115.112 177.437 -419.915
v 114.361 178.749 -422.347
v 115.185 177.159 -421.123
v 114.674 175.598 -421.685
v 115.689 176.181 -420.038
v 97.796 192.737 -414.494
v 96.29 192.161 -414.754
v 105.719 175.558 -414.372
v 102.314 176.282 -413.557
v 101.32 177.172 -413.816
v 100.087 178.146 -414.455
v 112.685 177.989 -422.309
v 111.637 177.597 -422.007
v 102 193.175 -415.622
v 103.616 195.319 -417.275
v 101.068 187.825 -414.824
v 102.629 188.438 -415.325
v 112.847 180.455 -422.993
v 106.417 194.177 -419.527
v 104.718 191.459 -417.213
v 109.491 195.064 -423.088
v 110.54 193.411 -423.59
v 99.721 193.078 -414.762
v 93.091 199.229 -415.159
v 108.767 197.449 -423.46
v 108.029 184.976 -417.826
v 108.666 195.206 -425.179
v 109.575 184.432 -422.835
v 98.335 207.654 -418.891
v 109.62 194.984 -424.36
v 107.363 194.162 -425.28
v 107.709 198.937 -422.332
v 108.145 197.201 -422.299
v 107.062 195.966 -425.754
v 92.198 193.51 -419.665
v 106.167 192.532 -424.474
v 104.369 189.97 -422.815
v 102.731 194.047 -424.263
v 110.653 192.73 -424.486
v 108.937 194.809 -422.181
v 112.592 185.788 -421.411
v 105.03 185.112 -421.497
v 112.684 184.439 -423.394
v 114.141 181.065 -422.91
v 91.567 194.737 -418.847
v 94.851 190.601 -416.155
v 109.143 187.493 -419.463
v 110.72 190.126 -422.052
v 112.091 186.996 -423.509
v 112.258 188.519 -422.813
v 103.643 181.091 -415.875
v 110.787 188.421 -424.214
v 93.566 195.257 -415.704
v 111.43 184.648 -423.393
v 110.588 191.096 -424.709
v 111.252 190.952 -423.459
v 109.078 187.877 -423.679
v 109.326 193.077 -425.128
v 104.119 181.121 -420.087
v 64.129 143.86 -404.981
v 91.786 206.332 -415.157
v 81.349 144.083 -391.658
v 90.031 132.662 -386.209
v 101.912 208.081 -423.191
v 88.133 131.616 -386.846
v 94.762 207.52 -415.632
v 62.151 149.159 -402.284
v 94.335 207.44 -415.821
v 62.426 149.906 -401.999
vn -0.776997 -0.18366 -0.602116
vn 0.077835 -0.439982 -0.894627
vn -0.421153 -0.372606 -0.826919
vn 0.391043 -0.538628 -0.746302
vn 0.728381 0.221281 -0.648456
vn 0.360734 -0.0481954 -0.931423
vn -0.283119 0.0373694 -0.958357
vn -0.67502 0.189538 -0.713038
vn -0.866574 0.332686 -0.371981
vn 0.368206 0.303556 -0.878794
vn 0.92769 0.0985508 0.360109
vn 0.142492 -0.15894 0.976951
vn 0.862669 0.486231 0.139215
vn 0.131544 0.537889 -0.83269
vn 0.767275 0.618893 0.16811
vn 0.282196 0.520444 0.805918
vn 0.532346 0.437122 0.724935
vn 0.766662 0.460867 0.447024
vn 0.580723 0.653701 0.485216
vn 0.751323 0.216808 0.623305
vn 0.926838 -0.115356 0.357302
vn 0.917789 0.326055 0.226609
vn 0.634012 0.137682 0.760968
vn 0.824616 -0.380896 0.418243
vn 0.895212 0.120053 0.429165
vn 0.747448 -0.441897 0.496033
vn -0.364478 0.0356432 0.93053
vn 0.67866 0.428378 -0.596585
vn 0.205554 -0.113775 -0.97201
vn 0.593182 0.210054 0.777182
vn 0.600072 0.716032 -0.356668
vn 0.557597 0.294143 0.776251
vn 0.323045 0.447854 0.833708
vn 0.410039 0.383427 0.827558
vn 0.611612 0.186939 0.768755
vn -0.176436 -0.59289 -0.785717
vn 0.0316845 -0.692278 -0.720935
vn 0.30865 -0.716146 -0.625995
vn -0.891013 0.202421 -0.406352
vn 0.476474 0.385895 0.789973
vn -0.848114 0.0518148 -0.527274
vn 0.529918 0.277618 0.801321
vn 0.661855 0.158299 0.732727
vn 0.72775 0.026204 0.685342
vn 0.229714 0.505333 0.831787
vn 0.100338 0.524604 0.845413
vn -0.381992 -0.335805 -0.860998
vn 0.405314 0.397477 0.823245
vn -0.379279 -0.284378 -0.880498
vn 0.0367648 0.631901 0.774177
vn -0.159243 0.880686 0.446133
vn -0.268449 -0.482363 -0.833823
vn 0.0394604 0.779208 0.625522
vn -0.514689 -0.108108 -0.850534
vn 0.181029 0.637822 0.748606
vn 0.117506 0.616785 0.778311
vn -0.0919896 0.680456 0.726992
vn -0.764137 0.234651 -0.600861
vn 0.161646 0.57678 0.800747
vn -0.066265 0.670795 0.738677
vn -0.558482 -0.116564 -0.821286
vn -0.731878 0.00597697 -0.681409
vn -0.895388 0.231078 -0.380636
vn -0.777243 0.509323 -0.369437
vn -0.248122 0.755517 0.606325
vn -0.422723 0.872205 0.246097
vn -0.31226 0.842356 0.439239
vn -0.827945 0.559849 -0.0328069
vn -0.645385 0.756233 -0.107659
vn 0.0477541 0.704456 0.708139
vn 0.266902 0.542272 0.796683
vn -0.101243 0.800579 0.590612
vn -0.467036 0.884227 -0.00448956
vn -0.206203 0.891916 0.40245
vn -0.627564 0.749529 0.21064
vn -0.536463 0.463127 -0.705494
vn -0.671781 0.647293 -0.360169
vn -0.687411 0.192577 -0.700272
vn -0.340403 0.711702 0.614497
vn -0.669124 0.361542 -0.649276
vn -0.556951 -0.0274689 -0.830091
vn -0.388204 0.896001 -0.21559
vn 0.619569 -0.669789 -0.409288
vn -0.412254 -0.281248 -0.866572
vn -0.498724 0.101734 -0.86077
vn -0.381911 -0.339893 -0.859428
vn 0.650788 -0.0539696 0.757338
vn -0.392642 -0.325361 -0.860216
vn 0.731854 -0.0765528 0.677148
vn 0.76744 -0.45418 0.4525
vn 0.634059 -0.763868 0.12031
vn 0.364167 -0.879673 -0.305872
vn 0.82769 -0.202257 0.52347
vn 0.838614 -0.473811 0.268754
vn 0.715439 -0.677875 -0.16921
vn 0.425633 -0.81019 -0.403024
vn 0.159724 -0.818365 -0.552057
vn -0.200918 -0.452712 -0.868725
vn -0.291959 -0.412214 -0.863041
vn 0.255288 0.483233 0.837445
vn -0.0333711 -0.573021 -0.818861
vn 0.444786 -0.642794 -0.623684
vn 0.5827 -0.0283985 0.812191
vn 0.458 0.212066 0.863287
vn 0.670539 -0.417811 0.613035
vn 0.375971 0.311187 0.872816
vn 0.565452 -0.00643804 0.824756
vn 0.217115 0.424937 0.8788
vn 0.273413 0.351031 0.895557
vn 0.669368 -0.341315 0.659887
vn 0.651154 -0.681622 0.33375
vn 0.222603 0.5037 0.834706
vn -0.243473 -0.14091 0.959617
vn 0.355803 0.542663 0.760868
vn 0.384213 0.326007 0.863771
vn -0.289588 -0.43026 -0.854994
vn 0.582865 0.092173 0.807324
vn -0.21891 -0.47094 -0.854572
vn 0.586011 -0.759653 0.281991
vn -0.119208 -0.545076 -0.829868
vn 0.255465 -0.891448 -0.374244
vn 0.455164 -0.70157 -0.548293
vn 0.68655 -0.278103 0.671794
vn -0.0342215 -0.582171 -0.812346
vn 0.728265 -0.642239 -0.23908
vn 0.695475 -0.593142 0.405583
vn 0.679664 -0.67275 -0.292343
vn 0.670376 -0.708236 0.221353
vn 0.587817 -0.808938 0.00948834
vn 0.82786 -0.558152 0.0558109
vn 0.820191 -0.119551 0.559458
vn 0.569988 -0.818906 0.0671367
vn 0.881218 -0.332975 0.335533
vn -0.0168022 -0.665393 -0.746304
vn 0.45024 -0.867898 -0.209852
vn 0.80102 -0.025182 0.598108
vn -0.554256 -0.202324 -0.807382
vn 0.200962 -0.796297 -0.570548
vn 0.319023 -0.86136 -0.395326
vn 0.0959255 -0.85797 -0.504664
vn 0.0586074 -0.597065 -0.800049
vn -0.186064 -0.56236 -0.805687
vn -0.167321 -0.510838 -0.843237
vn -0.00258363 -0.716767 -0.697308
vn -0.195457 -0.561229 -0.80425
vn -0.287187 -0.451881 -0.844587
vn -0.250431 -0.503032 -0.82719
vn -0.264712 -0.493895 -0.828248
vn -0.278108 -0.405881 -0.870584
vn -0.238524 -0.46131 -0.854576
vn -0.381253 -0.205055 -0.901443
vn 0.471854 -0.881484 0.0184601
vn 0.228669 -0.880889 -0.414421
vn -0.00405081 -0.698242 -0.71585
vn 0.820068 -0.0664537 0.568394
vn -0.0187132 -0.795821 -0.605243
vn -0.118871 -0.644241 -0.755529
vn -0.264067 -0.511665 -0.817599
vn -0.162837 0.27075 0.948777
vn 0.267953 -0.0280468 0.963024
vn -0.324897 -0.264309 0.908065
vn 0.709448 0.135146 0.691678
vn 0.167649 0.926148 0.337852
vn -0.152378 0.858409 0.489811
vn 0.618053 -0.784236 -0.0546348
vn -0.429114 0.289976 0.855438
vn 0.743513 0.627583 0.230928
vn 0.0866148 0.738578 0.668581
vn -0.460033 0.660241 0.593677
vn 0.663789 0.167253 0.728979
vn 0.446894 0.41175 0.794197
vn 0.478974 0.725946 0.493544
vn 0.775299 0.416379 0.474911
vn 0.637784 0.251053 0.728152
vn -0.393432 0.498429 0.772516
vn 0.527526 0.848198 0.0477146
vn 0.0105437 0.958032 0.286469
vn 0.372561 0.45705 0.807653
vn 0.0587553 0.968018 0.243905
vn 0.385711 0.879138 0.279898
vn 0.289988 0.955748 0.0495287
vn -0.400157 0.66386 0.631795
vn 0.824766 -0.527848 -0.202826
vn -0.29992 0.709561 0.63763
vn 0.163831 -0.674776 -0.719608
vn -0.605953 0.106649 0.788319
vn -0.650897 0.0893192 0.753893
vn -0.812998 -0.0598441 0.579183
vn 0.894406 -0.402094 0.195851
vn 0.928188 -0.206513 0.309547
vn -0.769754 -0.246074 0.589004
vn 0.774251 -0.262877 0.5757
vn 0.743417 0.0460203 0.667243
vn -0.742536 0.0849147 0.664401
vn -0.715438 -0.451371 0.533304
vn 0.38163 -0.489621 0.783983
vn -0.243343 -0.699144 0.672296
vn -0.672429 -0.566002 0.47695
vn 0.669523 0.620775 0.407893
vn -0.329561 -0.337527 -0.88174
vn 0.648547 -0.551421 0.524711
vn -0.243728 -0.329876 -0.912019
vn -0.378891 -0.712549 0.590522
vn -0.3469 -0.321091 -0.881227
vn -0.814922 -0.385515 0.432759
vn 0.289615 -0.703915 -0.648557
vn 0.421749 0.906628 0.0123879
vn 0.603744 0.777017 0.178153
vn 0.362135 0.710871 0.602927
vn 0.356605 0.862219 0.359737
vn -0.743494 -0.379377 -0.550718
vn 0.26632 0.950672 0.159047
vn -0.0418354 0.964703 0.259994
vn 0.222 0.971597 0.0819447
vn -0.68243 0.334594 0.649874
vn -0.19344 -0.502432 -0.8427
vn -0.758303 -0.275357 0.590893
vn -0.427951 0.722948 0.542406
vn 0.105216 0.974578 0.197806
vn -0.336269 -0.237843 -0.911238
vn 0.158675 0.823171 0.545172
vn -0.731857 -0.649601 0.20592
vn -0.801407 -0.418689 0.427136
vn -0.787134 -0.442848 0.429308
vn 0.849459 -0.368041 0.378108
vn -0.834287 -0.434564 0.339291
vn -0.813108 -0.41743 0.405719
vn -0.752885 -0.453168 0.477287
vn -0.390364 -0.281637 -0.876525
vn -0.513515 -0.244142 -0.822616
vn -0.672257 -0.263967 -0.691659
vn -0.618428 -0.759079 0.203339
vn 0.787197 -0.172836 0.591988
vn -0.727352 -0.561034 0.395221
vn -0.674611 -0.734164 0.0768275
vn -0.517657 -0.849025 -0.105766
vn -0.694698 -0.686105 0.215998
vn -0.681321 -0.0551715 0.729902
vn -0.36324 -0.426837 0.828171
vn -0.585259 -0.44153 0.680091
vn -0.026434 -0.349255 -0.936655
vn -0.412678 -0.329454 -0.84921
vn -0.481313 -0.297394 -0.824557
vn -0.457169 -0.252856 -0.852678
vn -0.155163 0.389416 0.907899
vn -0.64005 -0.513661 0.571392
vn -0.728575 -0.526173 0.438543
vn -0.396779 -0.760606 0.513853
vn -0.191925 0.136861 0.97182
vn 0.211621 0.625188 0.751236
vn 0.0648285 0.778704 0.624033
vn 0.13805 0.743655 0.654156
vn -0.485153 -0.328843 -0.81024
vn -0.500111 -0.281517 -0.818924
vn -0.125098 0.942331 0.310425
vn -0.340432 0.922785 -0.180481
vn -0.481056 -0.309275 -0.820325
vn 0.0586749 0.845654 0.530497
vn -0.449926 -0.274544 -0.849819
vn -0.0598143 0.973735 0.219687
vn 0.0876321 0.93729 0.337354
vn -0.496738 -0.270508 -0.824668
vn 0.103042 0.80948 0.578036
vn 0.0134328 0.844863 0.534815
vn 0.021217 0.840836 0.540874
vn 0.0804092 0.983755 -0.160504
vn -0.500473 -0.346338 -0.793459
vn -0.276291 -0.326552 -0.903895
vn -0.524078 0.710399 -0.469761
vn -0.320489 -0.303866 -0.897191
vn -0.234922 0.936781 -0.259334
vn -0.423855 0.295026 -0.856333
vn -0.373205 0.649371 -0.662597
vn 0.395071 0.321294 0.860633
vn -0.305331 0.648079 -0.697687
vn -0.0803766 0.717807 -0.691587
vn 0.00147309 0.846727 0.532025
vn -0.098394 0.686531 0.720412
vn 0.0469119 0.810315 0.584113
vn 0.370251 0.335208 0.866343
vn 0.0706411 0.971919 0.22446
vn 0.123417 0.879616 -0.459395
vn 0.0787496 0.994681 0.0663962
vn 0.130325 0.94855 0.288562
vn 0.216045 0.949004 -0.2296
vn -0.171315 0.961077 -0.216752
vn -0.910173 0.414012 0.0134113
vn 0.105495 0.31203 0.944197
vn -0.0439868 0.482271 0.874917
vn 0.035089 0.679165 0.733147
vn 0.120677 0.836558 0.534422
vn -0.598551 0.666137 0.44497
vn 0.254288 0.919911 0.298497
vn -0.84171 0.321185 -0.43401
vn 0.247684 0.768272 -0.590264
vn -0.368121 -0.334249 -0.86762
vn 0.305027 0.472235 -0.827014
vn 0.363239 0.92967 -0.0614043
vn 0.299023 0.935664 -0.187397
vn 0.38628 0.638074 -0.66607
vn 0.284612 0.80173 -0.525572
vn -0.64118 -0.427581 -0.63723
vn 0.239739 0.31393 0.91868
vn 0.413191 0.888107 0.201346
vn 0.560514 0.813409 -0.155531
vn -0.45067 -0.300992 -0.840417
vn 0.557014 0.706815 -0.436059
vn -0.635956 -0.232607 -0.735836
vn 0.326574 0.175376 -0.928759
vn 0.381061 -0.108654 -0.918143
vn 0.540305 0.18093 0.821788
vn -0.784975 -0.0314256 -0.61873
vn -0.932 0.347111 0.104356
vn -0.974666 0.134914 -0.178394
vn 0.564602 0.393214 -0.725677
vn -0.312978 -0.367374 -0.875832
vn 0.642396 0.0914118 -0.760902
vn 0.156897 -0.521763 -0.838539
vn -0.287779 -0.343482 -0.893982
vn -0.108023 -0.445631 -0.888675
vn 0.19735 0.698978 0.687374
vn -0.233258 -0.676462 0.698563
vn -0.20144 -0.630287 -0.749774
vn -0.536922 -0.232381 -0.810996
vn -0.0845048 -0.503922 -0.859605
vn -0.0368009 -0.668168 -0.7431
vn -0.399531 -0.662336 -0.633788
vn -0.407875 -0.493022 -0.768484
vn -0.888465 -0.00507528 -0.458916
vn -0.777544 -0.152782 -0.609986
vn -0.268076 -0.472189 -0.839746
vn -0.328688 -0.552485 -0.76598
vn -0.480408 -0.311928 -0.819701
vn -0.428435 -0.297563 -0.85317
vn -0.294612 -0.528634 -0.796084
vn -0.699008 -0.2163 -0.681617
vn -0.813977 -0.203452 -0.544104
vn -0.269896 -0.599783 -0.753271
vn -0.991238 0.0225015 0.130154
vn -0.796038 0.401334 0.45305
vn -0.124066 -0.614538 -0.779071
vn -0.971336 0.147829 0.186151
vn -0.960637 -0.0822031 -0.265368
vn -0.458967 -0.449349 -0.766443
vn -0.341199 -0.7556 -0.559152
vn -0.1724 -0.77613 -0.606548
vn -0.611668 0.376236 0.695923
vn -0.30996 -0.72697 -0.612731
vn 0.0337603 0.443409 0.895683
vn -0.215562 -0.658313 -0.721219
vn -0.424123 -0.822251 -0.379503
vn -0.583459 -0.768146 -0.263681
vn -0.288924 -0.313618 -0.904526
vn -0.361704 -0.0388635 -0.931483
vn -0.227793 -0.48585 -0.843837
vn -0.309543 0.264134 -0.913464
vn -0.222671 0.0111 -0.974831
vn -0.0254766 0.424323 -0.905153
vn -0.536152 -0.255766 -0.804441
vn 0.466262 0.429223 0.773542
vn 0.0799492 0.101195 -0.991649
vn 0.368891 0.469466 0.802197
vn -0.0953536 -0.206993 -0.973685
vn 0.240044 0.485406 0.84069
vn -0.291524 -0.342222 0.893251
vn -0.288055 -0.828487 0.480242
vn -0.240505 -0.952046 0.18912
vn -0.712724 0.233047 -0.661599
vn -0.359985 0.626147 0.691629
vn -0.711879 0.55712 0.427604
vn -0.202652 0.181581 0.962268
vn -0.377158 -0.255781 0.890128
vn -0.439783 -0.654019 0.615507
vn -0.110855 0.562902 0.819056
vn 0.158871 0.53029 0.832798
vn -0.344647 -0.908211 0.237426
vn -0.162524 -0.943324 -0.289354
vn -0.211258 -0.973198 -0.090856
vn 0.438654 0.380263 0.814237
vn 0.629734 0.237258 0.739692
vn -0.217227 -0.974308 -0.0594659
vn -0.457589 -0.811748 0.362873
vn -0.400578 -0.905971 0.136945
vn -0.355418 -0.897581 -0.260818
vn 0.160689 -0.0795757 -0.983792
vn 0.242921 0.40209 -0.882787
vn 0.557909 0.298795 0.774247
vn 0.258075 -0.00356687 -0.966118
vn 0.166101 -0.289802 -0.942563
vn 0.417532 0.419332 0.806119
vn 0.0288733 -0.608582 -0.792966
vn 0.0616421 -0.408666 -0.9106
vn -0.0429797 -0.772378 -0.633707
vn 0.182078 0.497807 0.84796
vn 0.369639 -0.407757 -0.834926
vn 0.118035 -0.517896 -0.847261
vn 0.122543 -0.718102 -0.685064
vn -0.0636597 -0.903058 -0.424774
vn 0.380176 -0.633644 -0.673767
vn 0.573338 -0.368221 -0.731913
vn -0.535986 0.559192 0.632474
vn -0.349946 0.563108 0.74863
vn -0.252587 0.466234 0.847836
vn -0.113384 0.577764 0.80829
vn 0.202512 0.514426 0.83328
vn -0.0142524 0.530577 0.847517
vn 0.532195 0.763231 0.366396
vn -0.865444 -0.325574 -0.380798
vn -0.819337 -0.249254 0.516295
vn -0.691712 -0.326113 -0.644348
vn 0.00538234 0.702852 0.711316
vn -0.681441 0.0818536 0.727282
vn -0.960892 -0.215163 0.174329
vn -0.972956 -0.230941 -0.00481722
vn -0.905176 -0.102778 0.412424
vn -0.9159 -0.307327 -0.25822
vn -0.455338 0.172999 0.873349
vn 0.337022 0.763009 0.551574
vn -0.696634 0.502545 0.512006
vn -0.905464 0.399469 -0.143388
vn -0.963157 -0.256428 -0.0810808
vn -0.422558 0.00611435 0.906315
vn 0.121846 0.694519 0.709082
vn 0.204069 0.718077 0.665373
vn 0.350346 0.365287 0.862452
vn 0.0889324 0.542491 0.835341
vn 0.277023 0.296822 0.913868
vn -0.209765 0.359119 0.909413
vn -0.237527 0.157944 0.958454
vn -0.432347 0.422762 0.79646
vn 0.252238 0.40252 0.879974
vn -0.631467 0.118153 0.766348
vn -0.300228 -0.427228 -0.852842
vn 0.0787173 0.270625 0.959461
vn -0.0311712 0.439415 0.897743
vn -0.331991 -0.0455677 0.942181
vn 0.383505 0.384137 0.839859
vn -0.304253 0.0805614 0.949179
vn 0.322424 0.7571 0.568193
vn 0.412844 0.369981 0.83227
vn 0.381572 0.398589 0.833984
vn -0.597755 -0.0517577 0.800006
vn -0.563425 -0.316508 0.763135
vn -0.75498 -0.0975325 0.648454
vn -0.813873 0.388724 0.431861
vn 0.499513 0.0938189 0.861211
vn -0.84649 -0.0253252 0.531802
vn -0.822806 -0.380522 0.422129
vn 0.256829 0.93414 0.247834
vn -0.217257 0.749503 0.625336
vn 0.381637 0.344844 0.857575
vn 0.281309 0.286745 0.915774
vn -0.573555 0.749099 0.331489
vn -0.680859 0.708926 -0.183997
vn -0.0300806 0.244509 0.96918
vn 0.640042 0.764997 0.0715937
vn 0.236287 0.340783 0.909965
vn 0.00227131 0.993996 -0.109392
vn 0.0479961 0.804198 -0.592421
vn 0.714369 0.668208 -0.207785
vn 0.655518 0.754295 0.0365311
vn 0.744738 0.451687 -0.491268
vn -0.721044 0.491065 -0.488825
vn -0.450373 0.777219 -0.439425
vn -0.414323 0.465797 -0.781901
vn -0.892767 0.43972 0.0980494
vn 0.688219 0.1122 -0.716774
vn -0.125132 -0.378594 -0.917065
vn 0.605306 -0.251812 -0.755113
vn 0.361528 -0.0722485 0.929558
vn 0.40106 -0.418112 -0.815066
vn -0.942626 0.122707 0.310482
vn -0.992771 0.119143 0.0145235
vn 0.0188132 -0.373642 -0.927382
vn 0.640984 -0.348451 -0.683901
vn 0.994419 0.0452331 0.0953111
vn -0.927038 -0.35622 0.117082
vn 0.721284 -0.164042 -0.672933
vn 0.357309 -0.264492 -0.895753
vn -0.971814 -0.159878 0.173251
vn -0.106609 -0.222724 -0.969035
vn -0.797249 -0.60365 0.00094378
vn -0.93112 0.0962577 -0.351781
vn 0.20514 -0.236336 -0.94977
vn -0.971343 -0.157944 -0.177616
vn 0.695266 -0.16577 -0.699375
vn 0.882542 -0.0437716 -0.468191
vn -0.921147 -0.378569 -0.0904043
vn 0.13587 -0.389792 -0.910824
vn 0.423343 -0.302567 -0.853952
vn -0.803581 -0.451903 -0.387351
vn -0.235032 -0.394256 -0.888438
vn -0.513941 -0.454864 0.727299
vn -0.479609 -0.491266 0.727071
vn 0.840075 -0.0872937 -0.5354
vn -0.446554 -0.70936 0.545342
vn -0.275415 -0.921933 0.272372
vn -0.61398 -0.554901 0.561349
vn -0.434431 -0.762825 0.478924
vn 0.0382361 -0.984544 -0.170914
vn 0.827778 0.322129 0.459366
vn 0.933393 -0.000964451 -0.358855
vn 0.975727 0.185823 0.115871
vn 0.725195 0.27029 0.633273
vn 0.402261 0.0580196 0.913685
vn 0.801379 0.205413 0.56178
vn 0.994644 0.0611877 0.0833017
vn 0.927969 -0.0609026 -0.367648
vn 0.314933 0.150176 0.937158
vn -0.517632 -0.844727 0.135993
vn -0.214687 -0.972928 -0.0855555
vn -0.752568 -0.517588 -0.407116
vn 0.997623 0.02549 0.064014
vn 0.160645 -0.871629 -0.463095
vn 0.504319 0.320678 0.801766
vn 0.329169 -0.73376 -0.594344
vn -0.403269 -0.865367 -0.297512
vn -0.0752034 -0.365146 -0.927908
vn -0.0512492 -0.812447 -0.580779
vn 0.522318 -0.515497 -0.679299
vn 0.264624 -0.433023 -0.861664
vn 0.662732 -0.436669 -0.608365
vn 0.0672652 -0.907035 -0.415647
vn -0.728731 -0.620799 0.289067
vn -0.649684 -0.699398 -0.297914
vn 0.771012 -0.544309 0.330559
vn 0.657895 -0.746508 0.0994972
vn 0.434588 -0.88687 -0.156828
vn 0.908284 -0.362603 -0.208662
vn 0.85492 -0.36292 -0.370676
vn 0.162297 -0.778577 0.606199
vn 0.424845 -0.755635 0.49852
vn 0.984841 -0.126598 0.11858
vn -0.168569 -0.958768 0.228799
vn 0.900574 -0.276975 -0.335039
vn 0.725308 -0.630537 0.27632
vn 0.312319 -0.94646 0.0816645
vn -0.562552 -0.664776 0.491536
vn -0.502385 -0.833361 0.230477
vn 0.590314 0.311173 0.744783
vn 0.253336 -0.00730936 0.967351
vn 0.332503 -0.923372 -0.191902
vn -0.406398 -0.883588 -0.23262
vn -0.120259 -0.953892 -0.275007
vn -0.430318 -0.782885 -0.449352
vn -0.565673 -0.803875 -0.183845
vn -0.270349 -0.745196 -0.609585
vn 0.939412 -0.0892746 0.33096
vn 0.0410513 0.149133 0.987965
vn -0.880927 -0.467564 0.0731473
vn 0.360143 -0.024979 0.932562
vn -0.991642 0.0861571 0.0960412
vn 0.740492 0.108184 0.6633
vn 0.0588992 -0.0417979 0.997388
vn -0.155414 -0.0831081 0.984347
vn 0.000760933 -0.0311986 0.999513
vn -0.156094 -0.12013 0.98041
vn 0.715586 0.190947 0.671919
vn 0.692631 0.197828 0.693632
vn 0.902611 -0.0218806 0.429901
vn 0.722384 0.515688 0.460681
vn 0.864901 0.456185 0.209384
vn -0.766044 0.38928 -0.511506
vn 0.788702 0.586007 0.185862
vn 0.574318 0.304537 0.759879
vn 0.724313 0.652247 0.223481
vn -0.886274 -0.40631 0.22233
vn 0.925001 0.301171 -0.231667
vn 0.735679 0.178803 0.653304
vn 0.823329 0.550347 -0.138736
vn 0.751135 0.353771 0.557352
vn 0.947088 -0.0401158 0.318457
vn 0.544268 0.279551 0.790964
vn 0.856083 0.397295 -0.330574
vn 0.817804 0.120469 0.562747
vn 0.988573 -0.147864 -0.0293346
vn -0.668948 0.547986 -0.502214
vn 0.464196 0.395562 0.792497
vn 0.312622 0.282092 0.907023
vn 0.659273 0.321671 0.679623
vn 0.490428 0.484088 0.724665
vn 0.676007 0.589614 0.442007
vn 0.346727 0.77629 0.526455
vn -0.137755 -0.349839 -0.926627
vn 0.128232 0.961975 0.241167
vn 0.505674 0.0473218 -0.861426
vn 0.264359 0.942176 0.205959
vn -0.798746 -0.123186 -0.588922
vn 0.693497 0.296234 0.65674
vn -0.989461 -0.0600396 0.131764
vn 0.72047 0.229572 0.654385
vn 0.748101 0.372617 0.549092
vn -0.248338 -0.391428 -0.886065
vn -0.237282 -0.444542 -0.863759
vn 0.261751 0.705722 0.658363
vn -0.339355 0.574098 -0.745151
vn 0.320824 0.931631 0.17069
vn -0.146131 -0.19599 -0.969656
vn -0.727288 0.262559 -0.634125
vn -0.26205 -0.371427 -0.890714
vn -0.347931 -0.0325663 -0.936954
vn -0.626225 -0.3169 -0.712332
vn -0.0759026 -0.330852 -0.940625
vn -0.419747 0.27844 -0.863877
vn -0.11463 0.623902 0.77305
vn -0.486352 -0.118748 0.865656
vn -0.229232 0.876986 -0.422313
vn -0.535375 0.546163 -0.644266
vn 0.575894 0.187194 0.795804
vn 0.42047 -0.0321584 0.906736
vn 0.190146 0.0175718 0.981599
vn 0.405904 0.128941 0.904774
vn -0.992555 -0.119882 -0.0215376
vn -0.828582 -0.0681318 0.555707
vn -0.165161 0.323991 -0.931532
vn -0.578949 0.452879 -0.678025
vn -0.728867 0.0884722 -0.678915
vn -0.762432 -0.322313 0.561081
vn -0.998043 0.0279028 0.0559544
vn -0.995586 0.089706 -0.0276106
vn -0.0182399 0.0713997 -0.997281
vn 0.398451 0.28236 0.872645
vn -0.658683 0.243985 -0.711764
vn -0.492796 0.261816 -0.829822
vn -0.663033 0.454083 -0.595143
vn -0.548828 0.425899 -0.719304
vn -0.732085 0.249842 -0.633743
vn 0.132534 0.914483 0.382304
vn -0.144039 0.545994 0.825314
vn -0.435755 0.76049 -0.481428
vn -0.663791 0.375222 -0.646986
vn -0.339062 0.753352 0.56347
vn -0.0699853 0.671005 -0.738143
vn -0.128681 -0.250863 -0.959432
vn -0.832296 0.544802 0.102342
vn 0.149561 -0.187754 -0.970763
vn -0.55914 0.304642 0.771075
vn 0.532757 0.837942 -0.118417
vn 0.102331 0.938134 -0.330806
vn -0.471591 0.825717 -0.309504
vn -0.123126 -0.38163 -0.916078
vn -0.447589 0.812042 0.374503
vn 0.444206 0.0383471 -0.895104
vn 0.675248 0.203167 -0.709058
vn 0.723919 0.316352 -0.613077
vn 0.261654 0.271639 -0.926148
vn 0.509402 0.560553 -0.652909
vn 0.584933 0.160876 -0.794967
vn 0.584191 0.345778 0.734274
vn 0.773802 0.557745 -0.300253
vn -0.64211 0.3859 0.662402
vn -0.77737 0.628071 -0.0349653
vn -0.930056 0.293451 0.221093
vn -0.882586 0.41447 -0.221937
vn -0.746126 0.295852 0.596463
vn -0.816791 0.420144 0.395388
vn -0.832142 0.130473 0.538996
vn -0.654755 -0.00804831 0.755799
vn -0.816293 -0.238802 0.525966
vn -0.855237 -0.334879 -0.395507
vn -0.979996 -0.159502 0.119023
vn -0.355887 -0.382039 -0.852872
vn -0.587857 -0.365594 -0.721641
vn -0.628235 -0.466707 -0.622499
vn -0.870506 -0.320567 0.373439
vn -0.799891 0.593758 -0.0873236
vn -0.198101 0.229585 0.952915
vn -0.728655 0.179339 0.660983
vn -0.706492 -0.553296 -0.441285
vn -0.427173 -0.406816 -0.80748
vn 0.423264 0.245908 0.871996
vn -0.839762 -0.465712 -0.279127
vn -0.563942 -0.23273 0.792342
vn -0.931253 0.274303 0.239844
vn -0.314828 -0.372087 -0.873175
vn -0.296904 0.734629 -0.610056
vn -0.94274 -0.204955 -0.263125
vn -0.0478874 -0.0714688 0.996293
vn -0.811748 -0.0826063 -0.578136
vn -0.223323 -0.0742002 0.971916
vn -0.355487 -0.322814 -0.877166
vn -0.495995 -0.396527 -0.772499
vn 0.603189 0.3182 0.731376
vn -0.529375 -0.446193 -0.721577
vn 0.456778 0.302445 0.836589
vn 0.614929 0.319034 0.721165
vn -0.269782 -0.376682 -0.886187
vn 0.340995 0.285655 0.895613
vn 0.540066 0.309387 0.782693
vn -0.813428 -0.579813 -0.0463794
vn 0.671645 0.356353 0.649543
vn 0.676056 0.0520401 -0.73501
vn 0.954558 0.290131 0.0681446
vn 0.0893835 0.0114063 0.995932
vn -0.245771 -0.118381 0.962072
vn -0.867321 -0.341951 0.361697
vn -0.838338 -0.479535 0.2593
vn -0.554937 -0.387092 0.736345
vn -0.641381 -0.254722 0.723704
vn -0.334783 -0.161092 0.928423
vn -0.323638 -0.243468 0.91432
vn -0.108956 -0.161239 0.980883
vn 0.939683 0.336778 -0.0598028
vn 0.949093 0.206435 0.237923
vn -0.331696 -0.212298 -0.919189
vn 0.966936 0.242516 0.0788738
vn 0.861153 0.316274 0.397978
vn 0.594254 -0.0826192 -0.800023
vn 0.920005 0.119796 -0.373149
vn 0.397939 -0.129366 -0.908245
vn 0.942638 0.27672 0.186708
vn -0.0088762 -0.00583297 0.999944
vn -0.338145 -0.13556 0.93128
vn 0.325725 0.362469 0.873223
vn 0.141144 0.360455 0.922036
vn -0.130267 0.330818 0.93466
vn -0.627683 0.165888 0.760589
vn -0.0586761 -0.23346 -0.970594
vn -0.241054 -0.208065 -0.947946
vn 0.467228 0.148558 0.871566
vn 0.616392 0.181393 0.766262
vn 0.168014 -0.0632363 0.983754
vn 0.422991 0.0362277 0.90541
vn -0.053131 -0.186372 -0.981041
vn 0.661799 0.239435 0.710418
vn 0.584671 0.191886 0.788251
vn 0.863028 0.359752 0.354629
vn 0.905428 0.379839 0.189533
vn 0.225652 0.0799513 0.970922
vn -0.442704 -0.0735744 0.893645
vn 0.92997 0.346196 0.123711
vn 0.46823 0.193798 0.862092
vn 0.453056 0.0747544 -0.888342
vn -0.281162 -0.22389 -0.933178
vn -0.311513 0.910248 -0.272777
vn 0.847063 0.35463 -0.395881
vn -0.0311687 -0.224874 -0.973889
vn 0.824657 0.279657 0.491663
vn 0.758614 0.246219 0.603225
vn 0.181588 -0.162971 -0.969776
vn -0.844174 -0.417152 -0.336681
vn -0.240341 -0.350602 -0.90516
vn -0.283075 -0.347465 -0.893945
vn -0.242847 -0.417233 -0.875752
vn 0.797029 0.239238 -0.554536
vn 0.722052 0.282964 0.631326
vn 0.695814 0.353591 0.625153
vn -0.320647 -0.262234 -0.910175
vn 0.414836 0.0407536 -0.908983
vn 0.645524 -0.0183042 -0.763521
vn -0.983854 -0.178837 -0.00690012
vn -0.678319 -0.281504 0.678703
vn 0.603234 0.285208 0.744826
vn 0.703213 0.340765 0.623996
vn 0.613996 0.00464877 -0.789296
vn 0.939113 0.323059 0.117047
vn 0.201859 0.186259 0.961541
vn 0.0257439 -0.243146 -0.969648
vn -0.539015 -0.194233 0.819595
vn -0.112804 -0.157004 -0.981135
vn 0.487727 -0.0135158 -0.872891
vn 0.944682 0.323474 0.0542305
vn -0.251843 -0.291354 -0.922869
vn 0.254162 0.0171803 -0.967009
vn -0.400596 -0.274846 -0.874061
vn -0.408688 -0.570952 -0.712031
vn -0.875068 0.381381 0.298002
vn 0.125911 0.894198 0.429599
vn 0.430385 -0.704042 0.564884
vn 0.457126 0.785034 0.41804
vn -0.141716 -0.808168 0.571648
vn 0.0665896 0.993632 0.0908883
vn -0.935499 0.251636 -0.248033
vn 0.072131 0.849717 -0.522282
vn -0.872592 0.41776 -0.2531

g grp1
usemtl mtl1
f 36//36 37//37 97//97 
f 519//519 766//766 2//2 
f 681//681 3//3 675//675 
f 763//763 758//758 734//734 
f 276//276 358//358 282//282 
f 282//282 266//266 276//276 
f 692//692 758//758 761//761 
f 570//570 562//562 574//574 
f 617//617 613//613 599//599 
f 491//491 485//485 1//1 
f 491//491 1//1 766//766 
f 625//625 577//577 626//626 
f 8//8 7//7 1//1 
f 666//666 577//577 625//625 
f 483//483 8//8 1//1 
f 483//483 1//1 485//485 
f 483//483 463//463 8//8 
f 4//4 519//519 2//2 
f 2//2 6//6 4//4 
f 7//7 6//6 2//2 
f 684//684 3//3 664//664 
f 6//6 467//467 400//400 
f 5//5 586//586 568//568 
f 5//5 733//733 740//740 
f 400//400 4//4 6//6 
f 400//400 467//467 469//469 
f 10//10 467//467 6//6 
f 6//6 7//7 10//10 
f 359//359 9//9 679//679 
f 368//368 9//9 359//359 
f 14//14 7//7 465//465 
f 368//368 359//359 324//324 
f 294//294 368//368 312//312 
f 10//10 7//7 14//14 
f 312//312 368//368 324//324 
f 684//684 669//669 672//672 
f 754//754 728//728 746//746 
f 339//339 421//421 337//337 
f 231//231 337//337 421//421 
f 412//412 413//413 422//422 
f 690//690 669//669 664//664 
f 136//136 133//133 189//189 
f 664//664 669//669 684//684 
f 83//83 185//185 127//127 
f 703//703 755//755 756//756 
f 11//11 13//13 167//167 
f 756//756 762//762 754//754 
f 167//167 13//13 208//208 
f 167//167 173//173 11//11 
f 193//193 192//192 11//11 
f 653//653 39//39 588//588 
f 636//636 603//603 29//29 
f 11//11 173//173 193//193 
f 665//665 690//690 664//664 
f 28//28 467//467 10//10 
f 610//610 609//609 551//551 
f 192//192 24//24 11//11 
f 192//192 201//201 24//24 
f 208//208 13//13 15//15 
f 13//13 11//11 22//22 
f 208//208 19//19 209//209 
f 18//18 19//19 15//15 
f 208//208 15//15 19//19 
f 16//16 209//209 114//114 
f 29//29 603//603 598//598 
f 581//581 582//582 583//583 
f 581//581 595//595 579//579 
f 17//17 20//20 117//117 
f 114//114 17//17 115//115 
f 463//463 464//464 465//465 
f 115//115 17//17 117//117 
f 114//114 19//19 17//17 
f 31//31 14//14 459//459 
f 209//209 19//19 114//114 
f 19//19 18//18 17//17 
f 18//18 20//20 17//17 
f 22//22 15//15 13//13 
f 21//21 22//22 11//11 
f 591//591 23//23 559//559 
f 22//22 18//18 15//15 
f 22//22 25//25 18//18 
f 21//21 225//225 25//25 
f 225//225 21//21 24//24 
f 21//21 11//11 24//24 
f 536//536 526//526 24//24 
f 24//24 201//201 536//536 
f 225//225 24//24 526//526 
f 20//20 25//25 233//233 
f 10//10 14//14 28//28 
f 233//233 117//117 20//20 
f 225//225 233//233 25//25 
f 117//117 233//233 123//123 
f 26//26 123//123 233//233 
f 25//25 20//20 18//18 
f 23//23 612//612 721//721 
f 29//29 643//643 636//636 
f 526//526 128//128 26//26 
f 526//526 132//132 128//128 
f 28//28 14//14 31//31 
f 606//606 767//767 613//613 
f 527//527 132//132 526//526 
f 132//132 527//527 528//528 
f 71//71 48//48 40//40 
f 48//48 104//104 30//30 
f 40//40 30//30 43//43 
f 48//48 30//30 40//40 
f 170//170 32//32 35//35 
f 34//34 42//42 35//35 
f 59//59 33//33 34//34 
f 33//33 42//42 34//34 
f 59//59 56//56 33//33 
f 59//59 34//34 178//178 
f 178//178 375//375 59//59 
f 60//60 59//59 375//375 
f 60//60 57//57 59//59 
f 549//549 27//27 606//606 
f 32//32 178//178 34//34 
f 37//37 36//36 120//120 
f 120//120 38//38 37//37 
f 38//38 120//120 141//141 
f 34//34 35//35 32//32 
f 95//95 38//38 122//122 
f 524//524 498//498 448//448 
f 96//96 37//37 38//38 
f 95//95 96//96 38//38 
f 44//44 170//170 35//35 
f 131//131 94//94 130//130 
f 35//35 42//42 43//43 
f 44//44 43//43 131//131 
f 43//43 44//44 35//35 
f 47//47 81//81 54//54 
f 33//33 40//40 42//42 
f 78//78 54//54 81//81 
f 71//71 40//40 33//33 
f 33//33 56//56 71//71 
f 42//42 40//40 43//43 
f 89//89 43//43 30//30 
f 89//89 131//131 43//43 
f 131//131 89//89 93//93 
f 70//70 46//46 45//45 
f 45//45 48//48 71//71 
f 45//45 71//71 70//70 
f 72//72 46//46 70//70 
f 72//72 50//50 46//46 
f 45//45 109//109 48//48 
f 46//46 109//109 45//45 
f 109//109 104//104 48//48 
f 46//46 108//108 109//109 
f 50//50 112//112 108//108 
f 55//55 112//112 50//50 
f 108//108 46//46 50//50 
f 613//613 767//767 599//599 
f 452//452 455//455 434//434 
f 112//112 55//55 250//250 
f 116//116 47//47 49//49 
f 16//16 114//114 250//250 
f 53//53 251//251 250//250 
f 116//116 52//52 47//47 
f 36//36 52//52 116//116 
f 250//250 55//55 53//53 
f 50//50 51//51 55//55 
f 53//53 55//55 51//51 
f 49//49 47//47 54//54 
f 74//74 50//50 72//72 
f 74//74 51//51 50//50 
f 61//61 54//54 78//78 
f 49//49 54//54 61//61 
f 251//251 53//53 255//255 
f 61//61 78//78 58//58 
f 86//86 61//61 137//137 
f 53//53 51//51 255//255 
f 51//51 256//256 255//255 
f 62//62 137//137 61//61 
f 61//61 86//86 49//49 
f 62//62 61//61 58//58 
f 58//58 63//63 62//62 
f 71//71 56//56 70//70 
f 57//57 56//56 59//59 
f 65//65 56//56 57//57 
f 63//63 41//41 62//62 
f 41//41 137//137 62//62 
f 56//56 65//65 70//70 
f 434//434 455//455 422//422 
f 68//68 287//287 63//63 
f 67//67 72//72 70//70 
f 78//78 64//64 58//58 
f 70//70 65//65 67//67 
f 68//68 63//63 58//58 
f 58//58 64//64 68//68 
f 72//72 66//66 74//74 
f 68//68 64//64 75//75 
f 72//72 67//67 66//66 
f 57//57 60//60 79//79 
f 65//65 79//79 292//292 
f 375//375 379//379 394//394 
f 65//65 57//57 79//79 
f 67//67 65//65 75//75 
f 67//67 75//75 66//66 
f 287//287 68//68 292//292 
f 69//69 75//75 64//64 
f 69//69 66//66 75//75 
f 66//66 73//73 74//74 
f 66//66 69//69 73//73 
f 52//52 146//146 47//47 
f 292//292 68//68 75//75 
f 51//51 74//74 73//73 
f 245//245 113//113 166//166 
f 75//75 65//65 292//292 
f 77//77 80//80 269//269 
f 239//239 238//238 166//166 
f 256//256 51//51 73//73 
f 73//73 269//269 256//256 
f 269//269 73//73 77//77 
f 76//76 269//269 80//80 
f 73//73 69//69 77//77 
f 64//64 78//78 77//77 
f 77//77 69//69 64//64 
f 77//77 78//78 80//80 
f 127//127 189//189 83//83 
f 80//80 78//78 81//81 
f 81//81 84//84 151//151 
f 85//85 80//80 81//81 
f 80//80 85//85 76//76 
f 384//384 232//232 383//383 
f 605//605 82//82 767//767 
f 383//383 232//232 248//248 
f 84//84 81//81 47//47 
f 47//47 146//146 84//84 
f 151//151 85//85 81//81 
f 30//30 104//104 87//87 
f 104//104 103//103 87//87 
f 89//89 87//87 90//90 
f 87//87 89//89 30//30 
f 90//90 87//87 110//110 
f 110//110 87//87 103//103 
f 110//110 111//111 90//90 
f 152//152 92//92 111//111 
f 130//130 94//94 95//95 
f 93//93 89//89 90//90 
f 88//88 137//137 306//306 
f 93//93 90//90 94//94 
f 90//90 165//165 94//94 
f 111//111 91//91 90//90 
f 91//91 111//111 92//92 
f 152//152 153//153 92//92 
f 90//90 91//91 165//165 
f 88//88 316//316 99//99 
f 165//165 91//91 92//92 
f 92//92 153//153 144//144 
f 93//93 94//94 131//131 
f 165//165 95//95 94//94 
f 98//98 318//318 101//101 
f 102//102 101//101 318//318 
f 520//520 102//102 318//318 
f 320//320 318//318 98//98 
f 320//320 98//98 316//316 
f 96//96 95//95 165//165 
f 96//96 165//165 97//97 
f 92//92 97//97 165//165 
f 144//144 97//97 92//92 
f 99//99 316//316 98//98 
f 99//99 101//101 216//216 
f 99//99 86//86 88//88 
f 101//101 99//99 98//98 
f 395//395 317//317 310//310 
f 102//102 183//183 127//127 
f 96//96 97//97 37//37 
f 97//97 144//144 36//36 
f 102//102 127//127 185//185 
f 102//102 185//185 101//101 
f 144//144 145//145 36//36 
f 108//108 106//106 104//104 
f 127//127 183//183 189//189 
f 100//100 106//106 108//108 
f 112//112 100//100 108//108 
f 102//102 520//520 183//183 
f 104//104 106//106 103//103 
f 105//105 110//110 103//103 
f 100//100 115//115 106//106 
f 107//107 106//106 117//117 
f 117//117 123//123 107//107 
f 106//106 115//115 117//117 
f 107//107 103//103 106//106 
f 105//105 103//103 107//107 
f 107//107 123//123 105//105 
f 118//118 120//120 116//116 
f 124//124 122//122 141//141 
f 108//108 104//104 109//109 
f 110//110 119//119 111//111 
f 105//105 119//119 110//110 
f 306//306 137//137 308//308 
f 365//365 366//366 322//322 
f 112//112 250//250 114//114 
f 100//100 112//112 114//114 
f 116//116 49//49 86//86 
f 250//250 321//321 16//16 
f 114//114 115//115 100//100 
f 118//118 116//116 86//86 
f 123//123 126//126 105//105 
f 124//124 118//118 216//216 
f 99//99 118//118 86//86 
f 120//120 36//36 116//116 
f 126//126 128//128 129//129 
f 141//141 122//122 38//38 
f 130//130 95//95 122//122 
f 111//111 119//119 152//152 
f 365//365 113//113 249//249 
f 122//122 125//125 130//130 
f 126//126 119//119 105//105 
f 122//122 124//124 206//206 
f 129//129 119//119 126//126 
f 216//216 101//101 185//185 
f 206//206 83//83 125//125 
f 125//125 122//122 206//206 
f 121//121 152//152 119//119 
f 119//119 129//129 121//121 
f 189//189 125//125 83//83 
f 129//129 135//135 121//121 
f 125//125 189//189 133//133 
f 155//155 136//136 189//189 
f 138//138 121//121 135//135 
f 26//26 126//126 123//123 
f 128//128 126//126 26//26 
f 130//130 125//125 133//133 
f 566//566 199//199 561//561 
f 452//452 434//434 427//427 
f 133//133 131//131 130//130 
f 128//128 132//132 135//135 
f 44//44 131//131 133//133 
f 133//133 136//136 44//44 
f 135//135 129//129 128//128 
f 132//132 528//528 139//139 
f 170//170 44//44 136//136 
f 139//139 135//135 132//132 
f 136//136 162//162 170//170 
f 86//86 137//137 88//88 
f 139//139 138//138 135//135 
f 331//331 134//134 335//335 
f 582//582 587//587 597//597 
f 138//138 139//139 134//134 
f 134//134 140//140 335//335 
f 134//134 139//139 140//140 
f 139//139 528//528 140//140 
f 587//587 582//582 199//199 
f 158//158 157//157 331//331 
f 144//144 153//153 154//154 
f 246//246 247//247 234//234 
f 163//163 212//212 221//221 
f 143//143 142//142 150//150 
f 52//52 36//36 145//145 
f 145//145 146//146 52//52 
f 157//157 138//138 134//134 
f 145//145 143//143 146//146 
f 144//144 154//154 145//145 
f 143//143 145//145 154//154 
f 141//141 118//118 124//124 
f 150//150 146//146 143//143 
f 353//353 151//151 149//149 
f 353//353 149//149 148//148 
f 142//142 147//147 150//150 
f 147//147 148//148 149//149 
f 149//149 150//150 147//147 
f 146//146 149//149 84//84 
f 149//149 151//151 84//84 
f 150//150 149//149 146//146 
f 136//136 155//155 162//162 
f 154//154 156//156 142//142 
f 121//121 153//153 152//152 
f 153//153 121//121 156//156 
f 156//156 154//154 153//153 
f 185//185 124//124 216//216 
f 142//142 143//143 154//154 
f 142//142 157//157 147//147 
f 142//142 156//156 157//157 
f 158//158 148//148 147//147 
f 147//147 157//157 158//158 
f 157//157 156//156 121//121 
f 162//162 155//155 553//553 
f 121//121 138//138 157//157 
f 159//159 171//171 168//168 
f 171//171 160//160 193//193 
f 171//171 159//159 160//160 
f 161//161 160//160 159//159 
f 194//194 159//159 175//175 
f 194//194 161//161 159//159 
f 160//160 161//161 196//196 
f 196//196 193//193 160//160 
f 196//196 161//161 197//197 
f 195//195 161//161 194//194 
f 197//197 161//161 195//195 
f 124//124 185//185 206//206 
f 164//164 218//218 219//219 
f 263//263 221//221 252//252 
f 768//768 221//221 263//263 
f 219//219 768//768 164//164 
f 768//768 219//219 163//163 
f 164//164 166//166 218//218 
f 164//164 264//264 278//278 
f 380//380 174//174 162//162 
f 164//164 768//768 264//264 
f 278//278 166//166 164//164 
f 218//218 166//166 238//238 
f 170//170 174//174 32//32 
f 290//290 245//245 278//278 
f 162//162 174//174 170//170 
f 289//289 245//245 290//290 
f 172//172 180//180 168//168 
f 167//167 176//176 180//180 
f 180//180 172//172 167//167 
f 168//168 169//169 175//175 
f 177//177 169//169 168//168 
f 168//168 180//180 177//177 
f 168//168 175//175 159//159 
f 171//171 172//172 168//168 
f 173//173 167//167 172//172 
f 172//172 171//171 173//173 
f 193//193 173//173 171//171 
f 169//169 194//194 175//175 
f 183//183 520//520 529//529 
f 183//183 529//529 190//190 
f 194//194 169//169 188//188 
f 190//190 529//529 548//548 
f 176//176 181//181 180//180 
f 756//756 692//692 762//762 
f 167//167 208//208 176//176 
f 176//176 207//207 181//181 
f 177//177 179//179 182//182 
f 177//177 182//182 169//169 
f 179//179 177//177 181//181 
f 180//180 181//181 177//177 
f 190//190 189//189 183//183 
f 179//179 181//181 214//214 
f 179//179 184//184 182//182 
f 182//182 187//187 169//169 
f 186//186 182//182 184//184 
f 190//190 548//548 553//553 
f 187//187 182//182 186//186 
f 191//191 187//187 186//186 
f 179//179 213//213 184//184 
f 190//190 553//553 155//155 
f 155//155 189//189 190//190 
f 179//179 214//214 213//213 
f 553//553 380//380 162//162 
f 83//83 206//206 185//185 
f 184//184 215//215 186//186 
f 217//217 191//191 186//186 
f 217//217 186//186 215//215 
f 169//169 187//187 188//188 
f 187//187 191//191 188//188 
f 191//191 205//205 188//188 
f 518//518 319//319 202//202 
f 191//191 223//223 205//205 
f 217//217 223//223 191//191 
f 193//193 196//196 192//192 
f 192//192 196//196 201//201 
f 195//195 194//194 188//188 
f 188//188 205//205 195//195 
f 195//195 205//205 198//198 
f 334//334 230//230 229//229 
f 201//201 196//196 531//531 
f 468//468 474//474 202//202 
f 197//197 531//531 196//196 
f 201//201 531//531 769//769 
f 197//197 203//203 531//531 
f 203//203 197//197 198//198 
f 198//198 197//197 195//195 
f 205//205 224//224 198//198 
f 319//319 296//296 204//204 
f 474//474 521//521 518//518 
f 518//518 202//202 474//474 
f 118//118 141//141 120//120 
f 198//198 538//538 203//203 
f 224//224 538//538 198//198 
f 224//224 222//222 538//538 
f 205//205 223//223 226//226 
f 134//134 331//331 157//157 
f 207//207 176//176 208//208 
f 208//208 210//210 207//207 
f 208//208 209//209 210//210 
f 202//202 204//204 200//200 
f 181//181 207//207 212//212 
f 212//212 214//214 181//181 
f 202//202 200//200 468//468 
f 212//212 207//207 210//210 
f 231//231 410//410 262//262 
f 210//210 221//221 212//212 
f 581//581 583//583 585//585 
f 415//415 211//211 414//414 
f 410//410 414//414 211//211 
f 211//211 267//267 410//410 
f 210//210 321//321 221//221 
f 416//416 663//663 211//211 
f 416//416 211//211 415//415 
f 267//267 211//211 663//663 
f 99//99 216//216 118//118 
f 321//321 210//210 209//209 
f 16//16 321//321 209//209 
f 321//321 252//252 221//221 
f 214//214 212//212 163//163 
f 184//184 213//213 215//215 
f 270//270 481//481 241//241 
f 213//213 214//214 219//219 
f 233//233 225//225 526//526 
f 481//481 270//270 220//220 
f 215//215 213//213 218//218 
f 25//25 22//22 21//21 
f 218//218 238//238 215//215 
f 223//223 217//217 228//228 
f 217//217 238//238 240//240 
f 217//217 215//215 238//238 
f 219//219 218//218 213//213 
f 601//601 600//600 602//602 
f 481//481 719//719 718//718 
f 240//240 228//228 217//217 
f 246//246 228//228 240//240 
f 481//481 220//220 719//719 
f 219//219 214//214 163//163 
f 546//546 235//235 351//351 
f 26//26 233//233 526//526 
f 351//351 545//545 546//546 
f 226//226 224//224 205//205 
f 230//230 337//337 231//231 
f 223//223 227//227 226//226 
f 227//227 223//223 228//228 
f 228//228 234//234 227//227 
f 226//226 222//222 224//224 
f 222//222 226//226 235//235 
f 226//226 227//227 234//234 
f 234//234 228//228 246//246 
f 229//229 204//204 334//334 
f 247//247 237//237 234//234 
f 247//247 232//232 352//352 
f 247//247 352//352 237//237 
f 670//670 512//512 344//344 
f 237//237 236//236 234//234 
f 234//234 235//235 226//226 
f 230//230 262//262 244//244 
f 235//235 546//546 222//222 
f 235//235 234//234 236//236 
f 244//244 229//229 230//230 
f 351//351 236//236 348//348 
f 352//352 348//348 236//236 
f 236//236 237//237 352//352 
f 236//236 351//351 235//235 
f 230//230 231//231 262//262 
f 166//166 113//113 239//239 
f 322//322 248//248 239//239 
f 166//166 278//278 245//245 
f 240//240 239//239 246//246 
f 240//240 238//238 239//239 
f 344//344 512//512 302//302 
f 492//492 242//242 270//270 
f 492//492 468//468 200//200 
f 492//492 200//200 242//242 
f 245//245 249//249 113//113 
f 248//248 246//246 239//239 
f 246//246 248//248 232//232 
f 239//239 113//113 322//322 
f 245//245 289//289 249//249 
f 371//371 249//249 289//289 
f 242//242 244//244 243//243 
f 365//365 249//249 371//371 
f 365//365 371//371 372//372 
f 270//270 241//241 492//492 
f 242//242 243//243 270//270 
f 258//258 252//252 251//251 
f 200//200 204//204 229//229 
f 311//311 505//505 732//732 
f 251//251 321//321 250//250 
f 242//242 200//200 229//229 
f 251//251 252//252 321//321 
f 242//242 229//229 244//244 
f 754//754 753//753 649//649 
f 255//255 258//258 251//251 
f 260//260 258//258 255//255 
f 255//255 256//256 271//271 
f 255//255 271//271 260//260 
f 258//258 263//263 252//252 
f 248//248 322//322 367//367 
f 261//261 263//263 258//258 
f 254//254 253//253 257//257 
f 260//260 271//271 286//286 
f 258//258 260//260 261//261 
f 286//286 271//271 275//275 
f 286//286 261//261 260//260 
f 743//743 763//763 748//748 
f 742//742 763//763 743//743 
f 263//263 264//264 768//768 
f 264//264 263//263 265//265 
f 220//220 257//257 259//259 
f 687//687 670//670 344//344 
f 263//263 261//261 265//265 
f 277//277 278//278 264//264 
f 259//259 257//257 253//253 
f 266//266 281//281 261//261 
f 261//261 281//281 265//265 
f 265//265 281//281 264//264 
f 266//266 282//282 281//281 
f 266//266 261//261 286//286 
f 266//266 286//286 276//276 
f 268//268 748//748 681//681 
f 244//244 262//262 254//254 
f 254//254 262//262 253//253 
f 262//262 410//410 267//267 
f 358//358 361//361 386//386 
f 262//262 267//267 253//253 
f 386//386 282//282 358//358 
f 267//267 663//663 253//253 
f 256//256 269//269 273//273 
f 256//256 273//273 271//271 
f 269//269 76//76 273//273 
f 76//76 85//85 272//272 
f 272//272 273//273 76//76 
f 354//354 272//272 85//85 
f 257//257 220//220 243//243 
f 85//85 151//151 354//354 
f 244//244 254//254 243//243 
f 243//243 254//254 257//257 
f 270//270 243//243 220//220 
f 273//273 272//272 275//275 
f 275//275 271//271 273//273 
f 272//272 354//354 356//356 
f 356//356 275//275 272//272 
f 276//276 286//286 275//275 
f 275//275 356//356 276//276 
f 593//593 687//687 433//433 
f 276//276 356//356 358//358 
f 748//748 268//268 743//743 
f 593//593 268//268 687//687 
f 274//274 440//440 515//515 
f 304//304 456//456 407//407 
f 277//277 283//283 279//279 
f 284//284 279//279 283//283 
f 291//291 279//279 284//284 
f 277//277 279//279 278//278 
f 279//279 290//290 278//278 
f 291//291 290//290 279//279 
f 281//281 283//283 277//277 
f 277//277 264//264 281//281 
f 282//282 295//295 283//283 
f 283//283 281//281 282//282 
f 280//280 274//274 688//688 
f 283//283 295//295 285//285 
f 285//285 299//299 284//284 
f 284//284 283//283 285//285 
f 285//285 301//301 299//299 
f 285//285 295//295 301//301 
f 688//688 274//274 685//685 
f 329//329 308//308 137//137 
f 137//137 41//41 329//329 
f 287//287 41//41 63//63 
f 295//295 282//282 386//386 
f 287//287 313//313 329//329 
f 287//287 329//329 41//41 
f 620//620 563//563 552//552 
f 359//359 679//679 662//662 
f 370//370 313//313 287//287 
f 287//287 292//292 370//370 
f 423//423 290//290 291//291 
f 620//620 552//552 444//444 
f 280//280 688//688 714//714 
f 289//289 290//290 423//423 
f 435//435 289//289 423//423 
f 753//753 732//732 689//689 
f 436//436 371//371 289//289 
f 289//289 435//435 436//436 
f 689//689 732//732 671//671 
f 291//291 284//284 293//293 
f 284//284 299//299 293//293 
f 369//369 292//292 79//79 
f 298//298 293//293 299//299 
f 79//79 60//60 369//369 
f 293//293 424//424 291//291 
f 293//293 304//304 439//439 
f 439//439 424//424 293//293 
f 291//291 424//424 423//423 
f 298//298 304//304 293//293 
f 649//649 689//689 747//747 
f 304//304 305//305 456//456 
f 456//456 305//305 460//460 
f 295//295 297//297 301//301 
f 301//301 297//297 300//300 
f 324//324 344//344 302//302 
f 649//649 753//753 689//689 
f 302//302 312//312 324//324 
f 297//297 386//386 388//388 
f 386//386 297//297 295//295 
f 444//444 759//759 730//730 
f 300//300 297//297 309//309 
f 309//309 297//297 388//388 
f 296//296 306//306 333//333 
f 388//388 389//389 309//309 
f 298//298 299//299 307//307 
f 301//301 300//300 299//299 
f 306//306 308//308 333//333 
f 307//307 299//299 300//300 
f 307//307 300//300 315//315 
f 315//315 300//300 309//309 
f 298//298 305//305 304//304 
f 305//305 298//298 307//307 
f 307//307 315//315 462//462 
f 88//88 306//306 296//296 
f 316//316 88//88 296//296 
f 333//333 334//334 296//296 
f 308//308 329//329 330//330 
f 330//330 333//333 308//308 
f 307//307 460//460 305//305 
f 329//329 314//314 330//330 
f 671//671 683//683 689//689 
f 310//310 315//315 309//309 
f 314//314 329//329 313//313 
f 309//309 389//389 310//310 
f 462//462 460//460 307//307 
f 317//317 462//462 315//315 
f 317//317 467//467 462//462 
f 315//315 310//310 317//317 
f 469//469 317//317 395//395 
f 317//317 469//469 467//467 
f 319//319 320//320 316//316 
f 316//316 296//296 319//319 
f 518//518 318//318 320//320 
f 518//518 320//320 319//319 
f 332//332 355//355 148//148 
f 464//464 459//459 465//465 
f 465//465 459//459 14//14 
f 368//368 294//294 577//577 
f 433//433 324//324 359//359 
f 363//363 355//355 325//325 
f 323//323 325//325 355//355 
f 325//325 323//323 341//341 
f 325//325 392//392 363//363 
f 326//326 392//392 325//325 
f 326//326 346//346 391//391 
f 332//332 338//338 323//323 
f 328//328 332//332 331//331 
f 338//338 332//332 328//328 
f 328//328 348//348 338//338 
f 547//547 545//545 327//327 
f 547//547 327//327 335//335 
f 328//328 327//327 348//348 
f 333//333 336//336 334//334 
f 545//545 351//351 327//327 
f 259//259 253//253 765//765 
f 753//753 311//311 732//732 
f 336//336 333//333 330//330 
f 336//336 330//330 343//343 
f 335//335 327//327 328//328 
f 220//220 259//259 705//705 
f 344//344 324//324 433//433 
f 296//296 334//334 204//204 
f 331//331 335//335 328//328 
f 332//332 158//158 331//331 
f 323//323 355//355 332//332 
f 337//337 336//336 343//343 
f 230//230 334//334 336//336 
f 336//336 337//337 230//230 
f 339//339 337//337 343//343 
f 339//339 343//343 342//342 
f 314//314 342//342 330//330 
f 330//330 342//342 343//343 
f 335//335 140//140 547//547 
f 340//340 342//342 314//314 
f 314//314 313//313 340//340 
f 556//556 712//712 611//611 
f 342//342 340//340 347//347 
f 341//341 326//326 325//325 
f 687//687 344//344 433//433 
f 323//323 338//338 341//341 
f 345//345 326//326 341//341 
f 348//348 350//350 341//341 
f 341//341 338//338 348//348 
f 342//342 347//347 432//432 
f 342//342 432//432 339//339 
f 384//384 345//345 232//232 
f 347//347 428//428 432//432 
f 368//368 577//577 9//9 
f 350//350 352//352 345//345 
f 352//352 232//232 345//345 
f 403//403 349//349 428//428 
f 346//346 326//326 345//345 
f 384//384 346//346 345//345 
f 428//428 347//347 403//403 
f 204//204 202//202 319//319 
f 341//341 350//350 345//345 
f 327//327 351//351 348//348 
f 352//352 350//350 348//348 
f 151//151 353//353 354//354 
f 354//354 357//357 356//356 
f 353//353 363//363 357//357 
f 357//357 354//354 353//353 
f 148//148 355//355 353//353 
f 148//148 158//158 332//332 
f 355//355 363//363 353//353 
f 356//356 357//357 358//358 
f 360//360 390//390 565//565 
f 364//364 390//390 360//360 
f 358//358 357//357 361//361 
f 431//431 364//364 362//362 
f 357//357 363//363 361//361 
f 361//361 363//363 385//385 
f 232//232 247//247 246//246 
f 349//349 403//403 406//406 
f 322//322 113//113 365//365 
f 364//364 431//431 349//349 
f 367//367 383//383 248//248 
f 366//366 367//367 322//322 
f 377//377 384//384 383//383 
f 362//362 360//360 578//578 
f 383//383 367//367 377//377 
f 367//367 378//378 377//377 
f 367//367 366//366 378//378 
f 441//441 362//362 578//578 
f 362//362 364//364 360//360 
f 384//384 393//393 346//346 
f 370//370 401//401 313//313 
f 369//369 401//401 370//370 
f 370//370 292//292 369//369 
f 463//463 465//465 8//8 
f 404//404 401//401 369//369 
f 402//402 401//401 404//404 
f 391//391 392//392 326//326 
f 393//393 391//391 346//346 
f 377//377 393//393 384//384 
f 372//372 373//373 365//365 
f 372//372 371//371 436//436 
f 436//436 493//493 372//372 
f 369//369 60//60 374//374 
f 496//496 382//382 493//493 
f 373//373 366//366 365//365 
f 373//373 376//376 366//366 
f 374//374 60//60 375//375 
f 376//376 378//378 366//366 
f 178//178 32//32 379//379 
f 374//374 394//394 404//404 
f 374//374 375//375 394//394 
f 379//379 375//375 178//178 
f 373//373 372//372 493//493 
f 382//382 376//376 373//373 
f 493//493 382//382 373//373 
f 404//404 369//369 374//374 
f 377//377 398//398 393//393 
f 378//378 398//398 377//377 
f 376//376 382//382 381//381 
f 381//381 378//378 376//376 
f 381//381 398//398 378//378 
f 381//381 382//382 497//497 
f 420//420 679//679 9//9 
f 361//361 385//385 386//386 
f 385//385 392//392 388//388 
f 386//386 385//385 388//388 
f 385//385 363//363 392//392 
f 389//389 392//392 391//391 
f 389//389 388//388 392//392 
f 391//391 396//396 389//389 
f 396//396 393//393 397//397 
f 396//396 391//391 393//393 
f 174//174 380//380 387//387 
f 387//387 379//379 174//174 
f 393//393 398//398 397//397 
f 389//389 396//396 310//310 
f 395//395 396//396 397//397 
f 395//395 310//310 396//396 
f 398//398 381//381 514//514 
f 390//390 394//394 379//379 
f 514//514 397//397 398//398 
f 500//500 514//514 381//381 
f 381//381 497//497 500//500 
f 399//399 395//395 397//397 
f 514//514 399//399 397//397 
f 405//405 394//394 390//390 
f 387//387 565//565 390//390 
f 565//565 387//387 380//380 
f 399//399 400//400 469//469 
f 399//399 469//469 395//395 
f 390//390 379//379 387//387 
f 379//379 32//32 174//174 
f 9//9 666//666 420//420 
f 439//439 418//418 411//411 
f 313//313 401//401 340//340 
f 402//402 340//340 401//401 
f 340//340 402//402 347//347 
f 304//304 407//407 439//439 
f 404//404 405//405 406//406 
f 406//406 402//402 404//404 
f 347//347 402//402 403//403 
f 403//403 402//402 406//406 
f 407//407 418//418 439//439 
f 411//411 450//450 419//419 
f 419//419 430//430 411//411 
f 404//404 394//394 405//405 
f 450//450 411//411 418//418 
f 453//453 466//466 445//445 
f 406//406 364//364 349//349 
f 406//406 405//405 364//364 
f 364//364 405//405 390//390 
f 445//445 450//450 453//453 
f 408//408 409//409 413//413 
f 408//408 421//421 409//409 
f 409//409 422//422 413//413 
f 408//408 413//413 410//410 
f 410//410 231//231 408//408 
f 413//413 412//412 414//414 
f 414//414 410//410 413//413 
f 414//414 417//417 415//415 
f 450//450 445//445 419//419 
f 417//417 414//414 412//412 
f 415//415 417//417 716//716 
f 415//415 716//716 717//717 
f 417//417 715//715 716//716 
f 8//8 465//465 7//7 
f 412//412 455//455 417//417 
f 417//417 455//455 715//715 
f 552//552 294//294 751//751 
f 432//432 421//421 339//339 
f 552//552 751//751 659//659 
f 231//231 421//421 408//408 
f 409//409 421//421 432//432 
f 9//9 577//577 666//666 
f 433//433 359//359 662//662 
f 446//446 505//505 311//311 
f 435//435 423//423 424//424 
f 505//505 446//446 470//470 
f 429//429 434//434 422//422 
f 594//594 433//433 662//662 
f 439//439 426//426 424//424 
f 425//425 427//427 431//431 
f 439//439 411//411 426//426 
f 435//435 424//424 426//426 
f 411//411 430//430 426//426 
f 438//438 435//435 426//426 
f 429//429 432//432 428//428 
f 428//428 434//434 429//429 
f 349//349 431//431 434//434 
f 426//426 430//430 438//438 
f 434//434 428//428 349//349 
f 442//442 443//443 438//438 
f 432//432 429//429 409//409 
f 446//446 723//723 470//470 
f 470//470 723//723 722//722 
f 409//409 429//429 422//422 
f 434//434 431//431 427//427 
f 436//436 435//435 438//438 
f 436//436 438//438 443//443 
f 438//438 430//430 442//442 
f 441//441 437//437 425//425 
f 443//443 494//494 436//436 
f 419//419 445//445 447//447 
f 730//730 759//759 680//680 
f 447//447 430//430 419//419 
f 442//442 447//447 443//443 
f 443//443 498//498 494//494 
f 443//443 448//448 498//498 
f 443//443 447//447 448//448 
f 498//498 524//524 499//499 
f 441//441 578//578 440//440 
f 722//722 694//694 470//470 
f 470//470 694//694 541//541 
f 437//437 441//441 440//440 
f 447//447 442//442 430//430 
f 470//470 541//541 505//505 
f 447//447 445//445 472//472 
f 472//472 480//480 447//447 
f 448//448 447//447 480//480 
f 425//425 431//431 441//441 
f 477//477 524//524 448//448 
f 449//449 418//418 407//407 
f 449//449 407//407 461//461 
f 461//461 458//458 449//449 
f 440//440 274//274 437//437 
f 450//450 418//418 449//449 
f 362//362 441//441 431//431 
f 679//679 682//682 662//662 
f 455//455 412//412 422//422 
f 455//455 452//452 457//457 
f 450//450 449//449 453//453 
f 449//449 458//458 453//453 
f 453//453 454//454 466//466 
f 458//458 454//454 453//453 
f 456//456 461//461 407//407 
f 427//427 425//425 451//451 
f 452//452 427//427 451//451 
f 461//461 456//456 460//460 
f 31//31 458//458 461//461 
f 715//715 457//457 714//714 
f 31//31 459//459 458//458 
f 457//457 452//452 714//714 
f 715//715 455//455 457//457 
f 454//454 458//458 464//464 
f 464//464 463//463 454//454 
f 458//458 459//459 464//464 
f 460//460 31//31 461//461 
f 714//714 451//451 280//280 
f 714//714 452//452 451//451 
f 460//460 462//462 31//31 
f 274//274 451//451 437//437 
f 462//462 28//28 31//31 
f 451//451 425//425 437//437 
f 280//280 451//451 274//274 
f 471//471 522//522 521//521 
f 522//522 471//471 535//535 
f 454//454 463//463 466//466 
f 489//489 474//474 468//468 
f 490//490 475//475 489//489 
f 466//466 773//773 473//473 
f 475//475 490//490 502//502 
f 471//471 521//521 474//474 
f 471//471 474//474 489//489 
f 467//467 28//28 462//462 
f 475//475 535//535 471//471 
f 489//489 475//475 471//471 
f 466//466 472//472 445//445 
f 466//466 473//473 472//472 
f 757//757 303//303 509//509 
f 473//473 480//480 472//472 
f 535//535 475//475 576//576 
f 576//576 572//572 535//535 
f 448//448 480//480 477//477 
f 509//509 303//303 688//688 
f 475//475 476//476 576//576 
f 476//476 475//475 502//502 
f 576//576 476//476 575//575 
f 580//580 575//575 476//476 
f 477//477 480//480 485//485 
f 477//477 482//482 524//524 
f 477//477 488//488 482//482 
f 485//485 473//473 773//773 
f 473//473 485//485 480//480 
f 478//478 479//479 508//508 
f 484//484 479//479 241//241 
f 484//484 241//241 481//481 
f 479//479 484//484 486//486 
f 486//486 508//508 479//479 
f 485//485 488//488 477//477 
f 483//483 485//485 773//773 
f 773//773 463//463 483//483 
f 481//481 718//718 710//710 
f 488//488 525//525 482//482 
f 487//487 710//710 709//709 
f 481//481 710//710 484//484 
f 487//487 486//486 710//710 
f 486//486 484//484 710//710 
f 485//485 491//491 488//488 
f 525//525 488//488 491//491 
f 491//491 766//766 525//525 
f 489//489 492//492 241//241 
f 241//241 490//490 489//489 
f 489//489 468//468 492//492 
f 493//493 436//436 494//494 
f 496//496 493//493 494//494 
f 496//496 497//497 382//382 
f 502//502 490//490 495//495 
f 503//503 502//502 495//495 
f 490//490 241//241 479//479 
f 478//478 507//507 495//495 
f 495//495 490//490 478//478 
f 478//478 490//490 479//479 
f 508//508 507//507 478//478 
f 496//496 499//499 497//497 
f 496//496 494//494 498//498 
f 433//433 594//594 593//593 
f 495//495 507//507 503//503 
f 504//504 503//503 507//507 
f 497//497 499//499 510//510 
f 510//510 511//511 497//497 
f 498//498 499//499 496//496 
f 524//524 510//510 499//499 
f 505//505 509//509 732//732 
f 500//500 497//497 511//511 
f 761//761 634//634 764//764 
f 501//501 476//476 502//502 
f 502//502 503//503 501//501 
f 501//501 580//580 476//476 
f 511//511 523//523 500//500 
f 294//294 563//563 577//577 
f 541//541 509//509 505//505 
f 515//515 501//501 504//504 
f 541//541 757//757 509//509 
f 523//523 514//514 500//500 
f 515//515 440//440 580//580 
f 515//515 580//580 501//501 
f 523//523 516//516 514//514 
f 509//509 688//688 671//671 
f 504//504 501//501 503//503 
f 504//504 507//507 506//506 
f 508//508 513//513 506//506 
f 482//482 517//517 510//510 
f 763//763 742//742 634//634 
f 508//508 486//486 513//513 
f 506//506 507//507 508//508 
f 510//510 524//524 482//482 
f 541//541 694//694 757//757 
f 684//684 672//672 512//512 
f 512//512 670//670 684//684 
f 711//711 513//513 487//487 
f 517//517 523//523 511//511 
f 511//511 510//510 517//517 
f 400//400 399//399 516//516 
f 516//516 399//399 514//514 
f 711//711 506//506 513//513 
f 400//400 516//516 4//4 
f 486//486 487//487 513//513 
f 634//634 761//761 758//758 
f 516//516 523//523 519//519 
f 685//685 515//515 506//506 
f 519//519 4//4 516//516 
f 517//517 482//482 525//525 
f 506//506 515//515 504//504 
f 523//523 517//517 519//519 
f 525//525 519//519 517//517 
f 515//515 685//685 274//274 
f 685//685 506//506 686//686 
f 525//525 766//766 519//519 
f 521//521 520//520 318//318 
f 318//318 518//518 521//521 
f 536//536 527//527 526//526 
f 530//530 520//520 521//521 
f 530//530 521//521 522//522 
f 542//542 528//528 527//527 
f 567//567 512//512 672//672 
f 542//542 140//140 528//528 
f 769//769 536//536 201//201 
f 203//203 538//538 771//771 
f 771//771 532//532 769//769 
f 520//520 530//530 529//529 
f 532//532 537//537 536//536 
f 534//534 544//544 537//537 
f 560//560 529//529 530//530 
f 537//537 532//532 534//534 
f 537//537 527//527 536//536 
f 544//544 534//534 543//543 
f 771//771 538//538 539//539 
f 222//222 539//539 538//538 
f 533//533 530//530 522//522 
f 546//546 539//539 222//222 
f 522//522 535//535 533//533 
f 539//539 543//543 534//534 
f 546//546 543//543 539//539 
f 527//527 537//537 542//542 
f 560//560 530//530 533//533 
f 569//569 560//560 533//533 
f 537//537 544//544 542//542 
f 567//567 672//672 696//696 
f 705//705 259//259 765//765 
f 659//659 550//550 618//618 
f 543//543 545//545 544//544 
f 543//543 546//546 545//545 
f 140//140 542//542 544//544 
f 545//545 547//547 544//544 
f 569//569 533//533 572//572 
f 547//547 140//140 544//544 
f 551//551 579//579 554//554 
f 579//579 595//595 549//549 
f 605//605 549//549 595//595 
f 579//579 549//549 554//554 
f 294//294 552//552 563//563 
f 555//555 554//554 549//549 
f 533//533 535//535 572//572 
f 27//27 549//549 605//605 
f 549//549 606//606 555//555 
f 12//12 551//551 554//554 
f 730//730 680//680 557//557 
f 512//512 567//567 550//550 
f 554//554 557//557 12//12 
f 557//557 556//556 12//12 
f 681//681 675//675 268//268 
f 550//550 741//741 302//302 
f 555//555 557//557 554//554 
f 548//548 529//529 560//560 
f 548//548 560//560 558//558 
f 557//557 555//555 606//606 
f 591//591 609//609 23//23 
f 548//548 558//558 553//553 
f 592//592 561//561 199//199 
f 592//592 591//591 571//571 
f 609//609 610//610 23//23 
f 610//610 612//612 23//23 
f 302//302 512//512 550//550 
f 571//571 561//561 592//592 
f 591//591 559//559 738//738 
f 738//738 571//571 591//591 
f 564//564 562//562 570//570 
f 199//199 770//770 587//587 
f 561//561 571//571 562//562 
f 199//199 566//566 770//770 
f 770//770 628//628 629//629 
f 561//561 564//564 566//566 
f 558//558 380//380 553//553 
f 562//562 564//564 561//561 
f 638//638 566//566 650//650 
f 638//638 628//628 770//770 
f 638//638 650//650 647//647 
f 574//574 645//645 570//570 
f 564//564 650//650 566//566 
f 564//564 570//570 650//650 
f 570//570 645//645 650//650 
f 688//688 622//622 671//671 
f 568//568 574//574 562//562 
f 562//562 738//738 568//568 
f 731//731 568//568 738//738 
f 568//568 644//644 574//574 
f 644//644 568//568 586//586 
f 560//560 569//569 558//558 
f 738//738 562//562 571//571 
f 540//540 558//558 569//569 
f 565//565 380//380 558//558 
f 565//565 558//558 540//540 
f 644//644 645//645 574//574 
f 540//540 573//573 578//578 
f 540//540 569//569 573//573 
f 573//573 569//569 575//575 
f 586//586 643//643 644//644 
f 572//572 576//576 575//575 
f 575//575 569//569 572//572 
f 581//581 585//585 595//595 
f 573//573 575//575 580//580 
f 591//591 589//589 609//609 
f 580//580 578//578 573//573 
f 581//581 579//579 609//609 
f 609//609 589//589 581//581 
f 540//540 578//578 360//360 
f 360//360 565//565 540//540 
f 551//551 609//609 579//579 
f 581//581 589//589 582//582 
f 587//587 630//630 676//676 
f 440//440 578//578 580//580 
f 630//630 587//587 632//632 
f 268//268 593//593 743//743 
f 676//676 630//630 631//631 
f 622//622 688//688 685//685 
f 727//727 728//728 736//736 
f 676//676 597//597 587//587 
f 585//585 583//583 735//735 
f 597//597 583//583 582//582 
f 584//584 641//641 740//740 
f 589//589 591//591 592//592 
f 582//582 589//589 592//592 
f 586//586 5//5 740//740 
f 199//199 582//582 592//592 
f 567//567 696//696 752//752 
f 607//607 585//585 608//608 
f 631//631 623//623 608//608 
f 699//699 673//673 696//696 
f 588//588 590//590 653//653 
f 588//588 602//602 590//590 
f 607//607 595//595 585//585 
f 595//595 607//607 772//772 
f 595//595 772//772 605//605 
f 682//682 600//600 662//662 
f 662//662 600//600 594//594 
f 607//607 596//596 772//772 
f 607//607 604//604 596//596 
f 82//82 605//605 772//772 
f 596//596 599//599 82//82 
f 27//27 605//605 767//767 
f 767//767 606//606 27//27 
f 583//583 597//597 735//735 
f 752//752 696//696 673//673 
f 600//600 598//598 603//603 
f 596//596 604//604 599//599 
f 756//756 747//747 703//703 
f 601//601 621//621 598//598 
f 599//599 604//604 617//617 
f 600//600 601//601 598//598 
f 602//602 588//588 601//601 
f 588//588 39//39 601//601 
f 604//604 624//624 617//617 
f 604//604 607//607 608//608 
f 600//600 603//603 641//641 
f 608//608 623//623 624//624 
f 624//624 604//604 608//608 
f 621//621 646//646 29//29 
f 598//598 621//621 29//29 
f 551//551 12//12 610//610 
f 12//12 611//611 610//610 
f 12//12 556//556 611//611 
f 610//610 611//611 612//612 
f 757//757 288//288 303//303 
f 616//616 601//601 39//39 
f 631//631 654//654 623//623 
f 625//625 623//623 654//654 
f 666//666 625//625 654//654 
f 616//616 653//653 652//652 
f 613//613 614//614 606//606 
f 606//606 614//614 557//557 
f 615//615 621//621 601//601 
f 613//613 617//617 614//614 
f 624//624 627//627 617//617 
f 615//615 601//601 616//616 
f 617//617 627//627 619//619 
f 619//619 614//614 617//617 
f 615//615 616//616 633//633 
f 556//556 557//557 680//680 
f 730//730 557//557 614//614 
f 614//614 619//619 730//730 
f 616//616 640//640 633//633 
f 618//618 550//550 567//567 
f 619//619 444//444 730//730 
f 619//619 620//620 444//444 
f 627//627 624//624 626//626 
f 646//646 621//621 615//615 
f 646//646 615//615 633//633 
f 671//671 622//622 683//683 
f 646//646 633//633 647//647 
f 627//627 563//563 620//620 
f 620//620 619//619 627//627 
f 625//625 624//624 623//623 
f 625//625 626//626 624//624 
f 671//671 732//732 509//509 
f 626//626 563//563 627//627 
f 626//626 577//577 563//563 
f 631//631 735//735 676//676 
f 629//629 651//651 637//637 
f 752//752 618//618 567//567 
f 629//629 632//632 770//770 
f 637//637 632//632 629//629 
f 629//629 642//642 651//651 
f 587//587 770//770 632//632 
f 735//735 608//608 585//585 
f 630//630 635//635 631//631 
f 630//630 632//632 635//635 
f 635//635 632//632 637//637 
f 639//639 638//638 647//647 
f 647//647 633//633 639//639 
f 637//637 668//668 655//655 
f 651//651 668//668 637//637 
f 639//639 628//628 638//638 
f 642//642 629//629 628//628 
f 628//628 639//639 642//642 
f 639//639 640//640 642//642 
f 608//608 735//735 631//631 
f 712//712 729//729 611//611 
f 740//740 641//641 636//636 
f 636//636 643//643 586//586 
f 586//586 740//740 636//636 
f 692//692 756//756 755//755 
f 640//640 639//639 633//633 
f 735//735 597//597 676//676 
f 641//641 594//594 600//600 
f 29//29 646//646 648//648 
f 648//648 643//643 29//29 
f 648//648 645//645 643//643 
f 641//641 603//603 636//636 
f 651//651 642//642 652//652 
f 645//645 644//644 643//643 
f 652//652 642//642 640//640 
f 647//647 648//648 646//646 
f 650//650 645//645 648//648 
f 648//648 647//647 650//650 
f 640//640 616//616 652//652 
f 668//668 657//657 655//655 
f 651//651 652//652 653//653 
f 653//653 668//668 651//651 
f 39//39 653//653 616//616 
f 590//590 668//668 653//653 
f 654//654 631//631 635//635 
f 635//635 655//655 654//654 
f 654//654 655//655 656//656 
f 655//655 635//635 637//637 
f 655//655 657//657 656//656 
f 654//654 656//656 666//666 
f 674//674 666//666 656//656 
f 684//684 675//675 3//3 
f 657//657 674//674 656//656 
f 660//660 658//658 665//665 
f 759//759 659//659 618//618 
f 618//618 752//752 759//759 
f 416//416 661//661 663//663 
f 661//661 667//667 658//658 
f 661//661 658//658 660//660 
f 660//660 663//663 661//661 
f 288//288 667//667 716//716 
f 664//664 663//663 660//660 
f 666//666 674//674 420//420 
f 660//660 665//665 664//664 
f 657//657 677//677 674//674 
f 668//668 590//590 657//657 
f 700//700 673//673 699//699 
f 663//663 664//664 3//3 
f 700//700 701//701 702//702 
f 657//657 590//590 677//677 
f 667//667 665//665 658//658 
f 667//667 288//288 694//694 
f 665//665 667//667 695//695 
f 695//695 667//667 694//694 
f 677//677 590//590 602//602 
f 674//674 679//679 420//420 
f 674//674 677//677 679//679 
f 677//677 682//682 679//679 
f 677//677 602//602 682//682 
f 612//612 611//611 729//729 
f 761//761 762//762 692//692 
f 253//253 663//663 3//3 
f 683//683 685//685 686//686 
f 686//686 506//506 711//711 
f 722//722 678//678 702//702 
f 683//683 686//686 707//707 
f 444//444 659//659 759//759 
f 765//765 3//3 681//681 
f 678//678 722//722 729//729 
f 675//675 670//670 687//687 
f 691//691 747//747 689//689 
f 675//675 687//687 268//268 
f 600//600 682//682 602//602 
f 684//684 670//670 675//675 
f 691//691 703//703 747//747 
f 693//693 703//703 691//691 
f 749//749 755//755 703//703 
f 750//750 749//749 703//703 
f 703//703 693//693 750//750 
f 697//697 672//672 669//669 
f 669//669 690//690 697//697 
f 691//691 683//683 704//704 
f 704//704 693//693 691//691 
f 683//683 691//691 689//689 
f 698//698 690//690 665//665 
f 698//698 665//665 695//695 
f 683//683 706//706 704//704 
f 698//698 695//695 702//702 
f 694//694 702//702 695//695 
f 696//696 672//672 697//697 
f 698//698 697//697 690//690 
f 697//697 698//698 699//699 
f 699//699 696//696 697//697 
f 699//699 698//698 701//701 
f 701//701 700//700 699//699 
f 704//704 750//750 693//693 
f 701//701 698//698 702//702 
f 708//708 750//750 704//704 
f 704//704 706//706 708//708 
f 750//750 708//708 724//724 
f 707//707 706//706 683//683 
f 702//702 694//694 722//722 
f 707//707 709//709 706//706 
f 711//711 709//709 707//707 
f 707//707 686//686 711//711 
f 706//706 709//709 708//708 
f 708//708 718//718 724//724 
f 710//710 708//708 709//709 
f 709//709 711//711 487//487 
f 708//708 710//710 718//718 
f 680//680 713//713 712//712 
f 680//680 759//759 713//713 
f 752//752 713//713 759//759 
f 712//712 713//713 678//678 
f 678//678 713//713 700//700 
f 724//724 760//760 750//750 
f 673//673 700//700 713//713 
f 678//678 700//700 702//702 
f 673//673 713//713 752//752 
f 303//303 716//716 715//715 
f 719//719 220//220 705//705 
f 715//715 714//714 303//303 
f 716//716 303//303 288//288 
f 712//712 678//678 729//729 
f 661//661 717//717 667//667 
f 717//717 716//716 667//667 
f 719//719 724//724 718//718 
f 622//622 685//685 683//683 
f 416//416 717//717 661//661 
f 717//717 416//416 415//415 
f 725//725 753//753 754//754 
f 721//721 559//559 23//23 
f 612//612 729//729 720//720 
f 720//720 729//729 723//723 
f 720//720 721//721 612//612 
f 705//705 724//724 719//719 
f 720//720 723//723 726//726 
f 739//739 738//738 559//559 
f 559//559 721//721 725//725 
f 725//725 739//739 559//559 
f 725//725 726//726 753//753 
f 741//741 751//751 312//312 
f 311//311 753//753 726//726 
f 726//726 721//721 720//720 
f 726//726 725//725 721//721 
f 729//729 722//722 723//723 
f 726//726 723//723 446//446 
f 726//726 446//446 311//311 
f 746//746 727//727 739//739 
f 731//731 738//738 739//739 
f 765//765 681//681 748//748 
f 727//727 731//731 739//739 
f 736//736 728//728 745//745 
f 746//746 739//739 725//725 
f 680//680 712//712 556//556 
f 746//746 728//728 727//727 
f 754//754 746//746 725//725 
f 731//731 736//736 5//5 
f 736//736 731//731 727//727 
f 302//302 741//741 312//312 
f 751//751 294//294 312//312 
f 5//5 568//568 731//731 
f 736//736 733//733 5//5 
f 694//694 288//288 757//757 
f 3//3 765//765 253//253 
f 748//748 734//734 705//705 
f 736//736 764//764 733//733 
f 736//736 745//745 764//764 
f 733//733 737//737 740//740 
f 733//733 764//764 737//737 
f 758//758 763//763 634//634 
f 764//764 634//634 737//737 
f 748//748 763//763 734//734 
f 584//584 744//744 641//641 
f 641//641 744//744 594//594 
f 743//743 593//593 744//744 
f 760//760 749//749 750//750 
f 584//584 737//737 742//742 
f 584//584 740//740 737//737 
f 584//584 742//742 744//744 
f 742//742 737//737 634//634 
f 744//744 742//742 743//743 
f 744//744 593//593 594//594 
f 728//728 754//754 762//762 
f 734//734 758//758 760//760 
f 755//755 749//749 760//760 
f 755//755 760//760 758//758 
f 303//303 714//714 688//688 
f 762//762 745//745 728//728 
f 755//755 758//758 692//692 
f 705//705 765//765 748//748 
f 649//649 747//747 754//754 
f 724//724 705//705 734//734 
f 751//751 741//741 550//550 
f 751//751 550//550 659//659 
f 724//724 734//734 760//760 
f 754//754 747//747 756//756 
f 745//745 761//761 764//764 
f 762//762 761//761 745//745 
f 552//552 659//659 444//444 
f 7//7 766//766 1//1 
f 2//2 766//766 7//7 
f 599//599 767//767 82//82 
f 221//221 768//768 163//163 
f 769//769 531//531 771//771 
f 536//536 769//769 532//532 
f 638//638 770//770 566//566 
f 534//534 771//771 539//539 
f 532//532 771//771 534//534 
f 771//771 531//531 203//203 
f 596//596 82//82 774//774 
f 82//82 772//772 774//774 
f 772//772 596//596 774//774 
f 466//466 463//463 775//775 
f 463//463 773//773 775//775 
f 773//773 466//466 775//775 
