# PIPER geometrical reference model based on a manual segmentation. See the
# documentation for more info.
# Author: CEESAR, SOTON, UCBL-Ifsttar
# Version: 1.0.0
# License: Creative Commons Attribution 4.0 International License.
# (https://creativecommons.org/licenses/by/4.0/)
# 
# This work has received funding from the European Union Seventh Framework
# Program ([FP7/2007-2013]) under grant agreement 605544 [PIPER project]).
# Contributors include Pierre Maillez, Christophe Lecomte (SOTON), Erwan
# Jolivet (CEESAR), Philippe Beillas (UCBL-Ifsttar)
# This work is derived from a CT scan provided by CEESAR under a CCBY-4.0
# License
# 
# wavefront obj file written by the visualization toolkit

mtllib C:/desktop/registration_reference_model/22_REF_LTE635_Assembly_hands_corr/CCTu635_BP179_Metatarsal3_R.mtl

v 2.93899 168.683 -1710.99
v -7.25901 158.009 -1722.56
v 1.32899 158.141 -1717.11
v 2.77199 158.688 -1721.51
v -7.12201 158.734 -1719.91
v -7.90101 161.259 -1719.77
v -5.22801 166.265 -1725.06
v 2.42499 166.304 -1709.9
v -3.86501 166.171 -1727.39
v -2.96701 160.095 -1725.99
v 4.79398 168.102 -1727.82
v 1.15598 175.577 -1720.1
v -3.96401 168.179 -1721.87
v -3.34901 166.766 -1717.49
v 3.19198 176.157 -1719.28
v 0.619984 178.424 -1725.16
v 3.29998 175.425 -1731.89
v 0.847985 175.371 -1729.21
v 2.89798 186.48 -1730.25
v 2.55699 163.061 -1711.18
v 7.00699 163.117 -1711.92
v 9.45399 159.263 -1717.83
v 1.56799 156.883 -1719.91
v 9.47299 159.276 -1714.85
v 10.027 166.436 -1717.71
v 6.80499 166.828 -1724.44
v 10.567 165.724 -1720.09
v 5.72298 174.827 -1719.34
v 8.31799 169.133 -1716.99
v 7.77199 172.482 -1725.24
v 2.22698 170.23 -1730.88
v 5.84498 177.368 -1732.44
v 8.50698 177.593 -1727.78
v 7.62898 176.602 -1723.38
v 9.69398 184.21 -1729.5
v 6.53898 183.56 -1726.07
v 9.56098 186.703 -1733.82
v 3.68498 185.715 -1726.87
v 4.16498 192.49 -1733.6
v 5.94998 190.266 -1730.61
v 8.71698 187.677 -1730.16
v 4.38598 180.92 -1734.29
v 6.89098 186.38 -1737.01
v 4.46898 188.774 -1736.72
v 5.03298 207.372 -1755.66
v 2.98998 207.558 -1752.03
v 5.86298 198.691 -1742.24
v 8.14398 193.614 -1741.43
v 9.40398 190.828 -1737.82
v 7.22598 196.958 -1735.27
v 10.982 195.521 -1736.34
v 11.592 197.687 -1740.28
v 10.598 203.905 -1740.45
v 12.309 201.625 -1741.28
v 6.62398 196.051 -1742.75
v 8.03798 200.166 -1747.49
v 6.98198 203.002 -1742.27
v 11.156 200.069 -1745.19
v 6.32298 201.544 -1747.99
v 5.77998 206.178 -1747.09
v 5.13498 204.158 -1753.12
v 11.427 203.826 -1752.18
v 15.685 206.724 -1747.47
v 9.00198 204.128 -1740.56
v 8.36098 211.022 -1744.23
v 10.88 211.24 -1743.41
v 5.78298 213.38 -1751.27
v 15.056 215.394 -1747.97
v 16.228 213.735 -1748.32
v 9.80098 216.889 -1748.91
v 7.43598 204.398 -1755.38
v 10.509 206.313 -1756.55
v 10.953 209.585 -1757.94
v 7.78098 216.116 -1753.26
v 5.84498 211.912 -1755.64
v 10.682 213.429 -1757.33
v 15.089 209.485 -1753.42
v 15.435 214.235 -1753.89
v 12.689 216.343 -1754.12
v 13.216 215.562 -1747.95
vn -0.0212874 0.571763 0.820143
vn -0.67123 -0.670177 -0.316721
vn -0.136506 -0.836131 0.531273
vn 0.394765 -0.651143 -0.648208
vn -0.636016 -0.623659 0.454459
vn -0.953893 0.0774191 0.28999
vn -0.911853 0.304181 -0.275678
vn -0.180518 0.128154 0.975187
vn -0.665035 0.00444669 -0.746799
vn -0.07705 -0.588559 -0.804774
vn 0.62066 -0.446313 -0.64466
vn -0.644974 0.563612 0.516091
vn -0.860306 0.478202 0.176627
vn -0.762131 0.460777 0.454798
vn -0.0613865 0.674246 0.735951
vn -0.918881 0.385652 0.0832527
vn -0.402372 -0.145019 -0.903917
vn -0.842248 0.224416 -0.490159
vn -0.975589 0.219501 -0.0067197
vn -0.188358 -0.509407 0.839658
vn 0.539974 -0.101361 0.835556
vn 0.712276 -0.640523 -0.287043
vn 0.103722 -0.988519 -0.109869
vn 0.652181 -0.591686 0.473886
vn 0.905246 0.30402 0.296819
vn 0.679558 -0.360873 -0.638726
vn 0.968025 -0.033271 -0.248639
vn 0.536531 0.565314 0.626542
vn 0.765219 0.425568 0.483044
vn 0.92646 -0.116447 -0.357927
vn 0.034349 -0.336822 -0.940942
vn 0.515986 -0.417027 -0.748229
vn 0.958234 -0.242899 -0.150954
vn 0.914078 0.220072 0.340633
vn 0.951434 0.0600131 0.301945
vn 0.458027 0.48923 0.742203
vn 0.907892 -0.301294 -0.29147
vn -0.405302 0.616003 0.675478
vn -0.861495 0.407867 0.302441
vn 0.0292812 0.620348 0.78378
vn 0.546349 0.422456 0.723211
vn -0.510526 -0.259692 -0.819709
vn 0.0935239 -0.451056 -0.887582
vn -0.839364 -0.175987 -0.514292
vn -0.64696 -0.163843 -0.744714
vn -0.997455 -0.0570634 0.0427386
vn -0.990525 0.0500089 -0.127901
vn 0.221578 -0.595487 -0.772204
vn 0.721918 -0.451457 -0.524425
vn -0.123493 0.611087 0.781871
vn 0.839206 0.189003 0.509913
vn 0.958441 -0.262226 -0.112376
vn 0.398191 0.403109 0.823982
vn 0.938483 -0.0279486 0.344194
vn -0.67227 -0.429763 -0.60279
vn -0.0156102 -0.804009 -0.594413
vn -0.867082 0.373793 0.329313
vn 0.69993 -0.60996 -0.371546
vn -0.874982 -0.458494 -0.155529
vn -0.932168 0.0330062 0.360517
vn -0.710967 -0.639225 -0.293116
vn 0.535555 -0.724215 -0.434388
vn 0.949617 -0.309191 0.0512669
vn -0.405309 0.505311 0.761831
vn -0.621036 0.43772 0.650166
vn 0.129984 0.48687 0.863748
vn -0.854127 0.489658 0.175219
vn 0.546374 0.721479 0.425374
vn 0.92486 0.256275 0.280992
vn -0.245957 0.903627 0.350663
vn -0.150306 -0.686558 -0.71137
vn 0.334508 -0.55156 -0.764124
vn 0.222499 -0.119161 -0.967623
vn -0.511623 0.816272 -0.26822
vn -0.686804 0.360054 -0.631396
vn 0.0386093 0.428772 -0.902588
vn 0.860914 -0.283415 -0.422496
vn 0.823282 0.350735 -0.446309
vn 0.274549 0.864192 -0.421657
vn 0.07263 0.703253 0.70722

g grp1
usemtl mtl1
f 8//8 5//5 20//20 
f 8//8 1//1 14//14 
f 5//5 23//23 3//3 
f 5//5 2//2 23//23 
f 23//23 2//2 10//10 
f 10//10 4//4 23//23 
f 5//5 6//6 2//2 
f 2//2 6//6 7//7 
f 7//7 9//9 2//2 
f 8//8 6//6 5//5 
f 20//20 5//5 3//3 
f 8//8 14//14 6//6 
f 13//13 6//6 14//14 
f 6//6 13//13 7//7 
f 4//4 11//11 26//26 
f 2//2 9//9 10//10 
f 4//4 10//10 11//11 
f 10//10 9//9 31//31 
f 11//11 10//10 31//31 
f 1//1 12//12 14//14 
f 12//12 1//1 15//15 
f 14//14 12//12 16//16 
f 14//14 16//16 13//13 
f 38//38 12//12 15//15 
f 16//16 12//12 38//38 
f 16//16 7//7 13//13 
f 18//18 7//7 16//16 
f 9//9 7//7 18//18 
f 19//19 18//18 16//16 
f 31//31 9//9 17//17 
f 9//9 18//18 17//17 
f 42//42 17//17 18//18 
f 18//18 19//19 42//42 
f 38//38 19//19 16//16 
f 44//44 42//42 19//19 
f 24//24 21//21 20//20 
f 8//8 20//20 21//21 
f 8//8 21//21 1//1 
f 21//21 25//25 29//29 
f 29//29 1//1 21//21 
f 28//28 15//15 1//1 
f 1//1 29//29 28//28 
f 3//3 23//23 24//24 
f 24//24 23//23 22//22 
f 20//20 3//3 24//24 
f 22//22 23//23 4//4 
f 26//26 22//22 4//4 
f 24//24 22//22 27//27 
f 26//26 27//27 22//22 
f 24//24 25//25 21//21 
f 24//24 27//27 25//25 
f 27//27 29//29 25//25 
f 30//30 27//27 26//26 
f 29//29 27//27 34//34 
f 29//29 34//34 28//28 
f 30//30 34//34 27//27 
f 36//36 15//15 28//28 
f 36//36 28//28 34//34 
f 15//15 36//36 38//38 
f 30//30 26//26 11//11 
f 34//34 30//30 33//33 
f 11//11 33//33 30//30 
f 31//31 32//32 11//11 
f 32//32 33//33 11//11 
f 17//17 32//32 31//31 
f 42//42 32//32 17//17 
f 33//33 35//35 34//34 
f 34//34 35//35 36//36 
f 35//35 41//41 36//36 
f 33//33 37//37 35//35 
f 33//33 32//32 37//37 
f 37//37 32//32 49//49 
f 39//39 19//19 38//38 
f 19//19 39//39 44//44 
f 40//40 38//38 36//36 
f 41//41 40//40 36//36 
f 38//38 40//40 39//39 
f 41//41 50//50 40//40 
f 35//35 51//51 41//41 
f 35//35 37//37 51//51 
f 40//40 50//50 39//39 
f 32//32 42//42 43//43 
f 49//49 32//32 43//43 
f 42//42 44//44 43//43 
f 47//47 44//44 39//39 
f 45//45 61//61 46//46 
f 46//46 75//75 45//45 
f 67//67 75//75 46//46 
f 43//43 44//44 55//55 
f 55//55 48//48 43//43 
f 49//49 43//43 48//48 
f 51//51 37//37 52//52 
f 50//50 41//41 51//51 
f 37//37 49//49 52//52 
f 44//44 47//47 55//55 
f 49//49 48//48 58//58 
f 57//57 39//39 50//50 
f 64//64 57//57 50//50 
f 47//47 39//39 57//57 
f 53//53 50//50 51//51 
f 53//53 51//51 54//54 
f 51//51 52//52 54//54 
f 52//52 49//49 58//58 
f 54//54 52//52 58//58 
f 60//60 57//57 64//64 
f 50//50 53//53 64//64 
f 59//59 55//55 47//47 
f 48//48 55//55 56//56 
f 48//48 56//56 58//58 
f 56//56 55//55 59//59 
f 47//47 57//57 59//59 
f 57//57 60//60 59//59 
f 54//54 58//58 63//63 
f 58//58 56//56 62//62 
f 61//61 59//59 60//60 
f 60//60 46//46 61//61 
f 61//61 56//56 59//59 
f 61//61 71//71 56//56 
f 62//62 63//63 58//58 
f 65//65 60//60 64//64 
f 66//66 65//65 64//64 
f 64//64 53//53 66//66 
f 66//66 53//53 54//54 
f 69//69 68//68 54//54 
f 66//66 54//54 68//68 
f 67//67 60//60 65//65 
f 66//66 70//70 65//65 
f 60//60 67//67 46//46 
f 70//70 67//67 65//65 
f 63//63 69//69 54//54 
f 62//62 77//77 63//63 
f 77//77 69//69 63//63 
f 69//69 77//77 78//78 
f 68//68 69//69 78//78 
f 67//67 70//70 74//74 
f 70//70 79//79 74//74 
f 68//68 79//79 70//70 
f 78//78 79//79 68//68 
f 56//56 71//71 62//62 
f 62//62 71//71 72//72 
f 45//45 71//71 61//61 
f 73//73 71//71 45//45 
f 71//71 73//73 72//72 
f 72//72 77//77 62//62 
f 73//73 77//77 72//72 
f 74//74 75//75 67//67 
f 73//73 45//45 75//75 
f 75//75 76//76 73//73 
f 76//76 75//75 74//74 
f 77//77 73//73 78//78 
f 73//73 76//76 78//78 
f 79//79 78//78 76//76 
f 74//74 79//79 76//76 
f 68//68 70//70 80//80 
f 70//70 66//66 80//80 
f 66//66 68//68 80//80 
