# PIPER geometrical reference model based on a manual segmentation. See the
# documentation for more info.
# Author: CEESAR, SOTON, UCBL-Ifsttar
# Version: 1.0.0
# License: Creative Commons Attribution 4.0 International License.
# (https://creativecommons.org/licenses/by/4.0/)
# 
# This work has received funding from the European Union Seventh Framework
# Program ([FP7/2007-2013]) under grant agreement 605544 [PIPER project]).
# Contributors include Pierre Maillez, Christophe Lecomte (SOTON), Erwan
# Jolivet (CEESAR), Philippe Beillas (UCBL-Ifsttar)
# This work is derived from a CT scan provided by CEESAR under a CCBY-4.0
# License
# 
# wavefront obj file written by the visualization toolkit

mtllib C:/desktop/registration_reference_model/22_REF_LTE635_Assembly_hands_corr/CCTu635_BP098_Trapezium_L.mtl

v -101.001 237.419 -897.789
v -102.561 239.644 -898.271
v -99.5662 236.608 -897.413
v -98.2836 236.312 -897.725
v -98.7545 238.145 -896.513
v -99.2329 241.071 -896.128
v -100.608 239.298 -896.915
v -97.5136 239.976 -896.253
v -95.8156 240.031 -896.722
v -96.5084 241.57 -896.684
v -97.2401 237.636 -897.526
v -100.965 233.779 -903.514
v -99.8022 233.944 -900.361
v -98.8436 234.759 -898.868
v -101.088 234.703 -900.131
v -97.2407 235.628 -899.709
v -98.4514 234.125 -900.662
v -99.1535 233.71 -902.217
v -99.7577 233.611 -903.952
v -98.3536 234.002 -903.829
v -98.9617 234.597 -905.322
v -101.873 237.158 -898.795
v -102.016 235.77 -900.243
v -102.845 236.273 -901.775
v -102.871 238.136 -899.823
v -103.74 240.285 -900.266
v -102.395 235.116 -902.697
v -103.065 236.175 -903.703
v -103.698 239.692 -903.123
v -100.823 235.713 -898.585
v -99.9332 234.653 -898.795
v -95.1456 238.354 -898.751
v -96.3158 236.981 -898.85
v -95.4918 237 -900.064
v -97.3666 234.631 -902.43
v -96.0081 235.515 -903.309
v -96.8656 235.023 -904.472
v -94.2168 240.063 -897.743
v -93.7452 237.62 -900.767
v -92.3414 237.439 -901.371
v -92.4006 240.911 -899.415
v -93.1861 239.139 -899.591
v -91.6804 238.358 -900.728
v -91.9187 239.526 -900.158
v -90.4017 239.687 -900.91
v -88.7767 240.443 -902.128
v -95.0086 236.42 -902.248
v -89.5455 236.29 -902.421
v -90.581 237.156 -901.363
v -93.3549 236.617 -902.632
v -88.2322 235.556 -904.038
v -89.5816 237.93 -900.956
v -87.1528 237.699 -902.149
v -87.8718 236.486 -902.293
v -86.801 235.778 -904.056
v -86.5655 236.659 -902.813
v -85.6086 237.635 -903.172
v -88.0642 238.463 -901.579
v -86.0945 238.594 -903.62
v -87.4467 240.088 -903.135
v -102.744 241.994 -897.338
v -103.557 244.123 -898.136
v -101.551 242.223 -896.712
v -101.264 243.895 -896.711
v -99.1649 242.475 -896.601
v -96.1616 243.977 -898.087
v -101.156 244.787 -897.451
v -99.8558 244.159 -897.12
v -104.656 243.687 -899.01
v -104.671 242.965 -900.302
v -104.044 241.984 -902.225
v -104.635 243.669 -901.897
v -104.065 242.149 -898.725
v -104.934 244.744 -900.563
v -104.685 245.995 -901.405
v -103.893 247.149 -901.926
v -104.392 246.676 -900.715
v -104.336 245.363 -899.155
v -102.809 245.784 -898.849
v -103.682 247.134 -900.46
v -100.141 245.685 -898.182
v -101.08 247.051 -900.352
v -103.929 243.562 -903.678
v -103.595 241.733 -904.086
v -104.48 245.404 -902.52
v -103.692 245.543 -905.642
v -103.907 246.575 -903.662
v -97.9546 245.262 -898.097
v -98.6286 247.068 -898.845
v -100.171 246.698 -899.688
v -94.6954 245.578 -898.754
v -100.106 247.681 -902.576
v -99.032 247.311 -901.324
v -102.619 248.011 -901.326
v -102.438 247.851 -905.706
v -102.206 248.236 -903.472
v -101.161 248.134 -905.456
v -97.033 247.895 -899.095
v -96.3854 248.451 -899.972
v -95.7878 247.586 -899.269
v -97.3182 248.358 -900.087
v -95.1792 247.904 -900.28
v -95.7483 248.393 -901.497
v -101.449 248.234 -902.169
v -96.9973 247.524 -903.69
v -94.7395 241.436 -896.804
v -93.8654 241.478 -897.337
v -92.9111 242.316 -898.435
v -94.5149 242.82 -897.516
v -93.633 244.379 -898.494
v -93.1389 243.163 -897.995
v -92.3196 242.9 -899.743
v -92.1647 244.272 -901.411
v -94.1609 246.312 -899.602
v -92.9205 244.565 -899.785
v -94.1248 246.846 -900.725
v -87.5904 241.801 -903.602
v -90.3787 242.171 -901.419
v -90.3653 243.185 -902.787
v -91.828 244.492 -903.166
v -89.865 243.189 -904.336
v -93.2168 245.74 -902.252
v -93.5808 245.907 -904.055
v -87.2897 241.98 -905.073
v -94.7578 247.729 -901.853
v -95.0811 247.756 -903.288
v -102.351 234.74 -905.031
v -100.747 234.655 -905.999
v -100.917 233.729 -905.238
v -102.218 235.098 -906.179
v -102.854 236.173 -905.85
v -103.308 237.721 -904.933
v -101.808 236.52 -906.85
v -102.387 238.448 -907.668
v -103.09 239.028 -906.837
v -103.168 240.382 -905.707
v -101.087 240.812 -907.756
v -102.358 240.027 -907.703
v -99.9832 236.307 -906.597
v -97.4723 235.695 -905.722
v -94.7896 235.987 -904.086
v -95.9346 236.106 -905.628
v -97.0009 237.365 -906.915
v -98.6522 236.85 -906.651
v -99.9354 239.461 -907.766
v -97.7915 239.158 -907.87
v -98.2995 240.471 -908.163
v -95.8359 240.08 -909.049
v -96.6257 241.466 -908.577
v -94.0724 236.232 -905.718
v -91.6569 236.011 -908.241
v -93.4702 236.31 -906.576
v -92.9251 237.009 -908.598
v -92.2819 236.002 -904.596
v -90.9583 235.618 -906.507
v -89.1222 235.874 -907.823
v -94.853 237.805 -908.171
v -92.9569 238.071 -909.975
v -90.5608 235.659 -907.608
v -89.3699 236.593 -909.959
v -90.4899 236.212 -909.432
v -91.6864 236.849 -910.028
v -88.82 237.372 -910.636
v -94.9745 238.919 -909.092
v -93.4342 239.479 -910.4
v -87.9904 235.58 -905.736
v -85.563 236.465 -904.681
v -86.8301 235.882 -906.103
v -86.226 237.048 -907.228
v -85.6164 236.451 -905.799
v -85.1282 237.872 -905.49
v -85.9775 239.489 -904.958
v -86.7097 241.14 -904.742
v -86.4947 240.841 -905.908
v -85.7845 238.659 -906.521
v -88.0037 236.706 -908.944
v -87.6614 238.361 -909.406
v -86.3517 238.309 -907.916
v -87.2249 239.595 -907.878
v -91.6248 237.801 -911.314
v -90.3254 237.716 -911.514
v -91.196 238.639 -912.231
v -89.1558 238.538 -911.279
v -91.7523 240.176 -911.865
v -90.1781 239.802 -912.051
v -90.7988 239.436 -912.516
v -103.132 243.045 -905.697
v -102.375 241.349 -906.898
v -102.354 243.406 -906.963
v -103.389 246.561 -905.562
v -102.811 245.34 -906.904
v -102.016 244.552 -907.695
v -101.637 247.402 -907.018
v -101.436 242.745 -907.622
v -101.323 245.488 -908.079
v -102.31 246.715 -907.48
v -99.0096 246.326 -907.479
v -96.4307 247.177 -904.64
v -95.4384 246.086 -905.407
v -97.4444 246.267 -906.33
v -97.5736 244.861 -907.373
v -99.8705 242.982 -907.881
v -98.5182 241.854 -907.966
v -98.1503 243.835 -907.894
v -93.8878 240.989 -910.193
v -96.3 244.454 -907.671
v -96.479 243.189 -908.297
v -100.162 245.666 -908.17
v -100.606 246.646 -907.902
v -101.127 248.433 -903.869
v -99.6242 247.984 -905.673
v -97.8434 247.374 -905.165
v -99.5128 247.594 -906.581
v -89.806 243.13 -905.996
v -89.0853 242.422 -907.24
v -93.7925 244.953 -906.453
v -92.3814 244.339 -908.164
v -94.9759 244.224 -908.289
v -94.3011 243.303 -909.385
v -92.1103 243.196 -910.687
v -89.7246 242.269 -909.585
v -91.0824 243.486 -909.509
v -90.4801 243.515 -907.942
v -88.931 240.182 -909.917
v -93.1106 244.174 -909.156
v -92.3086 244.547 -905.39
v -88.1252 241.215 -907.6
v -91.0589 242.685 -911.214
v -90.4471 241.497 -911.62
v -91.3733 241.434 -911.889
vn -0.54239 -0.338634 0.768856
vn -0.728182 -0.328148 0.601723
vn -0.191962 -0.481932 0.854922
vn 0.362239 -0.584303 0.726204
vn 0.014537 -0.352263 0.935788
vn -0.0798449 0.0687476 0.994434
vn -0.432733 -0.242011 0.868432
vn 0.19511 -0.130677 0.972037
vn 0.356279 -0.30759 0.8823
vn 0.148628 0.286053 0.946617
vn 0.473008 -0.509343 0.718911
vn -0.395088 -0.913422 0.0978054
vn -0.129428 -0.950298 0.283166
vn 0.325107 -0.750392 0.575515
vn -0.601674 -0.7199 0.346024
vn 0.601699 -0.690945 0.400691
vn 0.437835 -0.865595 0.242996
vn 0.183761 -0.980361 0.0715802
vn 0.126565 -0.981222 -0.145549
vn 0.397636 -0.895543 -0.199721
vn 0.298595 -0.700059 -0.648659
vn -0.74055 -0.374187 0.558184
vn -0.779241 -0.496645 0.382267
vn -0.894594 -0.3902 0.217819
vn -0.864544 -0.322661 0.385298
vn -0.93653 -0.300095 0.18126
vn -0.768506 -0.619561 0.159823
vn -0.942548 -0.333408 0.0210476
vn -0.990513 -0.111505 -0.0803127
vn -0.575797 -0.496638 0.649468
vn -0.216859 -0.752596 0.621748
vn 0.530137 -0.605107 0.59397
vn 0.55294 -0.628379 0.547172
vn 0.56694 -0.709985 0.417732
vn 0.555256 -0.825556 0.100734
vn 0.511718 -0.852771 0.104531
vn 0.436552 -0.847811 -0.301063
vn 0.570162 -0.472409 0.67212
vn 0.323741 -0.762626 0.559993
vn 0.025345 -0.739181 0.673029
vn 0.704283 -0.135541 0.69686
vn 0.501348 -0.510153 0.698852
vn 0.200918 -0.429642 0.880364
vn 0.456475 -0.302101 0.836879
vn 0.445605 0.0674578 0.892684
vn 0.569691 0.302045 0.764344
vn 0.415907 -0.856142 0.306662
vn -0.0256211 -0.861301 0.507449
vn -0.0253082 -0.661923 0.749145
vn 0.0564734 -0.912259 0.405701
vn 0.0439312 -0.97406 0.221983
vn 0.219194 -0.239253 0.945892
vn 0.547726 -0.015627 0.836512
vn 0.248741 -0.665598 0.703639
vn 0.364477 -0.900773 0.236145
vn 0.515515 -0.552582 0.654902
vn 0.820028 0.0726272 0.567697
vn 0.519763 0.157469 0.839673
vn 0.748159 0.453236 0.484598
vn 0.676977 0.34706 0.649039
vn -0.593494 -0.112687 0.796911
vn -0.534955 0.244739 0.808657
vn -0.334479 -0.00976247 0.942352
vn -0.186534 0.359299 0.91439
vn 0.106771 0.325671 0.939435
vn 0.120369 0.384153 0.915389
vn -0.133928 0.635556 0.76035
vn 0.16212 0.473361 0.865821
vn -0.873865 -0.0477719 0.483816
vn -0.965563 -0.25953 0.0182159
vn -0.963454 -0.205988 -0.171249
vn -0.958226 -0.153726 -0.241189
vn -0.835461 -0.256244 0.486152
vn -0.995857 0.0746977 0.05186
vn -0.942579 0.301436 -0.143807
vn -0.739079 0.668534 -0.0826073
vn -0.786284 0.582781 0.20524
vn -0.671736 0.42102 0.609518
vn -0.221367 0.655446 0.722071
vn -0.407615 0.786707 0.463617
vn -0.0814846 0.670829 0.737122
vn 0.0663648 0.85291 0.517822
vn -0.942542 -0.141964 -0.302426
vn -0.965586 -0.0614407 -0.252722
vn -0.958897 0.124093 -0.25518
vn -0.903587 0.0659812 -0.423292
vn -0.884304 0.423171 -0.197311
vn 0.140151 0.378277 0.915021
vn -0.250563 0.652505 0.715161
vn -0.217602 0.870112 0.442216
vn 0.295774 0.428307 0.853857
vn 0.30187 0.925957 0.22689
vn -0.19266 0.980335 0.0427278
vn -0.21906 0.915334 0.337901
vn -0.49833 0.810947 -0.306647
vn -0.362202 0.931421 -0.035565
vn -0.0575378 0.959292 -0.276492
vn -0.0249757 0.660086 0.750775
vn 0.155097 0.937984 0.310049
vn 0.383343 0.562317 0.732699
vn -0.300036 0.945412 0.127177
vn 0.590922 0.747089 0.304415
vn 0.19458 0.974765 -0.109419
vn 0.181271 0.944643 0.27348
vn -0.0806583 0.972934 -0.21655
vn 0.340728 0.0736367 0.937274
vn 0.609771 -0.078141 0.788716
vn 0.853161 -0.0466946 0.519554
vn 0.174754 0.398425 0.900399
vn 0.511761 0.484407 0.709543
vn 0.6422 0.269092 0.717752
vn 0.825079 0.254569 0.504419
vn 0.750558 0.584014 0.309178
vn 0.66847 0.544544 0.506577
vn 0.814762 0.446132 0.37031
vn 0.775488 0.606072 0.176901
vn 0.675394 0.566083 0.472645
vn 0.638851 0.397268 0.658823
vn 0.593371 0.734283 0.329757
vn 0.636789 0.76854 0.0620173
vn 0.496112 0.865735 0.0661427
vn 0.75778 0.652406 0.0116425
vn 0.601065 0.750354 -0.275119
vn 0.643599 0.764169 -0.0427231
vn 0.675904 0.736507 -0.02668
vn 0.395087 0.844747 -0.360982
vn -0.760301 -0.640918 -0.105676
vn 0.111931 -0.539748 -0.834352
vn -0.145641 -0.903612 -0.402834
vn -0.526015 -0.52486 -0.669201
vn -0.870046 -0.305928 -0.386558
vn -0.981496 -0.147272 -0.122377
vn -0.21682 -0.39871 -0.891078
vn -0.416677 -0.232747 -0.878754
vn -0.910535 -0.00429419 -0.41341
vn -0.948111 0.0904511 -0.304801
vn -0.218099 0.0647249 -0.973778
vn -0.507785 0.186704 -0.841009
vn 0.144823 -0.411529 -0.899817
vn 0.225356 -0.660267 -0.716423
vn 0.233882 -0.971418 0.040568
vn 0.188033 -0.802222 -0.566642
vn -0.0776258 -0.624518 -0.777143
vn 0.0759035 -0.47803 -0.875058
vn -0.0495142 -0.229222 -0.972114
vn -0.223679 -0.409792 -0.884329
vn -0.221815 -0.0725598 -0.972385
vn -0.4499 -0.135028 -0.882812
vn -0.368905 0.141042 -0.918704
vn -0.117864 -0.968193 -0.220704
vn -0.322275 -0.90138 -0.289229
vn -0.300598 -0.897896 -0.321595
vn -0.490001 -0.752548 -0.439967
vn -0.102611 -0.984977 0.138896
vn -0.118671 -0.992366 -0.0335803
vn 0.172214 -0.949171 -0.26347
vn -0.360775 -0.701856 -0.614199
vn -0.585925 -0.54467 -0.600022
vn -0.0188707 -0.989531 -0.143079
vn 0.222336 -0.834392 -0.504338
vn -0.048903 -0.901934 -0.429096
vn -0.392373 -0.769407 -0.50404
vn 0.557367 -0.482484 -0.675686
vn -0.471586 -0.467675 -0.747587
vn -0.592894 -0.233673 -0.770632
vn 0.116855 -0.988242 -0.0986059
vn 0.783471 -0.605181 0.141171
vn 0.377783 -0.891213 -0.251035
vn 0.747965 -0.413236 -0.519407
vn 0.743887 -0.616466 -0.258072
vn 0.98885 0.100509 -0.109884
vn 0.915002 0.377748 0.141697
vn 0.846849 0.467705 0.253178
vn 0.813939 0.519415 -0.260214
vn 0.883937 0.274606 -0.378479
vn 0.552684 -0.663988 -0.503647
vn 0.790123 0.0614933 -0.609856
vn 0.82342 0.120781 -0.554429
vn 0.723046 0.455357 -0.519476
vn -0.455204 -0.610636 -0.648007
vn 0.150223 -0.607167 -0.780244
vn -0.284408 -0.385849 -0.877629
vn 0.646567 -0.0247433 -0.762455
vn -0.575651 0.0548668 -0.815852
vn 0.627228 0.154438 -0.76337
vn 0.0997217 -0.0281026 -0.994618
vn -0.896007 -0.0922201 -0.434359
vn -0.735968 0.12962 -0.664492
vn -0.756439 -0.132301 -0.640544
vn -0.846532 0.396924 -0.354732
vn -0.783172 -0.022083 -0.621412
vn -0.584568 -0.0872964 -0.806635
vn -0.168283 0.806048 -0.567422
vn -0.395916 -0.0725614 -0.915415
vn -0.289122 0.0299561 -0.956823
vn -0.568828 0.377184 -0.730868
vn 0.407736 0.488101 -0.771693
vn 0.235994 0.839644 -0.489188
vn 0.33467 0.749471 -0.571217
vn 0.398765 0.659498 -0.63722
vn 0.183244 0.468517 -0.864242
vn -0.0753558 -0.0416405 -0.996287
vn -0.16184 0.0795142 -0.983608
vn 0.0272046 0.175409 -0.98412
vn -0.544609 0.0790616 -0.834955
vn -0.0171809 0.645283 -0.76375
vn -0.28731 0.309039 -0.906614
vn 0.108424 0.144463 -0.983552
vn 0.0414198 0.521141 -0.852465
vn 0.0743872 0.997145 0.0129715
vn 0.227897 0.948784 -0.218795
vn 0.315379 0.904765 -0.286244
vn 0.270933 0.806111 -0.526099
vn 0.500232 0.863778 -0.0604631
vn 0.638264 0.733208 -0.234576
vn 0.230558 0.910007 -0.344573
vn 0.280009 0.939008 -0.199647
vn -0.220562 0.784274 -0.579885
vn -0.428391 0.439068 -0.789747
vn -0.137944 0.703829 -0.696847
vn 0.735536 0.574773 -0.35864
vn 0.440659 0.83969 -0.317397
vn 0.547675 0.824761 -0.140785
vn 0.784274 0.369863 -0.498112
vn -0.06348 0.867581 -0.493228
vn 0.493387 0.859196 -0.135468
vn 0.709195 0.557887 -0.431051
vn 0.301033 0.668287 -0.680273
vn 0.565429 0.392815 -0.725249
vn -0.173889 0.31636 -0.932566

g grp1
usemtl mtl1
f 2//2 1//1 7//7 
f 7//7 61//61 2//2 
f 3//3 30//30 31//31 
f 3//3 14//14 4//4 
f 1//1 30//30 3//3 
f 22//22 30//30 1//1 
f 5//5 3//3 4//4 
f 11//11 5//5 4//4 
f 11//11 33//33 32//32 
f 6//6 63//63 7//7 
f 7//7 5//5 6//6 
f 5//5 8//8 6//6 
f 3//3 7//7 1//1 
f 5//5 7//7 3//3 
f 7//7 63//63 61//61 
f 10//10 6//6 8//8 
f 8//8 9//9 10//10 
f 11//11 8//8 5//5 
f 9//9 8//8 11//11 
f 32//32 9//9 11//11 
f 27//27 12//12 15//15 
f 12//12 27//27 127//127 
f 30//30 15//15 31//31 
f 31//31 15//15 13//13 
f 13//13 14//14 31//31 
f 13//13 15//15 12//12 
f 13//13 17//17 14//14 
f 14//14 17//17 16//16 
f 12//12 18//18 13//13 
f 17//17 13//13 18//18 
f 17//17 18//18 35//35 
f 16//16 17//17 35//35 
f 18//18 12//12 19//19 
f 18//18 19//19 20//20 
f 19//19 21//21 20//20 
f 20//20 35//35 18//18 
f 35//35 20//20 37//37 
f 21//21 37//37 20//20 
f 30//30 23//23 15//15 
f 30//30 22//22 23//23 
f 22//22 25//25 23//23 
f 27//27 15//15 23//23 
f 23//23 24//24 27//27 
f 25//25 26//26 24//24 
f 23//23 25//25 24//24 
f 26//26 25//25 2//2 
f 2//2 22//22 1//1 
f 2//2 25//25 22//22 
f 73//73 26//26 2//2 
f 24//24 26//26 28//28 
f 24//24 28//28 27//27 
f 27//27 28//28 127//127 
f 29//29 28//28 26//26 
f 28//28 29//29 132//132 
f 71//71 29//29 26//26 
f 14//14 3//3 31//31 
f 4//4 14//14 16//16 
f 16//16 11//11 4//4 
f 16//16 33//33 11//11 
f 33//33 34//34 32//32 
f 33//33 16//16 34//34 
f 16//16 35//35 47//47 
f 16//16 47//47 34//34 
f 35//35 36//36 47//47 
f 35//35 37//37 36//36 
f 47//47 36//36 141//141 
f 37//37 141//141 36//36 
f 38//38 9//9 32//32 
f 38//38 107//107 9//9 
f 107//107 38//38 41//41 
f 32//32 34//34 39//39 
f 34//34 47//47 39//39 
f 43//43 39//39 40//40 
f 43//43 40//40 49//49 
f 43//43 49//49 52//52 
f 32//32 42//42 38//38 
f 32//32 39//39 42//42 
f 42//42 41//41 38//38 
f 41//41 42//42 44//44 
f 42//42 39//39 43//43 
f 44//44 42//42 43//43 
f 44//44 43//43 45//45 
f 43//43 52//52 45//45 
f 45//45 52//52 58//58 
f 41//41 44//44 45//45 
f 45//45 58//58 46//46 
f 46//46 118//118 45//45 
f 39//39 47//47 50//50 
f 40//40 39//39 50//50 
f 47//47 141//141 50//50 
f 50//50 141//141 154//154 
f 49//49 40//40 50//50 
f 49//49 50//50 48//48 
f 49//49 48//48 54//54 
f 52//52 49//49 54//54 
f 48//48 50//50 51//51 
f 56//56 53//53 54//54 
f 52//52 54//54 53//53 
f 56//56 54//54 55//55 
f 53//53 56//56 57//57 
f 54//54 48//48 51//51 
f 51//51 55//55 54//54 
f 55//55 167//167 56//56 
f 56//56 167//167 57//57 
f 57//57 167//167 171//171 
f 52//52 53//53 58//58 
f 59//59 58//58 53//53 
f 57//57 59//59 53//53 
f 60//60 46//46 58//58 
f 59//59 60//60 58//58 
f 173//173 60//60 59//59 
f 117//117 60//60 173//173 
f 171//171 59//59 57//57 
f 73//73 2//2 61//61 
f 69//69 73//73 62//62 
f 61//61 62//62 73//73 
f 61//61 63//63 62//62 
f 63//63 64//64 62//62 
f 67//67 62//62 64//64 
f 62//62 67//67 79//79 
f 67//67 81//81 79//79 
f 6//6 65//65 63//63 
f 63//63 65//65 64//64 
f 68//68 64//64 65//65 
f 10//10 65//65 6//6 
f 9//9 106//106 10//10 
f 10//10 66//66 65//65 
f 106//106 109//109 10//10 
f 10//10 109//109 66//66 
f 64//64 68//68 67//67 
f 81//81 67//67 68//68 
f 68//68 65//65 88//88 
f 81//81 68//68 88//88 
f 89//89 81//81 88//88 
f 65//65 66//66 88//88 
f 73//73 69//69 70//70 
f 78//78 74//74 69//69 
f 69//69 74//74 70//70 
f 70//70 72//72 71//71 
f 70//70 74//74 72//72 
f 73//73 70//70 26//26 
f 78//78 69//69 62//62 
f 70//70 71//71 26//26 
f 78//78 77//77 74//74 
f 75//75 74//74 77//77 
f 77//77 76//76 75//75 
f 78//78 62//62 79//79 
f 78//78 80//80 77//77 
f 80//80 78//78 79//79 
f 82//82 79//79 81//81 
f 94//94 80//80 79//79 
f 94//94 79//79 82//82 
f 71//71 72//72 83//83 
f 71//71 84//84 29//29 
f 71//71 83//83 84//84 
f 85//85 83//83 72//72 
f 74//74 85//85 72//72 
f 75//75 85//85 74//74 
f 76//76 85//85 75//75 
f 87//87 85//85 76//76 
f 76//76 95//95 87//87 
f 85//85 86//86 83//83 
f 85//85 87//87 86//86 
f 190//190 86//86 87//87 
f 87//87 95//95 190//190 
f 81//81 89//89 90//90 
f 81//81 90//90 82//82 
f 93//93 82//82 90//90 
f 88//88 66//66 91//91 
f 98//98 88//88 91//91 
f 88//88 98//98 89//89 
f 98//98 91//91 100//100 
f 100//100 91//91 114//114 
f 82//82 93//93 92//92 
f 92//92 93//93 212//212 
f 77//77 80//80 76//76 
f 94//94 82//82 104//104 
f 80//80 94//94 76//76 
f 96//96 76//76 94//94 
f 76//76 96//96 95//95 
f 94//94 104//104 96//96 
f 104//104 210//210 96//96 
f 210//210 97//97 96//96 
f 96//96 97//97 95//95 
f 101//101 90//90 89//89 
f 101//101 93//93 90//90 
f 101//101 89//89 98//98 
f 99//99 101//101 98//98 
f 102//102 100//100 114//114 
f 98//98 100//100 99//99 
f 99//99 100//100 102//102 
f 103//103 101//101 99//99 
f 99//99 102//102 103//103 
f 125//125 103//103 102//102 
f 82//82 92//92 104//104 
f 104//104 92//92 210//210 
f 93//93 105//105 212//212 
f 92//92 212//212 210//210 
f 105//105 93//93 101//101 
f 101//101 103//103 105//105 
f 125//125 126//126 103//103 
f 126//126 105//105 103//103 
f 105//105 198//198 212//212 
f 126//126 198//198 105//105 
f 9//9 107//107 106//106 
f 106//106 107//107 109//109 
f 109//109 107//107 111//111 
f 107//107 41//41 108//108 
f 111//111 107//107 108//108 
f 111//111 110//110 109//109 
f 66//66 109//109 91//91 
f 110//110 91//91 109//109 
f 108//108 41//41 112//112 
f 115//115 110//110 111//111 
f 111//111 108//108 112//112 
f 112//112 115//115 111//111 
f 115//115 112//112 113//113 
f 41//41 45//45 118//118 
f 41//41 118//118 112//112 
f 112//112 118//118 113//113 
f 114//114 91//91 110//110 
f 115//115 114//114 110//110 
f 114//114 115//115 116//116 
f 115//115 113//113 116//116 
f 102//102 114//114 116//116 
f 118//118 46//46 117//117 
f 119//119 118//118 117//117 
f 113//113 119//119 120//120 
f 113//113 118//118 119//119 
f 121//121 120//120 119//119 
f 120//120 121//121 226//226 
f 113//113 122//122 116//116 
f 120//120 122//122 113//113 
f 125//125 123//123 126//126 
f 122//122 125//125 116//116 
f 125//125 122//122 123//123 
f 122//122 120//120 123//123 
f 120//120 226//226 123//123 
f 46//46 60//60 117//117 
f 117//117 173//173 124//124 
f 119//119 117//117 121//121 
f 117//117 124//124 121//121 
f 121//121 124//124 214//214 
f 116//116 125//125 102//102 
f 127//127 129//129 12//12 
f 127//127 130//130 129//129 
f 19//19 12//12 129//129 
f 128//128 21//21 129//129 
f 130//130 128//128 129//129 
f 19//19 129//129 21//21 
f 21//21 140//140 37//37 
f 28//28 131//131 127//127 
f 127//127 131//131 130//130 
f 28//28 132//132 131//131 
f 131//131 133//133 130//130 
f 135//135 131//131 132//132 
f 133//133 131//131 134//134 
f 135//135 134//134 131//131 
f 29//29 135//135 132//132 
f 136//136 135//135 29//29 
f 187//187 136//136 84//84 
f 29//29 84//84 136//136 
f 135//135 138//138 134//134 
f 136//136 188//188 135//135 
f 188//188 138//138 135//135 
f 134//134 138//138 137//137 
f 144//144 140//140 21//21 
f 130//130 133//133 128//128 
f 139//139 128//128 133//133 
f 21//21 128//128 139//139 
f 144//144 21//21 139//139 
f 139//139 133//133 134//134 
f 134//134 144//144 139//139 
f 144//144 143//143 140//140 
f 140//140 143//143 142//142 
f 142//142 37//37 140//140 
f 142//142 141//141 37//37 
f 157//157 152//152 143//143 
f 144//144 146//146 143//143 
f 144//144 134//134 145//145 
f 145//145 146//146 144//144 
f 134//134 137//137 145//145 
f 145//145 137//137 147//147 
f 147//147 137//137 203//203 
f 145//145 147//147 146//146 
f 146//146 157//157 143//143 
f 147//147 203//203 149//149 
f 148//148 146//146 147//147 
f 148//148 147//147 149//149 
f 148//148 149//149 205//205 
f 142//142 150//150 141//141 
f 154//154 141//141 150//150 
f 143//143 150//150 142//142 
f 150//150 155//155 154//154 
f 155//155 150//150 152//152 
f 152//152 153//153 151//151 
f 150//150 143//143 152//152 
f 50//50 154//154 51//51 
f 51//51 154//154 155//155 
f 51//51 155//155 166//166 
f 155//155 152//152 151//151 
f 151//151 159//159 155//155 
f 155//155 159//159 156//156 
f 157//157 153//153 152//152 
f 158//158 153//153 157//157 
f 153//153 162//162 151//151 
f 153//153 158//158 162//162 
f 180//180 162//162 158//158 
f 161//161 159//159 151//151 
f 159//159 161//161 156//156 
f 156//156 161//161 160//160 
f 156//156 160//160 176//176 
f 151//151 162//162 161//161 
f 161//161 162//162 181//181 
f 160//160 161//161 181//181 
f 164//164 157//157 146//146 
f 164//164 158//158 157//157 
f 146//146 148//148 164//164 
f 165//165 158//158 164//164 
f 165//165 182//182 158//158 
f 182//182 180//180 158//158 
f 164//164 148//148 165//165 
f 205//205 165//165 148//148 
f 205//205 184//184 165//165 
f 165//165 184//184 182//182 
f 205//205 230//230 184//184 
f 51//51 166//166 55//55 
f 55//55 166//166 168//168 
f 55//55 168//168 167//167 
f 167//167 168//168 170//170 
f 155//155 156//156 166//166 
f 166//166 156//156 168//168 
f 170//170 168//168 169//169 
f 167//167 170//170 171//171 
f 170//170 169//169 171//171 
f 173//173 59//59 172//172 
f 172//172 174//174 173//173 
f 175//175 178//178 179//179 
f 179//179 227//227 174//174 
f 174//174 175//175 179//179 
f 59//59 171//171 172//172 
f 175//175 172//172 171//171 
f 172//172 175//175 174//174 
f 169//169 175//175 171//171 
f 175//175 169//169 178//178 
f 156//156 176//176 168//168 
f 176//176 169//169 168//168 
f 176//176 177//177 169//169 
f 176//176 160//160 163//163 
f 176//176 163//163 177//177 
f 177//177 178//178 169//169 
f 178//178 177//177 179//179 
f 177//177 163//163 183//183 
f 177//177 224//224 179//179 
f 227//227 179//179 224//224 
f 224//224 177//177 183//183 
f 180//180 181//181 162//162 
f 181//181 163//163 160//160 
f 180//180 182//182 181//181 
f 163//163 181//181 183//183 
f 185//185 183//183 181//181 
f 229//229 185//185 230//230 
f 224//224 183//183 185//185 
f 224//224 185//185 229//229 
f 181//181 182//182 186//186 
f 186//186 185//185 181//181 
f 184//184 186//186 182//182 
f 186//186 184//184 230//230 
f 186//186 230//230 185//185 
f 187//187 84//84 83//83 
f 189//189 188//188 187//187 
f 136//136 187//187 188//188 
f 189//189 194//194 188//188 
f 194//194 137//137 188//188 
f 138//138 188//188 137//137 
f 187//187 191//191 189//189 
f 192//192 189//189 191//191 
f 192//192 194//194 189//189 
f 187//187 83//83 86//86 
f 187//187 86//86 191//191 
f 196//196 191//191 190//190 
f 86//86 190//190 191//191 
f 95//95 196//196 190//190 
f 193//193 196//196 95//95 
f 195//195 194//194 192//192 
f 195//195 192//192 191//191 
f 191//191 196//196 195//195 
f 209//209 193//193 213//213 
f 213//213 197//197 209//209 
f 200//200 212//212 198//198 
f 212//212 200//200 213//213 
f 126//126 199//199 198//198 
f 198//198 199//199 200//200 
f 200//200 206//206 201//201 
f 216//216 206//206 199//199 
f 200//200 199//199 206//206 
f 218//218 206//206 216//216 
f 201//201 197//197 200//200 
f 197//197 213//213 200//200 
f 194//194 202//202 137//137 
f 137//137 202//202 203//203 
f 203//203 202//202 204//204 
f 202//202 194//194 208//208 
f 208//208 204//204 202//202 
f 203//203 207//207 149//149 
f 204//204 207//207 203//203 
f 207//207 204//204 206//206 
f 206//206 218//218 207//207 
f 194//194 195//195 208//208 
f 204//204 208//208 201//201 
f 197//197 201//201 208//208 
f 196//196 209//209 195//195 
f 208//208 195//195 209//209 
f 196//196 193//193 209//209 
f 209//209 197//197 208//208 
f 206//206 204//204 201//201 
f 97//97 193//193 95//95 
f 211//211 97//97 210//210 
f 211//211 210//210 212//212 
f 212//212 213//213 211//211 
f 211//211 213//213 97//97 
f 97//97 213//213 193//193 
f 121//121 214//214 226//226 
f 214//214 223//223 226//226 
f 214//214 215//215 223//223 
f 123//123 226//226 216//216 
f 126//126 123//123 199//199 
f 216//216 199//199 123//123 
f 217//217 216//216 226//226 
f 149//149 219//219 205//205 
f 149//149 207//207 219//219 
f 219//219 207//207 218//218 
f 218//218 225//225 219//219 
f 230//230 205//205 219//219 
f 222//222 225//225 217//217 
f 220//220 230//230 219//219 
f 225//225 220//220 219//219 
f 220//220 225//225 222//222 
f 223//223 222//222 217//217 
f 215//215 221//221 223//223 
f 223//223 221//221 222//222 
f 227//227 224//224 221//221 
f 222//222 228//228 220//220 
f 222//222 221//221 228//228 
f 216//216 225//225 218//218 
f 216//216 217//217 225//225 
f 223//223 217//217 226//226 
f 173//173 174//174 124//124 
f 227//227 215//215 124//124 
f 214//214 124//124 215//215 
f 227//227 124//124 174//174 
f 215//215 227//227 221//221 
f 229//229 228//228 221//221 
f 228//228 229//229 230//230 
f 224//224 229//229 221//221 
f 230//230 220//220 228//228 
