# PIPER geometrical reference model based on a manual segmentation. See the
# documentation for more info.
# Author: CEESAR, SOTON, UCBL-Ifsttar
# Version: 1.0.0
# License: Creative Commons Attribution 4.0 International License.
# (https://creativecommons.org/licenses/by/4.0/)
# 
# This work has received funding from the European Union Seventh Framework
# Program ([FP7/2007-2013]) under grant agreement 605544 [PIPER project]).
# Contributors include Pierre Maillez, Christophe Lecomte (SOTON), Erwan
# Jolivet (CEESAR), Philippe Beillas (UCBL-Ifsttar)
# This work is derived from a CT scan provided by CEESAR under a CCBY-4.0
# License
# 
# wavefront obj file written by the visualization toolkit

mtllib C:/desktop/registration_reference_model/22_REF_LTE635_Assembly_hands_corr/CCTu635_BPXXX_Toe4_R.mtl

v 23.933 206.024 -1750.96
v 23.684 207.862 -1750.88
v 19.179 207.198 -1753.94
v 19.389 206.512 -1754.71
v 29.062 204.788 -1751.45
v 26.443 207.226 -1749.83
v 27.755 205.66 -1750.18
v 28.008 203.628 -1753.58
v 28.601 201.69 -1757.19
v 25.707 202.869 -1758.9
v 22.403 205.723 -1757.97
v 23.138 205.176 -1756.33
v 23.016 206.121 -1759.04
v 26.576 205.572 -1760.99
v 22.09 209.303 -1753.13
v 25.589 209.291 -1751.18
v 25.092 211.382 -1753.62
v 19.784 208.798 -1755.6
v 19.707 208.076 -1758.15
v 22.583 209.412 -1758.48
v 22.851 211.028 -1756.86
v 26.135 212.856 -1756.8
v 26.499 213.363 -1755.25
v 29.618 210.918 -1758.15
v 28.798 215.57 -1756.73
v 27.658 211.806 -1758.2
v 29.572 204.146 -1753.5
v 30.04 203.795 -1756.88
v 29.251 204.128 -1758.92
v 30.151 210.419 -1751.19
v 32.338 214.029 -1753.78
v 29.46 213.685 -1751.99
v 31.391 217.971 -1753.19
v 31.721 216.213 -1753.01
v 29.626 216.892 -1753.92
v 33.95 217.882 -1754.38
v 30.688 208.842 -1755.04
v 30.079 208.958 -1757.27
v 32.982 214.77 -1756.45
v 31.711 216.453 -1757.59
v 35.187 217.421 -1756.12
v 32.18 218.379 -1758.74
v 34.549 217.495 -1757.64
v 36.632 220.24 -1761.82
v 32.096 224.248 -1753.52
v 31.135 222.182 -1753.71
v 30.173 224.244 -1755.47
v 30.05 218.922 -1755.29
v 30.736 220.019 -1757.26
v 30.452 224.785 -1757.8
v 37.326 220.646 -1755.97
v 38.032 221.016 -1758.33
v 38.215 223.527 -1757.16
v 32.647 227.541 -1757.17
v 34.682 225.383 -1755.62
v 32.463 225.837 -1760.43
v 32.661 229.265 -1758.78
v 38.11 226.79 -1756.51
v 35.351 229.502 -1757.02
v 37.134 233.201 -1760.94
v 27.859 202.987 -1759.7
v 23.943 207.589 -1759.21
v 27.967 205.705 -1760.41
v 31.791 221.778 -1759.19
v 34.439 219.633 -1761.99
v 30.218 236.237 -1769.46
v 33.123 219.872 -1761.72
v 37.654 222.325 -1761.96
v 37.319 225.175 -1763.34
v 32.478 228.408 -1761.08
v 35.922 228.56 -1767.05
v 32.499 229.16 -1764.66
v 31.138 231.2 -1763.27
v 35.83 225.663 -1763.04
v 39.129 226.401 -1762.7
v 39.865 226.138 -1760.45
v 39.443 228.272 -1760
v 39.817 229.164 -1763.12
v 36.777 227.067 -1764.5
v 39.096 228.867 -1766.79
v 32.403 232.576 -1759.18
v 34.193 232.097 -1758.36
v 30.993 233.474 -1765.48
v 31.083 235.989 -1765.32
v 33.264 236.281 -1762.99
v 35.656 236.02 -1763.05
v 34.599 238.28 -1768.24
v 32.333 231.463 -1767.35
v 32.625 237.452 -1770.51
v 30.98 235.845 -1770.39
v 38.275 231.103 -1768.47
v 38.088 233.307 -1767.65
v 36.565 236.459 -1767.32
v 36.645 231.145 -1769.75
v 36.36 235.988 -1771.03
v 32.533 237.869 -1767.3
v 35.982 237.272 -1770.46
v 37.609 226.021 -1756.49
v 27.835 205.146 -1751.04
v 36.753 233.058 -1760.6
v 32.049 224.973 -1754.5
v 36.951 219.776 -1757.05
v 34.803 233.053 -1759.63
v 39.163 230.049 -1762.39
v 37.841 233.032 -1768.54
v 31.04 234.578 -1765.33
vn -0.419837 -0.586142 0.692946
vn -0.441827 0.271923 0.854896
vn -0.908361 -0.0312985 0.417013
vn -0.786461 -0.617375 0.0180797
vn 0.537351 -0.611491 0.580804
vn -0.0953689 0.0351412 0.994822
vn 0.172216 -0.485029 0.857373
vn -0.0932394 -0.903654 0.41799
vn 0.264081 -0.964134 -0.0265903
vn -0.504496 -0.813854 -0.288315
vn -0.558546 -0.759534 -0.333369
vn -0.425583 -0.902492 0.0662378
vn -0.510015 -0.267826 -0.817407
vn -0.0779721 -0.0526587 -0.995564
vn -0.506605 0.674785 0.536672
vn -0.350976 0.541549 0.763898
vn -0.54668 0.688043 0.477218
vn -0.798951 0.595415 0.0846051
vn -0.780282 0.0751043 -0.620902
vn -0.277688 0.459404 -0.843705
vn -0.517507 0.827556 -0.217573
vn -0.485487 0.725379 -0.487983
vn -0.713529 0.699039 0.0471216
vn 0.539131 0.00423915 -0.842211
vn -0.606475 0.443727 -0.659768
vn -0.128958 0.389197 -0.912083
vn 0.735388 -0.591648 0.33039
vn 0.931706 -0.334982 -0.1404
vn 0.804696 -0.265257 -0.531134
vn 0.587493 0.0131791 0.809122
vn 0.86782 -0.239766 0.435203
vn -0.193788 0.394333 0.898303
vn 0.00198003 0.152975 0.988228
vn 0.451851 0.0669161 0.88958
vn -0.679655 0.427853 0.595828
vn 0.589141 -0.131175 0.797312
vn 0.955893 -0.221346 -0.193068
vn 0.928064 0.00942863 -0.372301
vn 0.748527 -0.484378 -0.452863
vn -0.0429875 -0.189554 -0.980929
vn 0.787874 -0.592671 0.167317
vn -0.542159 -0.507801 -0.669478
vn 0.405801 -0.766732 -0.497441
vn 0.528666 -0.591087 -0.609203
vn -0.0894827 0.416355 0.904788
vn -0.647478 0.122906 0.752108
vn -0.898757 0.33521 0.282612
vn -0.956225 0.292225 0.015454
vn -0.871492 -0.0157641 -0.490156
vn -0.93589 0.225285 -0.270845
vn 0.769174 -0.211544 0.60301
vn 0.894822 -0.445992 0.0196168
vn 0.789545 -0.0767493 0.608875
vn -0.526332 0.532299 0.663048
vn 0.283036 0.3486 0.893515
vn -0.792488 0.0437672 -0.608315
vn -0.937241 0.218093 0.272057
vn 0.597442 0.173621 0.782892
vn 0.0798414 0.458302 0.885203
vn 0.650229 0.590483 0.478051
vn 0.262014 -0.635066 -0.726663
vn -0.301356 0.254684 -0.918869
vn 0.542986 0.0410247 -0.838739
vn -0.852743 -0.0863717 -0.51514
vn -0.0284848 -0.615338 -0.787748
vn -0.93792 0.193766 -0.287683
vn -0.580215 -0.382892 -0.718849
vn 0.747493 -0.390129 -0.537637
vn 0.199227 -0.357888 -0.912264
vn -0.941633 -0.306641 -0.138922
vn -0.201106 -0.784884 -0.5861
vn -0.669032 -0.677825 -0.304876
vn -0.97525 -0.21714 0.0416938
vn -0.487353 -0.227077 -0.843163
vn 0.694951 -0.520344 -0.496272
vn 0.986261 -0.155676 0.0552614
vn 0.893849 0.297175 0.335738
vn 0.982148 0.188095 0.00249908
vn -0.13455 -0.771577 -0.621743
vn 0.724235 -0.440905 -0.530175
vn -0.65447 0.347349 0.671579
vn -0.0323605 0.531811 0.846244
vn -0.982606 -0.178322 -0.0518311
vn -0.827792 0.468182 0.309137
vn -0.226711 0.821767 0.522782
vn 0.44414 0.780506 0.439943
vn 0.213054 0.976832 0.0201873
vn -0.683249 -0.543952 -0.487121
vn -0.263232 0.668288 -0.695773
vn -0.595944 -0.121784 -0.793737
vn 0.825116 -0.0704986 -0.560548
vn 0.939101 0.315481 -0.136238
vn 0.786022 0.610428 0.0977139
vn 0.117512 -0.477953 -0.87049
vn 0.515128 0.16266 -0.841537
vn -0.36717 0.915655 0.163591
vn 0.510396 0.694357 -0.507311
vn 0.313267 -0.174698 0.933458
vn -0.0765469 -0.857924 0.508042
vn 0.375685 0.615641 0.69271
vn -0.530515 0.667691 0.522247
vn 0.819407 -0.550756 0.15887
vn 0.328906 0.671511 0.663998
vn 0.863219 0.448388 0.23195
vn 0.927341 0.19741 -0.317912
vn -0.994963 0.0298865 0.0956829

g grp1
usemtl mtl1
f 3//3 1//1 2//2 
f 1//1 3//3 4//4 
f 2//2 15//15 3//3 
f 12//12 1//1 4//4 
f 7//7 1//1 8//8 
f 1//1 6//6 2//2 
f 1//1 7//7 6//6 
f 2//2 6//6 16//16 
f 30//30 7//7 5//5 
f 8//8 1//1 12//12 
f 5//5 8//8 27//27 
f 9//9 10//10 61//61 
f 28//28 9//9 61//61 
f 11//11 12//12 4//4 
f 19//19 4//4 18//18 
f 3//3 18//18 4//4 
f 4//4 19//19 11//11 
f 11//11 19//19 13//13 
f 13//13 19//19 20//20 
f 13//13 20//20 62//62 
f 12//12 11//11 9//9 
f 9//9 8//8 12//12 
f 27//27 8//8 9//9 
f 27//27 9//9 28//28 
f 9//9 11//11 10//10 
f 11//11 13//13 10//10 
f 14//14 61//61 10//10 
f 14//14 10//10 13//13 
f 62//62 14//14 13//13 
f 28//28 61//61 29//29 
f 29//29 61//61 63//63 
f 14//14 62//62 26//26 
f 38//38 29//29 63//63 
f 14//14 26//26 63//63 
f 3//3 15//15 18//18 
f 15//15 2//2 16//16 
f 6//6 32//32 16//16 
f 7//7 30//30 6//6 
f 6//6 30//30 32//32 
f 16//16 17//17 15//15 
f 32//32 17//17 16//16 
f 32//32 35//35 17//17 
f 32//32 33//33 35//35 
f 17//17 35//35 23//23 
f 23//23 35//35 48//48 
f 18//18 21//21 19//19 
f 15//15 17//17 18//18 
f 17//17 21//21 18//18 
f 17//17 23//23 21//21 
f 20//20 19//19 21//21 
f 26//26 20//20 22//22 
f 21//21 22//22 20//20 
f 23//23 22//22 21//21 
f 25//25 22//22 23//23 
f 22//22 25//25 26//26 
f 62//62 20//20 26//26 
f 38//38 63//63 24//24 
f 63//63 26//26 24//24 
f 23//23 48//48 25//25 
f 49//49 25//25 48//48 
f 5//5 27//27 30//30 
f 27//27 28//28 37//37 
f 37//37 28//28 29//29 
f 29//29 38//38 37//37 
f 27//27 31//31 30//30 
f 27//27 37//37 31//31 
f 34//34 32//32 30//30 
f 34//34 30//30 31//31 
f 33//33 32//32 34//34 
f 33//33 34//34 36//36 
f 31//31 36//36 34//34 
f 51//51 33//33 36//36 
f 38//38 24//24 37//37 
f 24//24 39//39 37//37 
f 24//24 26//26 40//40 
f 25//25 40//40 26//26 
f 31//31 37//37 39//39 
f 31//31 39//39 41//41 
f 40//40 39//39 24//24 
f 39//39 40//40 43//43 
f 41//41 39//39 43//43 
f 25//25 49//49 40//40 
f 31//31 41//41 36//36 
f 36//36 41//41 51//51 
f 43//43 40//40 42//42 
f 42//42 40//40 49//49 
f 42//42 64//64 67//67 
f 67//67 65//65 42//42 
f 43//43 42//42 65//65 
f 65//65 44//44 43//43 
f 41//41 43//43 44//44 
f 52//52 41//41 44//44 
f 33//33 46//46 35//35 
f 48//48 35//35 46//46 
f 33//33 45//45 46//46 
f 48//48 46//46 47//47 
f 33//33 51//51 45//45 
f 47//47 46//46 45//45 
f 47//47 49//49 48//48 
f 49//49 47//47 50//50 
f 49//49 50//50 64//64 
f 45//45 51//51 55//55 
f 42//42 49//49 64//64 
f 64//64 50//50 56//56 
f 64//64 56//56 67//67 
f 53//53 51//51 52//52 
f 53//53 55//55 51//51 
f 53//53 52//52 76//76 
f 54//54 45//45 55//55 
f 47//47 54//54 50//50 
f 55//55 59//59 54//54 
f 59//59 82//82 54//54 
f 57//57 50//50 54//54 
f 57//57 56//56 50//50 
f 70//70 56//56 57//57 
f 73//73 70//70 81//81 
f 57//57 81//81 70//70 
f 57//57 54//54 82//82 
f 57//57 82//82 81//81 
f 55//55 58//58 59//59 
f 76//76 58//58 53//53 
f 76//76 77//77 58//58 
f 59//59 58//58 60//60 
f 58//58 77//77 60//60 
f 14//14 63//63 61//61 
f 67//67 69//69 65//65 
f 74//74 69//69 67//67 
f 67//67 56//56 74//74 
f 44//44 68//68 52//52 
f 69//69 44//44 65//65 
f 68//68 44//44 69//69 
f 52//52 68//68 76//76 
f 75//75 68//68 69//69 
f 76//76 68//68 75//75 
f 74//74 56//56 70//70 
f 79//79 74//74 70//70 
f 70//70 73//73 72//72 
f 70//70 72//72 79//79 
f 79//79 72//72 71//71 
f 73//73 83//83 88//88 
f 72//72 73//73 88//88 
f 75//75 69//69 79//79 
f 77//77 76//76 78//78 
f 69//69 74//74 79//79 
f 75//75 79//79 80//80 
f 79//79 71//71 80//80 
f 75//75 80//80 76//76 
f 76//76 80//80 78//78 
f 78//78 80//80 92//92 
f 71//71 72//72 88//88 
f 94//94 71//71 88//88 
f 80//80 71//71 94//94 
f 80//80 94//94 91//91 
f 92//92 80//80 91//91 
f 84//84 73//73 81//81 
f 81//81 85//85 84//84 
f 85//85 81//81 82//82 
f 82//82 86//86 85//85 
f 85//85 96//96 84//84 
f 85//85 86//86 87//87 
f 93//93 87//87 86//86 
f 93//93 60//60 78//78 
f 93//93 86//86 60//60 
f 83//83 90//90 88//88 
f 66//66 83//83 84//84 
f 66//66 90//90 83//83 
f 84//84 96//96 66//66 
f 94//94 88//88 90//90 
f 89//89 66//66 96//96 
f 90//90 66//66 89//89 
f 94//94 90//90 95//95 
f 95//95 90//90 89//89 
f 95//95 89//89 97//97 
f 93//93 78//78 92//92 
f 91//91 94//94 95//95 
f 93//93 92//92 97//97 
f 95//95 97//97 92//92 
f 96//96 85//85 87//87 
f 87//87 93//93 97//97 
f 87//87 89//89 96//96 
f 97//97 89//89 87//87 
f 53//53 58//58 98//98 
f 58//58 55//55 98//98 
f 55//55 53//53 98//98 
f 7//7 8//8 99//99 
f 8//8 5//5 99//99 
f 5//5 7//7 99//99 
f 100//100 60//60 86//86 
f 60//60 100//100 59//59 
f 100//100 82//82 59//59 
f 54//54 47//47 101//101 
f 47//47 45//45 101//101 
f 45//45 54//54 101//101 
f 51//51 41//41 102//102 
f 41//41 52//52 102//102 
f 52//52 51//51 102//102 
f 82//82 100//100 103//103 
f 100//100 86//86 103//103 
f 86//86 82//82 103//103 
f 77//77 78//78 104//104 
f 78//78 60//60 104//104 
f 60//60 77//77 104//104 
f 91//91 95//95 105//105 
f 95//95 92//92 105//105 
f 92//92 91//91 105//105 
f 73//73 84//84 106//106 
f 84//84 83//83 106//106 
f 83//83 73//73 106//106 
