# PIPER geometrical reference model based on a manual segmentation. See the
# documentation for more info.
# Author: CEESAR, SOTON, UCBL-Ifsttar
# Version: 1.0.0
# License: Creative Commons Attribution 4.0 International License.
# (https://creativecommons.org/licenses/by/4.0/)
# 
# This work has received funding from the European Union Seventh Framework
# Program ([FP7/2007-2013]) under grant agreement 605544 [PIPER project]).
# Contributors include Pierre Maillez, Christophe Lecomte (SOTON), Erwan
# Jolivet (CEESAR), Philippe Beillas (UCBL-Ifsttar)
# This work is derived from a CT scan provided by CEESAR under a CCBY-4.0
# License
# 
# wavefront obj file written by the visualization toolkit

mtllib C:/desktop/registration_reference_model/22_REF_LTE635_Assembly_hands_corr/CCTu635_BP173_Cuneiform3_R.mtl

v -4.08401 139.451 -1700.38
v -4.51301 142.147 -1698.45
v -7.04001 149.344 -1696.98
v -5.47701 148.302 -1696.24
v -4.84301 150.752 -1696.46
v -8.51201 147.182 -1699.02
v -4.65201 145.377 -1697.02
v -9.55201 148.625 -1699.39
v -6.89801 148.063 -1697.16
v -6.94501 150.199 -1697.7
v -5.15401 151.528 -1697.61
v -13.15 141.973 -1705.27
v -13.769 142.174 -1706.16
v -12.206 140.582 -1706.13
v -9.41901 143.39 -1702.21
v -8.60601 140.197 -1703.8
v -7.62001 139.643 -1703.75
v -9.49801 139.147 -1705.92
v -11.241 143.095 -1703.69
v -6.56301 140.41 -1701.65
v -4.86901 139.867 -1700.16
v -6.08101 139.572 -1702.35
v -3.44401 139.75 -1701.27
v -7.13901 139.651 -1705.49
v -4.35101 140.832 -1705.2
v -10.574 139.526 -1705.54
v -11.287 140.641 -1708.3
v -10.175 140.415 -1708.57
v -8.95001 140.786 -1709.14
v -6.65501 140.291 -1707.01
v -12.173 146.066 -1702.86
v -12.858 143.85 -1704.31
v -14.87 144.267 -1705.4
v -14.824 144.12 -1706.01
v -14.686 145.935 -1705.35
v -13.382 143.915 -1709.07
v -13.214 146.918 -1708.95
v -14.328 147.446 -1705.9
v -13.168 148.459 -1707.3
v -14.386 147.568 -1706.88
v -12.611 147.998 -1709.05
v -10.731 147.326 -1700.99
v -12.718 147.008 -1703.45
v -10.627 148.978 -1701.56
v -8.76701 150.637 -1703.1
v -12.185 148.29 -1703.93
v -7.27001 151.996 -1704.16
v -11.068 149.726 -1704.82
v -9.04801 150.324 -1705.93
v -10.906 149.021 -1709.2
v -9.14401 150.37 -1708.07
v -3.65601 140.757 -1699.01
v -2.25901 141.433 -1699.7
v -4.33801 149.321 -1696.12
v -2.43201 146.743 -1696.29
v -3.00201 145.12 -1696.62
v -1.88301 144.606 -1697.34
v -1.10301 147.812 -1697.97
v -0.869013 145.652 -1697.98
v -0.136013 143.705 -1699.63
v 1.06599 146.486 -1700.86
v -3.16801 149.911 -1696.42
v -2.13401 151.309 -1698.31
v -1.54901 140.865 -1702.18
v 0.512988 141.865 -1702.26
v -0.353012 141.919 -1700.84
v -3.94501 140.465 -1703.55
v -0.913012 142.177 -1705.1
v -3.66401 142.336 -1708.76
v -1.37001 142.835 -1707.71
v 1.72499 143.157 -1702.3
v 1.46999 144.673 -1701.49
v 2.82799 143.336 -1703.35
v 4.20299 145.706 -1704.82
v 1.62399 148.6 -1702.06
v 3.55599 149.587 -1704.83
v 1.94699 151.009 -1703.01
v 1.61599 142.745 -1703.74
v 3.48599 144.006 -1705.29
v 4.74899 145.378 -1706.44
v 2.00499 144.493 -1708.73
v 5.06999 150.385 -1707.41
v 4.65499 145.544 -1705.53
v 5.11399 147.116 -1708.94
v 5.43399 148.436 -1708.37
v -7.49901 150.408 -1698.62
v -8.44201 150.522 -1700.7
v -6.14701 152.285 -1701.43
v -5.37501 153.825 -1703.97
v -3.50901 154.99 -1702.54
v -7.01301 152.924 -1706.37
v -6.02101 154.844 -1707.54
v -7.48601 153.857 -1709.29
v -4.74301 155.282 -1705.61
v -4.44901 156.813 -1707.53
v -3.34201 151.581 -1697.39
v -3.65901 152.841 -1698.65
v -1.39101 152.638 -1700.09
v 0.061987 151.057 -1700.84
v -1.97501 154.661 -1701.08
v -3.15501 154.387 -1700.76
v -0.029013 153.188 -1701.63
v -0.931013 154.042 -1701.29
v -0.328014 155.685 -1702.38
v 1.50199 152.899 -1702.83
v 2.54599 156.308 -1704.16
v -2.18601 155.602 -1702.05
v -3.56801 155.499 -1703.74
v -1.08301 157.944 -1704.03
v -2.02901 157.811 -1704.55
v 0.632986 157.916 -1703.97
v 1.26299 156.476 -1703.43
v 2.96999 152.987 -1704.5
v 3.84599 155.239 -1705.69
v 3.49299 159.283 -1705.04
v 5.20399 160.581 -1707.49
v 4.40499 152.979 -1706.47
v 5.10099 155.945 -1707.48
v 4.19799 158.043 -1705.86
v 6.31099 156.554 -1709.54
v -0.558014 162.435 -1708.01
v -0.751014 160.448 -1705.57
v 0.660986 162.437 -1706.76
v -1.73301 160.271 -1707.37
v 0.855986 161.344 -1705.81
v 2.98199 161.921 -1706.27
v 4.10799 161.704 -1706.72
v 2.23599 162.73 -1706.82
v 3.96599 163.197 -1708.24
v 2.09699 163.974 -1708.45
v -12.522 142.09 -1709.37
v -12.566 142.494 -1711.21
v -13.455 143.353 -1714.47
v -9.84001 142.183 -1712.24
v -11.522 142.197 -1712.04
v -5.18001 142.272 -1709.63
v -11.828 143.013 -1714.57
v -13.806 145.598 -1708.16
v -13.339 143.617 -1710.99
v -13.224 145.471 -1709.92
v -13.556 144.824 -1711.58
v -11.711 149.242 -1712.64
v -14.262 143.899 -1713.61
v -14.226 145.635 -1713.76
v -13.319 146.424 -1712.44
v -13.91 148.472 -1714.82
v -14.09 144.562 -1715.02
v -12.512 146.058 -1717.06
v -14.206 145.905 -1715.22
v -13.411 149.058 -1714.74
v -13.07 148.713 -1716.44
v -5.17701 144.003 -1712.5
v -3.07801 145.179 -1712.53
v -12.045 147.954 -1710.75
v -10.21 149.828 -1710.59
v -9.90901 144.228 -1715.54
v -8.82101 142.991 -1713.29
v -11.549 145.263 -1716.83
v -10.277 145.491 -1716.92
v -9.06801 146.285 -1716.9
v -5.13701 145.289 -1713.65
v -5.82201 147.033 -1715.1
v -3.44501 148.499 -1715.08
v -11.884 151.459 -1717.45
v -11.22 146.873 -1717.63
v -9.94901 147.469 -1717.81
v -6.93601 148.736 -1717.27
v -11.693 149.835 -1717.72
v -10.546 150.189 -1718.38
v -9.07501 150.47 -1718.53
v -8.60201 151.654 -1719.1
v -1.45301 143.945 -1710.71
v -1.50501 144.843 -1711.75
v -2.11701 147.816 -1714.04
v 4.32099 145.344 -1708.49
v 2.99899 145.678 -1711.28
v 0.588987 144.604 -1710.89
v 4.53899 146.205 -1709.87
v 2.15199 146.373 -1712.43
v -3.80601 147.064 -1714.06
v 0.261987 146.96 -1713.11
v -3.22301 151.119 -1717.83
v -1.60501 150.25 -1716.06
v 2.51699 148.811 -1714.23
v 4.21399 148.713 -1713.39
v 1.71399 151.519 -1716.2
v 5.44399 148.929 -1712.51
v 6.52499 150.226 -1711.53
v -7.89501 154.919 -1711.75
v -8.89201 152.589 -1711.51
v -8.59101 154.625 -1714.08
v -6.41201 155.366 -1708.9
v -7.02501 156.011 -1710.94
v -5.84701 158.4 -1711.84
v -4.50301 158.27 -1709.9
v -7.48101 157.525 -1712.92
v -11.312 151.038 -1714.57
v -9.96901 151.15 -1712.74
v -8.94301 153.384 -1714.03
v -11.606 152.047 -1716.61
v -9.86101 153.692 -1716.1
v -9.61601 154.705 -1716.37
v -8.10501 157.466 -1713.97
v -6.89001 159.637 -1713.9
v -9.32901 156.733 -1716.82
v -8.33801 158.205 -1715.55
v -5.45101 161.087 -1714.91
v -5.79301 160.539 -1713.76
v -6.93901 159.348 -1716.21
v -5.28201 159.778 -1716.57
v -4.23801 161.331 -1714.89
v -10.682 153.772 -1718.5
v -10.452 152.758 -1719.29
v -9.14001 153.067 -1720.36
v -5.26301 150.534 -1717.97
v -7.13401 152.905 -1720.04
v -5.66701 154.419 -1720.84
v -5.47301 155.399 -1720.96
v -9.75501 157.008 -1719.64
v -9.77901 156.159 -1720.67
v -8.76701 157.751 -1718.78
v -8.74801 157.016 -1720.47
v -7.08802 158.4 -1718.25
v -3.61601 159.328 -1716.49
v -5.50201 157.778 -1718.67
v -8.80701 154.695 -1721.49
v -8.32401 156.116 -1721.63
v -6.99801 154.851 -1721.92
v -1.31701 157.829 -1717.15
v 3.08699 157.706 -1715.82
v 5.86899 153.849 -1708.92
v 6.49199 152.001 -1710.37
v 8.21799 153.843 -1713.75
v 5.96599 159.078 -1708.4
v 6.78299 158.624 -1710.68
v 7.83199 155.313 -1712.24
v 7.09499 159.045 -1712.7
v 5.99499 150.879 -1714.06
v 7.32199 152.181 -1714.02
v 7.66199 155.614 -1716.31
v 6.60399 154.745 -1716.92
v 8.05599 157.1 -1713.61
v 8.13499 156.508 -1715.2
v 7.47099 157.15 -1715.35
v -2.98101 159.325 -1708.67
v -2.34701 161.339 -1710.07
v -2.82701 161.454 -1712.58
v -0.069014 162.936 -1710
v -0.701014 162.206 -1712.27
v 1.12499 162.466 -1711.28
v 4.46199 161.499 -1711.33
v 2.79099 163.723 -1709.84
v 2.42299 159.507 -1713.68
v -1.74001 159.926 -1715.19
v -2.40901 161.921 -1713.27
v -1.95201 161.638 -1713.72
v 5.77099 160.824 -1709.69
v 4.67999 162.237 -1710.2
v 6.12099 160.139 -1711.76
v 5.92999 159.286 -1713.12
v -1.03701 152.123 -1717.2
v 0.064987 153.535 -1717.94
v -1.08001 153.608 -1718.05
v -1.02601 155.095 -1718.57
v -2.94901 154.46 -1719.62
v 1.36899 152.738 -1717.23
v 2.09499 154.109 -1718.63
v 4.00199 152.403 -1716.16
v 4.39199 154.239 -1717.97
v 1.85599 155.37 -1718.93
v -1.40201 156.293 -1718.73
v 0.347986 156.111 -1718.45
v -4.13401 155.98 -1720.14
v 3.66799 156.353 -1717.18
v 5.57599 155.428 -1717.35
vn 0.158569 -0.932111 0.325616
vn -0.415865 -0.448449 0.79117
vn -0.590681 0.215859 0.777496
vn -0.304223 -0.112722 0.945908
vn -0.181103 0.508537 0.841779
vn -0.624341 -0.357839 0.69437
vn -0.37323 -0.362765 0.853874
vn -0.750137 0.174429 0.637863
vn -0.570941 -0.276931 0.772875
vn -0.584004 0.602565 0.543925
vn -0.437512 0.752048 0.492958
vn -0.5999 -0.529459 0.599828
vn -0.806596 -0.590781 0.0194964
vn -0.630718 -0.773668 0.0602691
vn -0.566135 -0.442486 0.695484
vn -0.470702 -0.57575 0.668545
vn -0.215674 -0.927772 0.304505
vn -0.080093 -0.993687 -0.0785588
vn -0.484085 -0.404024 0.776161
vn -0.597282 -0.563341 0.570877
vn -0.460408 -0.661558 0.591917
vn -0.169126 -0.97564 0.139725
vn 0.418063 -0.906716 -0.055586
vn 0.274989 -0.948513 -0.157176
vn 0.365671 -0.897948 -0.244896
vn -0.455859 -0.846879 0.273842
vn -0.451425 -0.837613 -0.307603
vn -0.10404 -0.90855 -0.404614
vn 0.176355 -0.876618 -0.447704
vn 0.305596 -0.880986 -0.361213
vn -0.661297 -0.207396 0.720884
vn -0.489697 -0.352402 0.797502
vn -0.900907 -0.191662 0.3894
vn -0.959619 -0.212517 -0.184301
vn -0.91809 0.170727 0.35772
vn -0.952489 -0.19167 -0.2367
vn -0.855011 0.279984 -0.436538
vn -0.800172 0.535982 0.269163
vn -0.551755 0.81661 -0.169454
vn -0.856585 0.481344 -0.18593
vn -0.677044 0.644641 -0.355035
vn -0.711573 -0.194198 0.675242
vn -0.761535 0.244713 0.600151
vn -0.709157 0.611728 0.350551
vn -0.567349 0.817093 0.102337
vn -0.701094 0.600873 0.383951
vn -0.685303 0.711894 0.153515
vn -0.499829 0.862746 0.0764171
vn -0.584412 0.811268 -0.0175297
vn -0.576639 0.814401 -0.0651033
vn -0.749483 0.646838 0.140983
vn 0.151559 -0.643611 0.750196
vn 0.542979 -0.636847 0.547358
vn -0.00581589 0.10985 0.993931
vn 0.400925 -0.0568469 0.914345
vn 0.0631898 -0.366563 0.928245
vn 0.525041 -0.387246 0.757874
vn 0.766432 0.168997 0.619695
vn 0.759845 -0.0944405 0.643208
vn 0.700533 -0.361019 0.615565
vn 0.8119 0.0523528 0.581445
vn 0.440833 0.299652 0.846094
vn 0.670859 0.398149 0.625641
vn 0.444648 -0.889312 -0.106832
vn 0.55074 -0.822674 0.141046
vn 0.572316 -0.666426 0.47784
vn 0.28949 -0.907122 -0.305493
vn 0.356065 -0.889212 -0.287262
vn 0.320089 -0.860303 -0.396764
vn 0.3494 -0.886348 -0.303821
vn 0.686781 -0.412467 0.598501
vn 0.785981 -0.111639 0.608087
vn 0.749451 -0.581 0.31743
vn 0.824903 0.0158454 0.565052
vn 0.788118 0.14731 0.597636
vn 0.813316 0.107279 0.571847
vn 0.763912 0.116483 0.634721
vn 0.415744 -0.880648 -0.227193
vn 0.605546 -0.788155 -0.110117
vn 0.882314 -0.470514 0.0117736
vn 0.355199 -0.892468 -0.278091
vn 0.889167 0.0252297 0.456887
vn 0.914696 -0.216472 0.341278
vn 0.929237 -0.367025 -0.0425642
vn 0.965359 -0.130698 0.22583
vn -0.600349 0.683274 0.415593
vn -0.592238 0.772144 0.230321
vn -0.597534 0.762651 0.247622
vn -0.683258 0.682156 0.260427
vn -0.570394 0.748704 0.337776
vn -0.76116 0.601068 0.243624
vn -0.741077 0.563016 0.365811
vn -0.818686 0.477167 0.319475
vn -0.711607 0.61317 0.342985
vn -0.713126 0.589999 0.37862
vn 0.336312 0.597639 0.72782
vn -0.0844714 0.783536 0.615578
vn 0.636443 0.417896 0.648308
vn 0.730611 0.247361 0.636412
vn 0.232822 0.642054 0.730453
vn -0.325818 0.804905 0.495954
vn 0.604305 0.284464 0.744241
vn 0.51237 0.395195 0.762429
vn 0.298337 0.454833 0.83912
vn 0.69997 0.121112 0.703828
vn 0.645915 0.0669755 0.760465
vn -0.238306 0.744703 0.6234
vn -0.653795 0.653848 0.380835
vn -0.22623 0.615036 0.755348
vn -0.615856 0.598732 0.512096
vn 0.0867816 0.490523 0.867097
vn 0.391659 0.321399 0.862152
vn 0.77846 0.0526507 0.625482
vn 0.795617 -0.0147422 0.605621
vn 0.513723 0.253243 0.819729
vn 0.837126 0.291037 0.46316
vn 0.83545 0.0215267 0.549145
vn 0.847463 -0.0494082 0.528551
vn 0.791388 -0.0182148 0.611043
vn 0.884333 -0.023286 0.466276
vn -0.5987 0.740363 0.305649
vn -0.48494 0.573462 0.660284
vn -0.304349 0.733779 0.607404
vn -0.770103 0.518381 0.371783
vn -0.0827851 0.553403 0.82879
vn 0.242426 0.574849 0.781523
vn 0.601866 0.495556 0.626244
vn 0.0827889 0.72332 0.685532
vn 0.585121 0.765404 0.267936
vn -0.0473907 0.978292 0.201739
vn -0.744587 -0.628357 -0.225295
vn -0.603609 -0.792427 -0.0878399
vn -0.470978 -0.769562 -0.431224
vn 0.105568 -0.895289 -0.432796
vn -0.238015 -0.928134 -0.28621
vn 0.26697 -0.837844 -0.476178
vn -0.0445323 -0.850265 -0.524467
vn -0.911084 0.0439531 -0.409871
vn -0.940381 -0.311829 0.135817
vn -0.970787 0.188322 -0.148686
vn -0.951312 0.137672 0.275774
vn -0.710862 0.585558 0.389613
vn -0.91667 -0.399103 0.0207945
vn -0.96776 0.13978 0.209529
vn -0.844661 0.361091 0.395173
vn -0.899363 0.43326 0.0585879
vn -0.78155 -0.360835 -0.508898
vn -0.480813 -0.28446 -0.829398
vn -0.926367 -0.00671893 -0.376563
vn -0.788215 0.576239 0.216025
vn -0.828842 0.17282 -0.532123
vn 0.324143 -0.734397 -0.596316
vn 0.318599 -0.596921 -0.736329
vn -0.809162 0.586377 0.037675
vn -0.753114 0.622268 0.213547
vn 0.262006 -0.712042 -0.651421
vn 0.279709 -0.815731 -0.506306
vn -0.0932372 -0.594402 -0.798745
vn 0.20021 -0.57685 -0.791934
vn 0.387528 -0.508961 -0.768623
vn 0.394581 -0.559294 -0.729038
vn 0.44935 -0.52172 -0.725184
vn 0.309691 -0.640263 -0.702962
vn -0.891965 0.270821 -0.362015
vn -0.129548 -0.29474 -0.946755
vn 0.144111 -0.331652 -0.93233
vn 0.335783 -0.506224 -0.794347
vn -0.614753 -0.0366779 -0.787866
vn -0.238442 -0.252818 -0.937672
vn 0.0817722 -0.385884 -0.918916
vn -0.0142227 -0.544175 -0.838851
vn 0.252888 -0.825238 -0.505005
vn 0.174797 -0.684301 -0.707939
vn 0.196067 -0.601038 -0.774797
vn 0.658689 -0.713313 -0.239402
vn 0.426847 -0.762463 -0.486262
vn 0.269082 -0.837146 -0.476216
vn 0.74942 -0.599168 -0.281722
vn 0.242536 -0.654378 -0.716217
vn 0.279236 -0.476054 -0.833906
vn 0.0979792 -0.59762 -0.79577
vn 0.335952 -0.587525 -0.736173
vn 0.254342 -0.625268 -0.737801
vn 0.236422 -0.579802 -0.779701
vn 0.430697 -0.589559 -0.683315
vn 0.200157 -0.560756 -0.803423
vn 0.687986 -0.591493 -0.420489
vn 0.924206 -0.379288 0.0445322
vn -0.878937 0.367587 0.30389
vn -0.864298 0.449251 0.226191
vn -0.913094 0.257388 0.316245
vn -0.751926 0.518138 0.407604
vn -0.787239 0.456231 0.41486
vn -0.610325 0.578821 0.540805
vn -0.669019 0.621418 0.407741
vn -0.781806 0.382954 0.492062
vn -0.651893 0.624793 0.429731
vn -0.758941 0.569224 0.316215
vn -0.86704 0.402443 0.293738
vn -0.796548 0.576023 0.183603
vn -0.803196 0.467211 0.369581
vn -0.892002 0.254579 0.373527
vn -0.866288 0.286773 0.409032
vn -0.705488 0.619002 0.345143
vn -0.898182 0.373936 0.231175
vn -0.812676 0.565811 0.139339
vn -0.421059 0.885687 -0.195623
vn -0.531705 0.734264 0.422074
vn -0.512185 0.807647 -0.292186
vn -0.0293183 0.756985 -0.652774
vn 0.00726427 0.870797 -0.491589
vn -0.951859 0.294361 -0.0855367
vn -0.676153 -0.190579 -0.711686
vn -0.258271 -0.597369 -0.759241
vn 0.224647 -0.60001 -0.767803
vn 0.116249 -0.642142 -0.757721
vn 0.388682 -0.426959 -0.816476
vn 0.425566 0.168975 -0.889012
vn -0.749273 0.635111 -0.187681
vn -0.757035 0.31387 -0.573047
vn -0.501326 0.848462 -0.16966
vn -0.194015 0.801476 -0.56568
vn -0.0661664 0.848086 -0.52571
vn 0.243728 0.672333 -0.698974
vn 0.193282 0.728 -0.657768
vn -0.434491 -0.236669 -0.869026
vn -0.1482 0.461964 -0.874429
vn 0.215743 -0.139545 -0.966428
vn 0.242906 0.7031 -0.668317
vn 0.18084 0.755615 -0.629557
vn 0.873293 -0.0307659 0.486222
vn 0.915811 -0.114875 0.38483
vn 0.971856 -0.232819 -0.0359363
vn 0.901829 0.101864 0.419915
vn 0.928404 0.24248 0.281548
vn 0.931147 -0.00325196 0.364628
vn 0.731483 0.663427 -0.157469
vn 0.498868 -0.550569 -0.669331
vn 0.740668 -0.524636 -0.419725
vn 0.715228 0.0697873 -0.695399
vn 0.52876 -0.302254 -0.79313
vn 0.958979 0.272922 0.0766335
vn 0.89781 0.280784 -0.33926
vn 0.458978 0.662389 -0.592098
vn -0.751954 0.558125 0.3508
vn -0.755945 0.617038 0.21866
vn -0.508138 0.799982 0.319099
vn -0.369524 0.920096 -0.129904
vn 0.0353923 0.906865 -0.419931
vn 0.0858782 0.793144 -0.602949
vn 0.3161 0.698181 -0.642358
vn 0.201124 0.899139 -0.388714
vn 0.216062 0.720522 -0.658913
vn 0.292633 0.661913 -0.690099
vn -0.158176 0.986274 -0.0473796
vn 0.230879 0.778751 -0.583302
vn 0.875235 0.469049 0.118134
vn 0.647049 0.708 -0.282955
vn 0.701044 0.670128 -0.243855
vn 0.268386 0.759649 -0.59237
vn 0.283036 -0.528253 -0.800524
vn -0.00324608 -0.517642 -0.855591
vn 0.286577 -0.408906 -0.866412
vn 0.236444 -0.153773 -0.9594
vn 0.45486 -0.220823 -0.862751
vn 0.128649 -0.653883 -0.745578
vn 0.104255 -0.47464 -0.873984
vn 0.320556 -0.619253 -0.716777
vn 0.388858 -0.364963 -0.845926
vn 0.128057 0.276208 -0.952528
vn 0.305951 0.399931 -0.863973
vn 0.0917059 0.539309 -0.837099
vn 0.383413 0.426271 -0.819322
vn 0.216437 0.709248 -0.670912
vn 0.357187 0.352044 -0.865149

g grp1
usemtl mtl1
f 52//52 56//56 2//2 
f 21//21 52//52 2//2 
f 21//21 1//1 52//52 
f 2//2 20//20 21//21 
f 7//7 56//56 4//4 
f 4//4 3//3 9//9 
f 4//4 5//5 3//3 
f 4//4 54//54 5//5 
f 5//5 54//54 62//62 
f 9//9 6//6 2//2 
f 2//2 56//56 7//7 
f 7//7 9//9 2//2 
f 4//4 9//9 7//7 
f 15//15 20//20 6//6 
f 20//20 2//2 6//6 
f 86//86 3//3 10//10 
f 42//42 6//6 8//8 
f 8//8 3//3 86//86 
f 8//8 86//86 44//44 
f 86//86 87//87 44//44 
f 44//44 87//87 45//45 
f 9//9 8//8 6//6 
f 3//3 8//8 9//9 
f 10//10 3//3 5//5 
f 10//10 5//5 11//11 
f 11//11 86//86 10//10 
f 96//96 5//5 62//62 
f 19//19 32//32 12//12 
f 32//32 33//33 12//12 
f 34//34 13//13 33//33 
f 12//12 33//33 13//13 
f 12//12 13//13 14//14 
f 14//14 13//13 131//131 
f 13//13 34//34 131//131 
f 15//15 19//19 16//16 
f 17//17 26//26 18//18 
f 26//26 17//17 16//16 
f 12//12 16//16 19//19 
f 20//20 22//22 21//21 
f 16//16 20//20 15//15 
f 22//22 23//23 1//1 
f 1//1 21//21 22//22 
f 23//23 22//22 67//67 
f 20//20 16//16 17//17 
f 20//20 17//17 22//22 
f 24//24 22//22 17//17 
f 18//18 24//24 17//17 
f 24//24 25//25 22//22 
f 22//22 25//25 67//67 
f 12//12 26//26 16//16 
f 14//14 26//26 12//12 
f 26//26 27//27 18//18 
f 26//26 14//14 27//27 
f 28//28 18//18 27//27 
f 14//14 131//131 27//27 
f 18//18 28//28 29//29 
f 18//18 30//30 24//24 
f 18//18 29//29 30//30 
f 25//25 24//24 30//30 
f 30//30 70//70 25//25 
f 30//30 29//29 136//136 
f 30//30 69//69 70//70 
f 136//136 69//69 30//30 
f 31//31 33//33 32//32 
f 31//31 35//35 33//33 
f 31//31 43//43 35//35 
f 38//38 35//35 43//43 
f 43//43 46//46 38//38 
f 46//46 43//43 44//44 
f 40//40 34//34 35//35 
f 33//33 35//35 34//34 
f 38//38 40//40 35//35 
f 34//34 36//36 131//131 
f 34//34 138//138 36//36 
f 40//40 138//138 34//34 
f 40//40 37//37 138//138 
f 38//38 39//39 40//40 
f 46//46 48//48 38//38 
f 38//38 48//48 39//39 
f 40//40 41//41 37//37 
f 39//39 41//41 40//40 
f 39//39 50//50 41//41 
f 31//31 15//15 6//6 
f 19//19 15//15 31//31 
f 31//31 6//6 42//42 
f 42//42 43//43 31//31 
f 31//31 32//32 19//19 
f 42//42 8//8 43//43 
f 8//8 44//44 43//43 
f 45//45 48//48 44//44 
f 44//44 48//48 46//46 
f 45//45 49//49 48//48 
f 49//49 45//45 47//47 
f 39//39 48//48 50//50 
f 48//48 49//49 50//50 
f 91//91 49//49 47//47 
f 49//49 51//51 50//50 
f 49//49 91//91 51//51 
f 1//1 53//53 52//52 
f 55//55 56//56 57//57 
f 56//56 55//55 4//4 
f 4//4 55//55 54//54 
f 54//54 55//55 62//62 
f 52//52 57//57 56//56 
f 57//57 52//52 53//53 
f 57//57 66//66 60//60 
f 60//60 59//59 57//57 
f 57//57 59//59 55//55 
f 59//59 58//58 55//55 
f 61//61 58//58 59//59 
f 66//66 57//57 53//53 
f 60//60 72//72 59//59 
f 59//59 72//72 61//61 
f 55//55 58//58 62//62 
f 62//62 63//63 96//96 
f 62//62 58//58 63//63 
f 99//99 98//98 63//63 
f 99//99 63//63 58//58 
f 61//61 75//75 58//58 
f 75//75 99//99 58//58 
f 23//23 53//53 1//1 
f 64//64 23//23 67//67 
f 53//53 23//23 66//66 
f 66//66 23//23 64//64 
f 64//64 65//65 66//66 
f 67//67 78//78 64//64 
f 64//64 78//78 65//65 
f 25//25 68//68 67//67 
f 78//78 67//67 68//68 
f 60//60 66//66 71//71 
f 71//71 66//66 65//65 
f 65//65 73//73 71//71 
f 65//65 78//78 73//73 
f 68//68 25//25 70//70 
f 71//71 72//72 60//60 
f 71//71 73//73 72//72 
f 72//72 74//74 61//61 
f 74//74 75//75 61//61 
f 78//78 79//79 73//73 
f 72//72 73//73 74//74 
f 73//73 83//83 74//74 
f 79//79 83//83 73//73 
f 77//77 99//99 75//75 
f 105//105 99//99 77//77 
f 75//75 74//74 76//76 
f 76//76 77//77 75//75 
f 105//105 77//77 113//113 
f 77//77 76//76 113//113 
f 68//68 79//79 78//78 
f 83//83 79//79 80//80 
f 80//80 79//79 175//175 
f 68//68 70//70 79//79 
f 79//79 70//70 81//81 
f 79//79 81//81 175//175 
f 83//83 76//76 74//74 
f 117//117 76//76 82//82 
f 80//80 85//85 83//83 
f 80//80 175//175 84//84 
f 80//80 84//84 85//85 
f 76//76 83//83 82//82 
f 83//83 85//85 82//82 
f 5//5 97//97 11//11 
f 97//97 5//5 96//96 
f 86//86 88//88 87//87 
f 11//11 88//88 86//86 
f 11//11 101//101 88//88 
f 101//101 90//90 88//88 
f 88//88 45//45 87//87 
f 89//89 47//47 88//88 
f 88//88 90//90 89//89 
f 88//88 47//47 45//45 
f 108//108 89//89 90//90 
f 89//89 108//108 94//94 
f 91//91 93//93 51//51 
f 51//51 93//93 190//190 
f 91//91 47//47 89//89 
f 94//94 91//91 89//89 
f 91//91 92//92 93//93 
f 91//91 94//94 92//92 
f 92//92 192//192 93//93 
f 92//92 94//94 95//95 
f 110//110 95//95 94//94 
f 92//92 95//95 192//192 
f 192//192 95//95 195//195 
f 100//100 97//97 96//96 
f 98//98 96//96 63//63 
f 100//100 96//96 98//98 
f 101//101 11//11 97//97 
f 97//97 100//100 101//101 
f 102//102 98//98 99//99 
f 102//102 103//103 98//98 
f 107//107 90//90 101//101 
f 107//107 101//101 100//100 
f 100//100 98//98 103//103 
f 104//104 100//100 103//103 
f 102//102 104//104 103//103 
f 102//102 99//99 105//105 
f 112//112 102//102 106//106 
f 105//105 106//106 102//102 
f 105//105 113//113 106//106 
f 100//100 104//104 107//107 
f 112//112 104//104 102//102 
f 111//111 109//109 107//107 
f 104//104 111//111 107//107 
f 107//107 108//108 90//90 
f 107//107 110//110 108//108 
f 107//107 109//109 110//110 
f 109//109 122//122 110//110 
f 111//111 122//122 109//109 
f 104//104 112//112 111//111 
f 114//114 119//119 106//106 
f 106//106 115//115 112//112 
f 111//111 112//112 115//115 
f 119//119 115//115 106//106 
f 113//113 76//76 117//117 
f 113//113 117//117 114//114 
f 114//114 117//117 118//118 
f 114//114 106//106 113//113 
f 110//110 94//94 108//108 
f 124//124 110//110 122//122 
f 110//110 245//245 95//95 
f 118//118 119//119 114//114 
f 119//119 116//116 115//115 
f 117//117 82//82 231//231 
f 120//120 118//118 231//231 
f 231//231 118//118 117//117 
f 119//119 234//234 116//116 
f 119//119 118//118 234//234 
f 118//118 120//120 234//234 
f 125//125 122//122 111//111 
f 122//122 121//121 124//124 
f 123//123 122//122 125//125 
f 122//122 123//123 121//121 
f 110//110 124//124 245//245 
f 123//123 130//130 121//121 
f 121//121 130//130 248//248 
f 125//125 111//111 126//126 
f 115//115 126//126 111//111 
f 115//115 127//127 126//126 
f 115//115 116//116 127//127 
f 128//128 123//123 125//125 
f 125//125 126//126 128//128 
f 128//128 130//130 123//123 
f 127//127 116//116 129//129 
f 129//129 128//128 126//126 
f 126//126 127//127 129//129 
f 128//128 129//129 130//130 
f 257//257 116//116 234//234 
f 257//257 129//129 116//116 
f 131//131 132//132 135//135 
f 131//131 139//139 132//132 
f 139//139 143//143 132//132 
f 132//132 143//143 133//133 
f 132//132 133//133 135//135 
f 133//133 137//137 135//135 
f 135//135 27//27 131//131 
f 27//27 135//135 28//28 
f 134//134 28//28 135//135 
f 134//134 29//29 28//28 
f 29//29 134//134 157//157 
f 29//29 157//157 152//152 
f 29//29 152//152 136//136 
f 69//69 136//136 172//172 
f 135//135 137//137 134//134 
f 134//134 137//137 157//157 
f 156//156 157//157 137//137 
f 36//36 139//139 131//131 
f 138//138 140//140 36//36 
f 36//36 140//140 139//139 
f 139//139 140//140 141//141 
f 138//138 37//37 140//140 
f 154//154 141//141 140//140 
f 154//154 140//140 37//37 
f 139//139 141//141 143//143 
f 144//144 143//143 141//141 
f 145//145 144//144 141//141 
f 154//154 145//145 141//141 
f 41//41 154//154 37//37 
f 41//41 50//50 154//154 
f 154//154 142//142 145//145 
f 145//145 142//142 150//150 
f 133//133 143//143 147//147 
f 143//143 149//149 147//147 
f 137//137 133//133 158//158 
f 145//145 146//146 144//144 
f 144//144 149//149 143//143 
f 144//144 146//146 149//149 
f 147//147 148//148 133//133 
f 158//158 133//133 148//148 
f 151//151 149//149 146//146 
f 147//147 149//149 148//148 
f 151//151 148//148 149//149 
f 150//150 146//146 145//145 
f 197//197 150//150 142//142 
f 148//148 151//151 168//168 
f 164//164 151//151 150//150 
f 146//146 150//150 151//151 
f 200//200 150//150 197//197 
f 150//150 200//200 164//164 
f 164//164 168//168 151//151 
f 152//152 172//172 136//136 
f 172//172 152//152 153//153 
f 50//50 155//155 154//154 
f 154//154 155//155 142//142 
f 155//155 50//50 51//51 
f 190//190 155//155 51//51 
f 198//198 155//155 190//190 
f 155//155 198//198 142//142 
f 157//157 156//156 152//152 
f 158//158 156//156 137//137 
f 159//159 156//156 158//158 
f 159//159 160//160 156//156 
f 158//158 148//148 165//165 
f 165//165 159//159 158//158 
f 152//152 156//156 161//161 
f 161//161 156//156 160//160 
f 161//161 160//160 162//162 
f 153//153 152//152 161//161 
f 162//162 180//180 161//161 
f 167//167 162//162 160//160 
f 197//197 142//142 198//198 
f 162//162 163//163 180//180 
f 163//163 162//162 167//167 
f 163//163 167//167 215//215 
f 182//182 163//163 215//215 
f 165//165 166//166 159//159 
f 159//159 166//166 160//160 
f 168//168 169//169 148//148 
f 148//148 169//169 165//165 
f 165//165 169//169 166//166 
f 166//166 169//169 170//170 
f 160//160 166//166 167//167 
f 166//166 170//170 167//167 
f 213//213 168//168 164//164 
f 213//213 169//169 168//168 
f 170//170 169//169 171//171 
f 170//170 215//215 167//167 
f 170//170 171//171 215//215 
f 70//70 69//69 172//172 
f 70//70 172//172 177//177 
f 153//153 173//173 172//172 
f 173//173 177//177 172//172 
f 153//153 174//174 173//173 
f 173//173 174//174 181//181 
f 81//81 70//70 177//177 
f 175//175 81//81 176//176 
f 177//177 176//176 81//81 
f 175//175 176//176 178//178 
f 173//173 179//179 177//177 
f 179//179 176//176 177//177 
f 181//181 179//179 173//173 
f 176//176 187//187 178//178 
f 176//176 179//179 185//185 
f 184//184 185//185 179//179 
f 185//185 187//187 176//176 
f 161//161 174//174 153//153 
f 180//180 174//174 161//161 
f 163//163 174//174 180//180 
f 184//184 181//181 174//174 
f 183//183 174//174 163//163 
f 163//163 182//182 183//183 
f 183//183 184//184 174//174 
f 261//261 184//184 183//183 
f 179//179 181//181 184//184 
f 261//261 186//186 184//184 
f 175//175 178//178 84//84 
f 84//84 178//178 188//188 
f 82//82 85//85 232//232 
f 231//231 82//82 232//232 
f 85//85 84//84 188//188 
f 85//85 188//188 232//232 
f 178//178 187//187 188//188 
f 188//188 187//187 239//239 
f 187//187 185//185 238//238 
f 187//187 238//238 239//239 
f 238//238 185//185 184//184 
f 189//189 190//190 93//93 
f 93//93 193//193 189//189 
f 190//190 199//199 198//198 
f 190//190 191//191 199//199 
f 190//190 189//189 191//191 
f 192//192 193//193 93//93 
f 189//189 196//196 191//191 
f 191//191 196//196 203//203 
f 194//194 193//193 192//192 
f 194//194 192//192 195//195 
f 95//95 245//245 195//195 
f 189//189 193//193 196//196 
f 194//194 196//196 193//193 
f 247//247 194//194 195//195 
f 201//201 197//197 198//198 
f 201//201 198//198 199//199 
f 199//199 191//191 201//201 
f 205//205 202//202 191//191 
f 201//201 200//200 197//197 
f 201//201 191//191 202//202 
f 203//203 205//205 191//191 
f 203//203 204//204 206//206 
f 203//203 206//206 205//205 
f 204//204 203//203 196//196 
f 194//194 204//204 196//196 
f 247//247 195//195 245//245 
f 247//247 208//208 194//194 
f 194//194 208//208 204//204 
f 204//204 207//207 206//206 
f 208//208 207//207 204//204 
f 208//208 247//247 255//255 
f 211//211 207//207 255//255 
f 208//208 255//255 207//207 
f 207//207 209//209 206//206 
f 207//207 210//210 209//209 
f 209//209 210//210 223//223 
f 207//207 211//211 210//210 
f 211//211 254//254 224//224 
f 210//210 211//211 224//224 
f 212//212 164//164 200//200 
f 212//212 213//213 164//164 
f 212//212 200//200 201//201 
f 169//169 213//213 171//171 
f 171//171 213//213 214//214 
f 201//201 202//202 212//212 
f 202//202 205//205 212//212 
f 212//212 205//205 219//219 
f 214//214 216//216 171//171 
f 220//220 213//213 212//212 
f 212//212 219//219 220//220 
f 214//214 213//213 226//226 
f 213//213 220//220 226//226 
f 216//216 215//215 171//171 
f 215//215 216//216 217//217 
f 217//217 182//182 215//215 
f 182//182 217//217 265//265 
f 228//228 217//217 216//216 
f 228//228 218//218 217//217 
f 265//265 217//217 218//218 
f 205//205 221//221 219//219 
f 206//206 221//221 205//205 
f 209//209 221//221 206//206 
f 223//223 221//221 209//209 
f 223//223 222//222 221//221 
f 222//222 219//219 221//221 
f 225//225 227//227 222//222 
f 220//220 227//227 226//226 
f 222//222 220//220 219//219 
f 227//227 220//220 222//222 
f 229//229 273//273 225//225 
f 223//223 210//210 225//225 
f 210//210 224//224 225//225 
f 229//229 225//225 224//224 
f 223//223 225//225 222//222 
f 273//273 218//218 227//227 
f 227//227 225//225 273//273 
f 265//265 218//218 273//273 
f 228//228 214//214 226//226 
f 227//227 228//228 226//226 
f 214//214 228//228 216//216 
f 228//228 227//227 218//218 
f 186//186 261//261 266//266 
f 262//262 266//266 261//261 
f 266//266 268//268 186//186 
f 224//224 254//254 229//229 
f 253//253 229//229 254//254 
f 272//272 271//271 229//229 
f 272//272 229//229 230//230 
f 253//253 230//230 229//229 
f 120//120 231//231 236//236 
f 231//231 232//232 236//236 
f 239//239 233//233 188//188 
f 188//188 233//233 232//232 
f 232//232 233//233 236//236 
f 234//234 120//120 235//235 
f 235//235 257//257 234//234 
f 236//236 235//235 120//120 
f 235//235 236//236 242//242 
f 242//242 237//237 235//235 
f 186//186 268//268 184//184 
f 238//238 184//184 268//268 
f 239//239 238//238 268//268 
f 241//241 268//268 269//269 
f 268//268 241//241 239//239 
f 241//241 240//240 239//239 
f 240//240 233//233 239//239 
f 243//243 233//233 240//240 
f 233//233 242//242 236//236 
f 243//243 242//242 233//233 
f 244//244 230//230 260//260 
f 230//230 253//253 260//260 
f 243//243 237//237 242//242 
f 244//244 260//260 237//237 
f 244//244 237//237 243//243 
f 241//241 275//275 240//240 
f 244//244 275//275 274//274 
f 244//244 240//240 275//275 
f 240//240 244//244 243//243 
f 274//274 230//230 244//244 
f 245//245 124//124 246//246 
f 246//246 247//247 245//245 
f 121//121 246//246 124//124 
f 121//121 248//248 246//246 
f 248//248 250//250 249//249 
f 249//249 253//253 256//256 
f 248//248 247//247 246//246 
f 248//248 249//249 247//247 
f 247//247 249//249 255//255 
f 250//250 248//248 252//252 
f 258//258 252//252 129//129 
f 258//258 251//251 252//252 
f 250//250 253//253 249//249 
f 250//250 251//251 253//253 
f 260//260 253//253 251//251 
f 250//250 252//252 251//251 
f 130//130 252//252 248//248 
f 130//130 129//129 252//252 
f 254//254 211//211 256//256 
f 254//254 256//256 253//253 
f 255//255 249//249 256//256 
f 211//211 255//255 256//256 
f 257//257 235//235 259//259 
f 259//259 258//258 257//257 
f 129//129 257//257 258//258 
f 237//237 259//259 235//235 
f 258//258 259//259 251//251 
f 237//237 260//260 259//259 
f 251//251 259//259 260//260 
f 182//182 261//261 183//183 
f 265//265 261//261 182//182 
f 261//261 265//265 263//263 
f 263//263 262//262 261//261 
f 263//263 264//264 262//262 
f 264//264 267//267 262//262 
f 265//265 264//264 263//263 
f 262//262 267//267 266//266 
f 267//267 264//264 270//270 
f 267//267 268//268 266//266 
f 268//268 267//267 269//269 
f 269//269 275//275 241//241 
f 267//267 270//270 269//269 
f 269//269 270//270 275//275 
f 229//229 271//271 273//273 
f 271//271 272//272 264//264 
f 264//264 265//265 273//273 
f 271//271 264//264 273//273 
f 274//274 270//270 272//272 
f 230//230 274//274 272//272 
f 272//272 270//270 264//264 
f 275//275 270//270 274//274 
