# PIPER geometrical reference model based on a manual segmentation. See the
# documentation for more info.
# Author: CEESAR, SOTON, UCBL-Ifsttar
# Version: 1.0.0
# License: Creative Commons Attribution 4.0 International License.
# (https://creativecommons.org/licenses/by/4.0/)
# 
# This work has received funding from the European Union Seventh Framework
# Program ([FP7/2007-2013]) under grant agreement 605544 [PIPER project]).
# Contributors include Pierre Maillez, Christophe Lecomte (SOTON), Erwan
# Jolivet (CEESAR), Philippe Beillas (UCBL-Ifsttar)
# This work is derived from a CT scan provided by CEESAR under a CCBY-4.0
# License
# 
# wavefront obj file written by the visualization toolkit

mtllib C:/desktop/registration_reference_model/22_REF_LTE635_Assembly_hands_corr/CCTu635_BP142_DistalPhalThumb_L.mtl

v -115.861 232.007 -974.918
v -115.719 231.939 -975.846
v -115.215 231.917 -976.964
v -110.081 228.279 -974.041
v -114.344 231.515 -973.934
v -113.296 230.839 -974.407
v -113.217 232.102 -974.059
v -110.813 228.699 -974.051
v -108.767 231.217 -974.232
v -112.203 228.658 -976.149
v -111.362 227.917 -974.503
v -110.436 227.753 -974.606
v -109.241 227.811 -976.161
v -111.121 228.114 -976.526
v -110.289 227.606 -976.236
v -112.364 228.833 -974.88
v -112.657 230.108 -974.655
v -111.729 227.832 -975.35
v -115.041 231.113 -974.84
v -114.173 230.667 -974.729
v -114.736 231.021 -975.805
v -113.609 230.204 -975.503
v -113.073 229.681 -976.169
v -111.686 231.408 -974.359
v -110.171 228.679 -977.478
v -108.615 228.334 -977.035
v -114.111 231.071 -976.866
v -112.236 230.746 -980.268
v -111.696 229.551 -977.996
v -111.246 230.048 -980.183
v -110.219 229.347 -978.663
v -111.573 230.503 -981.767
v -112.406 231.242 -982.254
v -113.114 232.114 -982.685
v -109.38 230.018 -981.654
v -108.274 230.453 -982.517
v -110.504 230.106 -982.259
v -110.419 230.043 -984.969
v -108.626 228.444 -975.301
v -107.753 229.967 -974.897
v -107.224 229.033 -975.631
v -105.84 229.739 -975.55
v -107.943 232.095 -974.398
v -105.934 232.567 -975.111
v -106.879 228.66 -976.391
v -105.79 230.963 -975.127
v -104.764 230.587 -975.547
v -103.842 232.057 -975.818
v -104.784 229.883 -976.321
v -104.966 229.747 -976.885
v -102.651 232.721 -976.567
v -109.082 229.128 -978.418
v -106.694 228.824 -977.016
v -105.937 230.456 -979.135
v -108.673 229.805 -980.149
v -107.724 229.493 -978.771
v -107.33 230.442 -980.885
v -103.756 231.523 -978.55
v -104.875 231.846 -980.274
v -106.199 231.346 -981.572
v -105.492 232.203 -981.88
v -107.874 230.949 -984.541
v -107.144 231.156 -983.182
v -115.583 232.725 -974.637
v -116.102 233.198 -975.955
v -115.747 234.004 -975.155
v -115.882 233.067 -977.534
v -115.819 234.481 -976.242
v -116.071 233.938 -977.324
v -114.934 235.402 -976.531
v -114.377 233.684 -974.114
v -109.657 231.693 -974.206
v -114.881 234.165 -974.478
v -111.681 233.047 -974.5
v -110.485 233.365 -974.636
v -111.291 235.089 -976.238
v -110.899 234.416 -975.441
v -109.41 234.389 -974.973
v -115.046 235.081 -975.234
v -112.896 235.239 -974.677
v -113.921 235.371 -974.754
v -112.228 235.248 -975.196
v -113.979 235.849 -975.8
v -112.868 235.78 -975.555
v -113.911 235.828 -977.449
v -110.296 235.361 -977.103
v -109.36 235.656 -977.638
v -114.739 232.456 -978.207
v -115.69 233.721 -978.723
v -113.296 231.149 -978.56
v -114.016 232.547 -979.551
v -114.949 235.249 -977.645
v -113.885 233.405 -980.831
v -114.958 233.728 -979.275
v -114.497 234.54 -979.574
v -113.927 235.2 -979.34
v -112.19 235.567 -980.41
v -111.425 235.502 -977.82
v -113.022 236.006 -977.034
v -110.12 235.534 -979.811
v -111.485 235.652 -979.364
v -113.203 231.999 -980.91
v -113.591 234.551 -981.176
v -112.514 234.473 -983.549
v -113.651 232.82 -983.972
v -113.464 232.802 -982.288
v -113.468 233.673 -983.074
v -113.112 234.294 -984.873
v -110.669 235.651 -981.743
v -109.166 235.877 -982.159
v -112.361 235.094 -982.277
v -109.837 235.533 -983.333
v -108.766 233.444 -974.321
v -106.176 233.703 -975.204
v -107.379 234.43 -975.366
v -107.249 235.258 -976.578
v -103.828 233.511 -975.715
v -102.663 232.191 -976.925
v -104.086 234.517 -975.773
v -102.691 233.917 -976.319
v -105.058 235.848 -976.267
v -109.058 235.481 -976.784
v -105.296 235.353 -975.749
v -103.853 236.109 -976.932
v -103.507 235.901 -978.23
v -103.879 235.695 -976.228
v -102.148 234.884 -976.655
v -102.594 235.596 -977.147
v -102.624 232.243 -977.805
v -104.531 232.878 -980.961
v -103.321 232.694 -979.555
v -103.032 234.585 -980.044
v -103.327 235.219 -979.604
v -106.582 235.687 -978.08
v -106.36 235.671 -979.774
v -108.121 235.469 -979.754
v -104.801 236.076 -977.753
v -104.851 235.475 -980.268
v -105.454 232.949 -982.514
v -105.833 233.094 -983.655
v -104.828 233.743 -981.42
v -105.379 234.61 -981.85
v -104.146 234.554 -980.776
v -105.644 233.771 -983.092
v -107.53 235.782 -981.424
v -106.275 235.538 -981.363
v -107.452 235.717 -982.735
v -101.876 233.757 -977.521
v -102.194 233.56 -978.906
v -102.144 234.475 -978.92
v -102.323 235.282 -978.298
v -101.741 234.842 -977.672
v -103.21 233.845 -980.121
v -112.732 231.331 -985.945
v -114.221 231.991 -987.579
v -109.207 230.42 -984.691
v -111.467 230.388 -983.91
v -112.674 230.93 -988.159
v -113.898 231.024 -989.504
v -112.447 230.278 -990.466
v -110.19 230.369 -987.076
v -111.462 230.573 -986.503
v -109.023 230.519 -987.698
v -111.279 230.39 -988.95
v -109.73 230.301 -989.627
v -113.031 230.489 -991.583
v -111.16 229.901 -991.855
v -114.05 231.03 -990.755
v -113.913 232.098 -991.599
v -113.749 231.224 -991.775
v -112.522 230.758 -993.005
v -112.871 231.622 -993.049
v -111.657 231.253 -993.889
v -108.695 230.089 -991.908
v -109.688 229.892 -992.934
v -111.549 230.358 -993.345
v -109.97 230.357 -993.508
v -110.177 231.078 -994.121
v -106.76 231.793 -985.496
v -107.947 230.974 -986.816
v -106.774 231.643 -988.195
v -108.02 230.559 -990.266
v -106.821 231.169 -991.221
v -107.161 231.612 -992.588
v -108.122 230.723 -993.128
v -114.058 233.366 -984.836
v -112.847 231.714 -984.038
v -113.713 232.395 -985.48
v -114.77 233.151 -986.517
v -114.272 233.862 -985.971
v -110.908 234.835 -984.202
v -108.452 235.721 -983.232
v -109.417 235.047 -984.403
v -111.642 234.391 -985.694
v -109.681 234.475 -985.946
v -114.71 232.209 -989.255
v -114.181 233.902 -987.497
v -114.761 233.35 -988.016
v -112.703 233.758 -989.878
v -114.576 232.611 -989.983
v -112.703 234.096 -988.127
v -110.933 234.174 -987.461
v -107.05 234.291 -986.317
v -111.037 233.997 -989.295
v -109.604 233.916 -988.237
v -113.892 233.08 -990.491
v -112.563 232.331 -993.036
v -110.887 233.961 -990.959
v -111.544 233.28 -992.343
v -109.393 234.076 -991.111
v -108.718 233.825 -992.014
v -109.564 233.168 -993.047
v -110.559 232.073 -994.134
v -110.061 233.838 -992.09
v -110.722 232.618 -993.692
v -108.28 231.526 -993.653
v -106.393 232.013 -984.083
v -105.883 232.838 -985.351
v -108.205 234.671 -985.301
v -105.838 233.647 -984.931
v -106.527 234.583 -984.182
v -106.411 234.163 -985.249
v -105.282 233.014 -986.305
v -105.137 233.727 -985.937
v -105.118 234.284 -986.804
v -106.751 234.299 -987.506
v -105.232 233.913 -987.907
v -106.206 234.201 -988.505
v -106.16 233.705 -989.9
v -105.797 232.371 -989.065
v -104.851 233.602 -986.955
v -105.882 232.865 -990.169
v -106.424 231.858 -991.338
v -106.665 233.027 -991.758
v -107.779 234.074 -990.388
v -107.352 233.8 -991.28
v -107.71 232.984 -992.616
v -109.216 228.191 -976.885
v -113.831 231.945 -986.84
v -106.022 232.27 -988.046
vn -0.869365 -0.317997 0.378263
vn -0.819042 -0.545966 -0.176327
vn -0.623279 -0.672002 -0.399921
vn 0.170039 -0.487411 0.856456
vn -0.222684 -0.316197 0.922188
vn -0.0244573 -0.414409 0.909762
vn 0.154069 -0.0236 0.987778
vn -0.205634 -0.182324 0.961495
vn 0.222405 -0.0498694 0.973678
vn -0.649358 -0.662869 -0.372745
vn -0.363266 -0.68125 0.63556
vn 0.083425 -0.88503 0.457999
vn 0.302901 -0.952276 -0.037701
vn -0.370226 -0.765255 -0.52661
vn -0.0483169 -0.952696 -0.300061
vn -0.717683 -0.464637 0.518694
vn -0.369479 -0.317496 0.873317
vn -0.532412 -0.846461 -0.00639717
vn -0.609781 -0.739249 0.285794
vn -0.398011 -0.810833 0.429113
vn -0.577558 -0.790179 -0.205046
vn -0.638752 -0.764811 0.0840248
vn -0.718056 -0.659397 -0.222689
vn -0.0170266 0.0124754 0.999777
vn -0.136356 -0.807789 -0.573485
vn 0.159846 -0.88075 -0.44579
vn -0.609738 -0.711179 -0.34992
vn -0.641208 -0.740803 -0.200157
vn -0.473803 -0.781895 -0.405155
vn -0.445095 -0.872537 -0.201419
vn -0.170565 -0.918758 -0.356077
vn -0.52172 -0.84843 -0.0893064
vn -0.713112 -0.699338 -0.048959
vn -0.828258 -0.560343 0.00229097
vn 0.117791 -0.975437 -0.186139
vn 0.347758 -0.921613 -0.172317
vn -0.16412 -0.982183 -0.0915515
vn -0.0172878 -0.997916 -0.0621684
vn 0.469889 -0.709414 0.525297
vn 0.355175 -0.315838 0.879828
vn 0.356769 -0.632931 0.687106
vn 0.367118 -0.588752 0.720136
vn 0.264614 -0.00301672 0.96435
vn 0.281632 0.0728044 0.956757
vn 0.389873 -0.905685 0.166535
vn 0.290357 -0.158932 0.943628
vn 0.517958 -0.379068 0.766829
vn 0.5331 -0.180899 0.826487
vn 0.632269 -0.728094 0.264792
vn 0.567014 -0.800469 -0.194282
vn 0.74172 -0.254698 0.620468
vn 0.0080793 -0.894646 -0.446702
vn 0.36576 -0.881193 -0.29953
vn 0.458144 -0.79019 -0.407068
vn 0.167336 -0.947051 -0.274032
vn 0.252078 -0.873653 -0.416157
vn 0.3932 -0.875986 -0.27936
vn 0.59335 -0.694527 -0.4069
vn 0.604145 -0.660359 -0.446021
vn 0.587134 -0.754548 -0.293139
vn 0.751375 -0.545029 -0.371993
vn 0.460321 -0.88238 -0.0975228
vn 0.531881 -0.826312 -0.185232
vn -0.697772 0.0809272 0.711734
vn -0.994859 -0.0291765 0.0969755
vn -0.823654 0.30548 0.477782
vn -0.8546 -0.415567 -0.311389
vn -0.857816 0.506789 0.0855336
vn -0.955185 0.248584 -0.16071
vn -0.588597 0.80841 0.00526114
vn -0.167356 0.201087 0.965172
vn -0.0392098 0.0980195 0.994412
vn -0.47103 0.349398 0.80997
vn 0.178251 0.228232 0.95715
vn -0.124052 0.376897 0.91791
vn 0.359288 0.859617 0.363276
vn 0.134964 0.702566 0.698703
vn -0.0764236 0.705747 0.70433
vn -0.597127 0.672595 0.437099
vn 0.25226 0.560892 0.788521
vn -0.179229 0.689035 0.702217
vn 0.500704 0.656238 0.564488
vn -0.248545 0.945195 0.211736
vn 0.229734 0.916822 0.326587
vn -0.310283 0.939097 -0.147721
vn -0.0839205 0.95601 0.281073
vn -0.113854 0.988684 0.0976741
vn -0.633271 -0.622967 -0.459217
vn -0.821676 -0.0426205 -0.568359
vn -0.670368 -0.67098 -0.316847
vn -0.765212 -0.530323 -0.364977
vn -0.621603 0.74786 -0.233057
vn -0.927235 -0.164216 -0.336555
vn -0.706876 -0.2244 -0.670799
vn -0.731321 0.47601 -0.48845
vn -0.505689 0.797495 -0.32906
vn -0.192599 0.968949 -0.155058
vn 0.215974 0.968958 0.120317
vn 0.0753207 0.997083 0.0123185
vn 0.0181717 0.998585 0.049983
vn 0.088138 0.996108 -0.000613109
vn -0.814289 -0.552895 -0.176749
vn -0.797186 0.492161 -0.349673
vn -0.46213 0.86858 -0.1789
vn -0.912085 -0.362653 0.191268
vn -0.949988 -0.306394 -0.0603814
vn -0.923382 0.382102 -0.0369384
vn -0.389309 0.919296 0.0577357
vn -0.163649 0.982379 -0.0902825
vn -0.0572227 0.997616 -0.0385826
vn -0.416359 0.862709 -0.287016
vn -0.183732 0.927016 -0.326932
vn 0.0645417 0.334953 0.940022
vn 0.199407 0.231987 0.95206
vn 0.0689367 0.665846 0.742898
vn -0.0813815 0.90936 0.407972
vn 0.370302 0.0439085 0.927873
vn 0.807318 -0.512329 0.292844
vn 0.288182 0.205566 0.935251
vn 0.611246 -0.0448269 0.79017
vn -0.127094 0.888208 0.441512
vn -0.0545874 0.924898 0.376276
vn -0.0159275 0.55466 0.831924
vn 0.185159 0.95964 0.211676
vn 0.274999 0.935523 -0.221748
vn 0.278062 0.62396 0.730312
vn 0.725051 0.273883 0.631894
vn 0.53638 0.815136 0.218746
vn 0.789151 -0.585381 -0.185929
vn 0.721673 -0.359271 -0.591704
vn 0.653533 -0.526329 -0.543942
vn 0.656284 0.295665 -0.694171
vn 0.461132 0.73503 -0.49708
vn -0.13038 0.98928 0.0657771
vn -0.0189832 0.998198 -0.0569183
vn -0.0208208 0.999694 0.0133662
vn -0.0859271 0.995264 -0.0454451
vn 0.278897 0.87188 -0.402544
vn 0.88935 -0.215795 -0.4031
vn 0.93896 -0.261259 -0.223827
vn 0.770618 0.0368706 -0.63623
vn 0.688646 0.531986 -0.492704
vn 0.561128 0.383358 -0.733602
vn 0.922166 0.189545 -0.337169
vn 0.0659042 0.997149 0.0367392
vn 0.345766 0.908053 -0.236401
vn 0.255998 0.937709 -0.234875
vn 0.961269 -0.234421 0.144943
vn 0.855264 -0.289345 -0.429888
vn 0.853953 0.201701 -0.479668
vn 0.626056 0.716406 -0.307921
vn 0.951305 0.308245 -0.00208075
vn 0.674829 -0.184324 -0.714584
vn -0.596655 -0.793859 0.117434
vn -0.694537 -0.684158 0.22259
vn 0.301563 -0.95153 -0.0604108
vn -0.495858 -0.868397 0.00342997
vn -0.391963 -0.900534 0.188159
vn -0.590005 -0.788316 0.174503
vn -0.27847 -0.953324 0.116735
vn 0.00394599 -0.999771 -0.0210222
vn -0.352236 -0.93586 -0.0098114
vn 0.235256 -0.970784 0.0472554
vn -0.140148 -0.982583 0.122024
vn 0.0911972 -0.99059 0.10205
vn -0.48281 -0.858238 -0.174129
vn -0.13449 -0.990484 -0.0292244
vn -0.789085 -0.596479 -0.146823
vn -0.841961 0.228751 -0.488646
vn -0.814021 -0.376435 -0.442343
vn -0.58629 -0.583202 -0.562262
vn -0.691625 0.00714405 -0.722222
vn -0.399995 -0.149407 -0.904257
vn 0.331703 -0.943164 -0.0203549
vn 0.135576 -0.931608 -0.337232
vn -0.296997 -0.772104 -0.561825
vn 0.0946995 -0.69254 -0.715136
vn 0.0696322 -0.326138 -0.942754
vn 0.649104 -0.760662 -0.00750594
vn 0.466588 -0.883965 0.0300143
vn 0.599539 -0.796649 0.0768344
vn 0.389793 -0.914383 0.109381
vn 0.693105 -0.710851 -0.119563
vn 0.779059 -0.186233 -0.598652
vn 0.533287 -0.642287 -0.55052
vn -0.935073 0.131944 0.328984
vn -0.745847 -0.662437 0.0699215
vn -0.750035 -0.612609 0.249315
vn -0.971482 -0.0489995 0.231996
vn -0.678402 0.712187 0.180445
vn -0.230891 0.924782 -0.302438
vn 0.0450632 0.95185 -0.303235
vn -0.101602 0.907497 -0.407585
vn -0.102796 0.984981 -0.138732
vn -0.0214839 0.964965 -0.261499
vn -0.960738 -0.275065 -0.0363613
vn -0.44094 0.890407 -0.112906
vn -0.877452 0.46185 -0.129508
vn -0.249169 0.939047 -0.236867
vn -0.909914 0.240057 -0.338272
vn -0.113064 0.984062 -0.137251
vn 0.0232238 0.989287 -0.144123
vn 0.0515482 0.997121 -0.0556126
vn -0.0263923 0.998091 -0.0558326
vn 0.00785499 0.996249 -0.0861724
vn -0.547973 0.740503 -0.389077
vn -0.517277 0.531669 -0.670636
vn -0.181162 0.968141 -0.172869
vn -0.299919 0.838539 -0.454863
vn -0.00389481 0.993928 -0.109964
vn 0.15204 0.88269 -0.444682
vn 0.086273 0.725327 -0.682978
vn -0.0550642 0.32985 -0.942426
vn -0.112592 0.90137 -0.418158
vn -0.153564 0.698423 -0.699016
vn 0.465892 -0.0060706 -0.884821
vn 0.800632 -0.581597 -0.14399
vn 0.838373 -0.455739 0.299052
vn 0.116414 0.932221 -0.342653
vn 0.939266 0.284672 0.19168
vn 0.551495 0.771682 -0.316797
vn 0.405384 0.914118 -0.00725171
vn 0.796667 -0.565324 0.213845
vn 0.852274 0.199415 0.483593
vn 0.603173 0.795707 0.0550796
vn -0.0372568 0.998544 -0.0390228
vn 0.769422 0.535578 -0.34806
vn 0.228876 0.952469 -0.201046
vn 0.605361 0.704473 -0.370481
vn 0.823352 -0.563635 -0.0663806
vn 0.996951 -0.0770966 -0.012008
vn 0.941305 0.0527976 -0.333401
vn 0.895713 -0.282105 -0.343679
vn 0.721863 0.40346 -0.562258
vn 0.0962484 0.987597 -0.124048
vn 0.339598 0.863854 -0.372061
vn 0.440823 0.538472 -0.718139
vn 0.0161385 -0.756333 -0.653988
vn -0.636777 -0.713966 0.291149
vn 0.631401 -0.772932 0.0625233

g grp1
usemtl mtl1
f 1//1 2//2 19//19 
f 19//19 2//2 21//21 
f 2//2 3//3 21//21 
f 11//11 12//12 8//8 
f 8//8 12//12 4//4 
f 5//5 20//20 6//6 
f 5//5 1//1 19//19 
f 20//20 5//5 19//19 
f 7//7 5//5 6//6 
f 6//6 24//24 7//7 
f 4//4 72//72 8//8 
f 8//8 72//72 24//24 
f 40//40 9//9 4//4 
f 4//4 9//9 72//72 
f 11//11 18//18 12//12 
f 18//18 11//11 16//16 
f 12//12 18//18 15//15 
f 15//15 13//13 12//12 
f 13//13 39//39 12//12 
f 4//4 12//12 39//39 
f 14//14 15//15 18//18 
f 14//14 18//18 10//10 
f 15//15 14//14 25//25 
f 20//20 22//22 17//17 
f 22//22 16//16 17//17 
f 16//16 23//23 18//18 
f 18//18 23//23 10//10 
f 16//16 22//22 23//23 
f 20//20 19//19 21//21 
f 20//20 21//21 22//22 
f 27//27 22//22 21//21 
f 20//20 17//17 6//6 
f 24//24 6//6 17//17 
f 22//22 27//27 23//23 
f 29//29 10//10 23//23 
f 29//29 23//23 90//90 
f 3//3 27//27 21//21 
f 88//88 27//27 3//3 
f 88//88 90//90 27//27 
f 90//90 23//23 27//27 
f 11//11 8//8 16//16 
f 24//24 17//17 8//8 
f 16//16 8//8 17//17 
f 29//29 14//14 10//10 
f 29//29 25//25 14//14 
f 28//28 102//102 33//33 
f 25//25 29//29 31//31 
f 90//90 28//28 29//29 
f 29//29 30//30 31//31 
f 29//29 28//28 30//30 
f 30//30 37//37 31//31 
f 31//31 52//52 25//25 
f 26//26 25//25 52//52 
f 52//52 31//31 55//55 
f 30//30 28//28 32//32 
f 30//30 32//32 37//37 
f 31//31 37//37 35//35 
f 31//31 35//35 55//55 
f 28//28 33//33 32//32 
f 102//102 34//34 33//33 
f 34//34 187//187 33//33 
f 33//33 187//187 157//157 
f 55//55 35//35 36//36 
f 32//32 157//157 37//37 
f 37//37 157//157 38//38 
f 38//38 156//156 37//37 
f 35//35 37//37 156//156 
f 35//35 156//156 36//36 
f 32//32 33//33 157//157 
f 43//43 9//9 40//40 
f 39//39 13//13 45//45 
f 45//45 13//13 26//26 
f 26//26 13//13 15//15 
f 41//41 39//39 45//45 
f 45//45 26//26 53//53 
f 53//53 26//26 56//56 
f 4//4 39//39 40//40 
f 41//41 40//40 39//39 
f 41//41 42//42 40//40 
f 46//46 43//43 40//40 
f 42//42 46//46 40//40 
f 42//42 47//47 46//46 
f 44//44 43//43 46//46 
f 45//45 53//53 50//50 
f 45//45 42//42 41//41 
f 46//46 47//47 48//48 
f 45//45 49//49 42//42 
f 42//42 49//49 47//47 
f 49//49 45//45 50//50 
f 47//47 49//49 118//118 
f 49//49 50//50 118//118 
f 47//47 118//118 48//48 
f 48//48 118//118 51//51 
f 118//118 50//50 129//129 
f 26//26 52//52 56//56 
f 52//52 55//55 56//56 
f 53//53 56//56 54//54 
f 56//56 55//55 57//57 
f 54//54 56//56 57//57 
f 57//57 60//60 54//54 
f 59//59 54//54 60//60 
f 50//50 53//53 54//54 
f 54//54 58//58 50//50 
f 50//50 58//58 129//129 
f 59//59 58//58 54//54 
f 36//36 57//57 55//55 
f 59//59 60//60 61//61 
f 57//57 63//63 60//60 
f 36//36 63//63 57//57 
f 36//36 156//156 62//62 
f 63//63 36//36 62//62 
f 60//60 63//63 217//217 
f 60//60 217//217 61//61 
f 64//64 73//73 66//66 
f 66//66 65//65 64//64 
f 64//64 65//65 1//1 
f 65//65 2//2 1//1 
f 66//66 73//73 79//79 
f 68//68 65//65 66//66 
f 66//66 79//79 68//68 
f 70//70 68//68 79//79 
f 67//67 3//3 2//2 
f 2//2 65//65 67//67 
f 3//3 67//67 88//88 
f 68//68 69//69 65//65 
f 68//68 92//92 69//69 
f 68//68 70//70 92//92 
f 65//65 69//69 67//67 
f 89//89 67//67 69//69 
f 1//1 5//5 64//64 
f 64//64 5//5 71//71 
f 7//7 71//71 5//5 
f 73//73 64//64 71//71 
f 80//80 71//71 74//74 
f 7//7 74//74 71//71 
f 24//24 74//74 7//7 
f 113//113 72//72 9//9 
f 79//79 73//73 81//81 
f 71//71 81//81 73//73 
f 82//82 80//80 74//74 
f 74//74 24//24 75//75 
f 75//75 24//24 72//72 
f 72//72 113//113 75//75 
f 74//74 75//75 77//77 
f 77//77 82//82 74//74 
f 77//77 76//76 82//82 
f 77//77 75//75 78//78 
f 113//113 78//78 75//75 
f 86//86 76//76 77//77 
f 86//86 77//77 78//78 
f 81//81 83//83 79//79 
f 79//79 83//83 70//70 
f 85//85 70//70 83//83 
f 83//83 99//99 85//85 
f 80//80 81//81 71//71 
f 80//80 84//84 81//81 
f 81//81 84//84 83//83 
f 80//80 82//82 84//84 
f 76//76 84//84 82//82 
f 83//83 84//84 99//99 
f 92//92 70//70 85//85 
f 84//84 76//76 98//98 
f 98//98 99//99 84//84 
f 78//78 122//122 86//86 
f 87//87 86//86 122//122 
f 89//89 88//88 67//67 
f 94//94 88//88 89//89 
f 92//92 89//89 69//69 
f 95//95 89//89 92//92 
f 95//95 94//94 89//89 
f 90//90 88//88 91//91 
f 88//88 94//94 91//91 
f 96//96 95//95 92//92 
f 94//94 93//93 91//91 
f 93//93 102//102 91//91 
f 91//91 102//102 90//90 
f 90//90 102//102 28//28 
f 94//94 95//95 93//93 
f 103//103 93//93 95//95 
f 96//96 103//103 95//95 
f 111//111 103//103 96//96 
f 92//92 85//85 96//96 
f 97//97 85//85 99//99 
f 85//85 97//97 96//96 
f 96//96 97//97 111//111 
f 100//100 98//98 86//86 
f 76//76 86//86 98//98 
f 99//99 98//98 101//101 
f 98//98 100//100 101//101 
f 86//86 87//87 100//100 
f 101//101 97//97 99//99 
f 109//109 97//97 101//101 
f 101//101 100//100 109//109 
f 106//106 102//102 93//93 
f 102//102 106//106 34//34 
f 107//107 106//106 93//93 
f 93//93 103//103 107//107 
f 104//104 103//103 111//111 
f 104//104 107//107 103//103 
f 106//106 107//107 105//105 
f 186//186 105//105 107//107 
f 105//105 34//34 106//106 
f 34//34 105//105 187//187 
f 108//108 186//186 107//107 
f 107//107 104//104 108//108 
f 111//111 191//191 104//104 
f 97//97 109//109 111//111 
f 110//110 109//109 100//100 
f 136//136 110//110 100//100 
f 109//109 112//112 111//111 
f 111//111 112//112 191//191 
f 110//110 112//112 109//109 
f 110//110 192//192 112//112 
f 112//112 193//193 191//191 
f 112//112 192//192 193//193 
f 9//9 43//43 113//113 
f 113//113 43//43 114//114 
f 43//43 44//44 114//114 
f 78//78 113//113 115//115 
f 114//114 115//115 113//113 
f 115//115 116//116 78//78 
f 116//116 115//115 123//123 
f 114//114 123//123 115//115 
f 117//117 44//44 46//46 
f 46//46 48//48 117//117 
f 44//44 117//117 114//114 
f 117//117 119//119 114//114 
f 119//119 123//123 114//114 
f 51//51 120//120 48//48 
f 48//48 120//120 117//117 
f 119//119 117//117 120//120 
f 127//127 119//119 120//120 
f 116//116 122//122 78//78 
f 134//134 87//87 122//122 
f 116//116 134//134 122//122 
f 123//123 121//121 116//116 
f 116//116 137//137 134//134 
f 126//126 121//121 123//123 
f 119//119 126//126 123//123 
f 116//116 121//121 137//137 
f 137//137 121//121 124//124 
f 121//121 126//126 124//124 
f 125//125 137//137 124//124 
f 119//119 127//127 126//126 
f 128//128 126//126 127//127 
f 128//128 124//124 126//126 
f 128//128 125//125 124//124 
f 118//118 148//148 51//51 
f 120//120 51//51 148//148 
f 120//120 148//148 127//127 
f 148//148 152//152 127//127 
f 127//127 152//152 128//128 
f 151//151 150//150 133//133 
f 59//59 61//61 130//130 
f 129//129 58//58 131//131 
f 59//59 131//131 58//58 
f 131//131 149//149 129//129 
f 130//130 131//131 59//59 
f 153//153 131//131 130//130 
f 149//149 131//131 153//153 
f 150//150 153//153 132//132 
f 132//132 133//133 150//150 
f 141//141 153//153 130//130 
f 153//153 143//143 132//132 
f 133//133 132//132 143//143 
f 136//136 100//100 134//134 
f 87//87 134//134 100//100 
f 135//135 136//136 134//134 
f 135//135 145//145 136//136 
f 135//135 138//138 146//146 
f 134//134 137//137 135//135 
f 138//138 137//137 125//125 
f 151//151 125//125 128//128 
f 151//151 133//133 125//125 
f 137//137 138//138 135//135 
f 143//143 138//138 133//133 
f 133//133 138//138 125//125 
f 61//61 217//217 139//139 
f 139//139 217//217 140//140 
f 141//141 130//130 139//139 
f 130//130 61//61 139//139 
f 144//144 141//141 139//139 
f 143//143 141//141 142//142 
f 141//141 143//143 153//153 
f 141//141 144//144 142//142 
f 140//140 144//144 139//139 
f 142//142 144//144 221//221 
f 145//145 110//110 136//136 
f 135//135 146//146 145//145 
f 145//145 146//146 147//147 
f 221//221 147//147 146//146 
f 146//146 142//142 221//221 
f 192//192 110//110 145//145 
f 192//192 145//145 147//147 
f 138//138 142//142 146//146 
f 142//142 138//138 143//143 
f 148//148 118//118 129//129 
f 148//148 129//129 149//149 
f 149//149 150//150 148//148 
f 148//148 150//150 152//152 
f 152//152 150//150 151//151 
f 150//150 149//149 153//153 
f 128//128 152//152 151//151 
f 157//157 187//187 154//154 
f 188//188 154//154 187//187 
f 154//154 158//158 162//162 
f 154//154 155//155 158//158 
f 162//162 38//38 157//157 
f 157//157 154//154 162//162 
f 38//38 162//162 161//161 
f 161//161 156//156 38//38 
f 159//159 158//158 155//155 
f 155//155 196//196 159//159 
f 159//159 168//168 166//166 
f 159//159 196//196 168//168 
f 158//158 164//164 162//162 
f 158//158 160//160 164//164 
f 158//158 159//159 160//160 
f 156//156 161//161 163//163 
f 161//161 164//164 165//165 
f 160//160 167//167 164//164 
f 167//167 165//165 164//164 
f 164//164 161//161 162//162 
f 161//161 165//165 163//163 
f 163//163 165//165 182//182 
f 160//160 166//166 167//167 
f 170//170 168//168 196//196 
f 196//196 169//169 170//170 
f 166//166 168//168 170//170 
f 159//159 166//166 160//160 
f 166//166 170//170 171//171 
f 176//176 167//167 166//166 
f 166//166 171//171 176//176 
f 172//172 171//171 170//170 
f 172//172 170//170 169//169 
f 176//176 171//171 173//173 
f 171//171 172//172 173//173 
f 167//167 174//174 165//165 
f 174//174 167//167 175//175 
f 176//176 175//175 167//167 
f 177//177 175//175 176//176 
f 175//175 177//177 185//185 
f 177//177 176//176 178//178 
f 173//173 178//178 176//176 
f 172//172 207//207 173//173 
f 207//207 213//213 173//173 
f 213//213 178//178 173//173 
f 178//178 185//185 177//177 
f 213//213 216//216 178//178 
f 178//178 216//216 185//185 
f 63//63 62//62 179//179 
f 63//63 179//179 217//217 
f 62//62 180//180 179//179 
f 156//156 180//180 62//62 
f 179//179 180//180 181//181 
f 180//180 156//156 163//163 
f 182//182 180//180 163//163 
f 174//174 182//182 165//165 
f 181//181 180//180 182//182 
f 181//181 182//182 183//183 
f 174//174 183//183 182//182 
f 175//175 185//185 174//174 
f 183//183 174//174 185//185 
f 183//183 185//185 184//184 
f 216//216 184//184 185//185 
f 233//233 183//183 184//184 
f 105//105 186//186 188//188 
f 105//105 188//188 187//187 
f 186//186 108//108 190//190 
f 104//104 194//194 108//108 
f 189//189 188//188 186//186 
f 188//188 189//189 155//155 
f 186//186 190//190 189//189 
f 190//190 198//198 189//189 
f 197//197 190//190 108//108 
f 197//197 198//198 190//190 
f 108//108 194//194 201//201 
f 108//108 201//201 197//197 
f 194//194 202//202 201//201 
f 104//104 191//191 194//194 
f 192//192 219//219 193//193 
f 193//193 195//195 191//191 
f 191//191 195//195 194//194 
f 219//219 195//195 193//193 
f 194//194 195//195 202//202 
f 196//196 155//155 189//189 
f 198//198 196//196 189//189 
f 201//201 199//199 197//197 
f 206//206 200//200 198//198 
f 196//196 198//198 200//200 
f 198//198 197//197 206//206 
f 197//197 199//199 206//206 
f 204//204 201//201 202//202 
f 205//205 204//204 202//202 
f 205//205 202//202 195//195 
f 195//195 203//203 205//205 
f 205//205 210//210 204//204 
f 208//208 199//199 204//204 
f 201//201 204//204 199//199 
f 204//204 210//210 208//208 
f 169//169 196//196 200//200 
f 206//206 169//169 200//200 
f 206//206 199//199 209//209 
f 206//206 207//207 169//169 
f 172//172 169//169 207//207 
f 206//206 209//209 207//207 
f 199//199 208//208 209//209 
f 209//209 208//208 214//214 
f 211//211 214//214 210//210 
f 208//208 210//210 214//214 
f 215//215 207//207 209//209 
f 209//209 212//212 215//215 
f 212//212 237//237 213//213 
f 209//209 214//214 212//212 
f 211//211 212//212 214//214 
f 212//212 211//211 237//237 
f 215//215 213//213 207//207 
f 212//212 213//213 215//215 
f 216//216 213//213 237//237 
f 179//179 218//218 217//217 
f 192//192 147//147 219//219 
f 221//221 219//219 147//147 
f 217//217 220//220 140//140 
f 144//144 140//140 220//220 
f 220//220 221//221 144//144 
f 217//217 218//218 220//220 
f 221//221 220//220 222//222 
f 220//220 218//218 224//224 
f 224//224 222//222 220//220 
f 203//203 219//219 222//222 
f 221//221 222//222 219//219 
f 179//179 223//223 218//218 
f 223//223 179//179 181//181 
f 203//203 195//195 219//219 
f 225//225 203//203 222//222 
f 203//203 225//225 226//226 
f 218//218 223//223 224//224 
f 230//230 231//231 223//223 
f 222//222 224//224 225//225 
f 224//224 223//223 231//231 
f 224//224 231//231 225//225 
f 231//231 227//227 225//225 
f 203//203 226//226 205//205 
f 227//227 228//228 225//225 
f 228//228 227//227 229//229 
f 226//226 225//225 228//228 
f 183//183 230//230 181//181 
f 230//230 183//183 233//233 
f 233//233 232//232 230//230 
f 235//235 205//205 226//226 
f 205//205 235//235 210//210 
f 228//228 229//229 235//235 
f 227//227 232//232 229//229 
f 226//226 228//228 235//235 
f 235//235 229//229 236//236 
f 231//231 230//230 232//232 
f 231//231 232//232 227//227 
f 229//229 232//232 234//234 
f 233//233 234//234 232//232 
f 210//210 235//235 211//211 
f 211//211 235//235 236//236 
f 237//237 236//236 234//234 
f 229//229 234//234 236//236 
f 234//234 184//184 237//237 
f 216//216 237//237 184//184 
f 233//233 184//184 234//234 
f 237//237 211//211 236//236 
f 26//26 15//15 238//238 
f 15//15 25//25 238//238 
f 25//25 26//26 238//238 
f 188//188 155//155 239//239 
f 155//155 154//154 239//239 
f 154//154 188//188 239//239 
f 223//223 181//181 240//240 
f 181//181 230//230 240//240 
f 230//230 223//223 240//240 
