# PIPER geometrical reference model based on a manual segmentation. See the
# documentation for more info.
# Author: CEESAR, SOTON, UCBL-Ifsttar
# Version: 1.0.0
# License: Creative Commons Attribution 4.0 International License.
# (https://creativecommons.org/licenses/by/4.0/)
# 
# This work has received funding from the European Union Seventh Framework
# Program ([FP7/2007-2013]) under grant agreement 605544 [PIPER project]).
# Contributors include Pierre Maillez, Christophe Lecomte (SOTON), Erwan
# Jolivet (CEESAR), Philippe Beillas (UCBL-Ifsttar)
# This work is derived from a CT scan provided by CEESAR under a CCBY-4.0
# License
# 
# wavefront obj file written by the visualization toolkit

mtllib C:/desktop/registration_reference_model/22_REF_LTE635_Assembly_hands_corr/CCTu635_BPXXX_finger2_phalanx23_R.mtl

v 27.8694 254.894 -1029.61
v 34.6242 251.941 -1027.56
v 35.4894 253.189 -1027.63
v 35.5029 255.241 -1027.56
v 33.9245 255.448 -1027.21
v 32.3293 250.951 -1028.67
v 31.7264 250.083 -1029.67
v 33.3553 248.795 -1030.73
v 31.5155 249.698 -1031.52
v 33.6742 249.315 -1032.14
v 34.9987 249.819 -1028.72
v 36.1188 249.888 -1029.53
v 36.7808 251.311 -1028.28
v 35.0149 249.201 -1031.37
v 30.35 250.655 -1030.2
v 28.9241 254.794 -1028.62
v 30.1635 254.49 -1028.08
v 28.8849 252.884 -1029.15
v 28.9393 256.938 -1028.91
v 29.242 257.482 -1030.03
v 28.8107 255.891 -1030.9
v 28.7706 252.57 -1030.69
v 30.2483 251.259 -1031.44
v 28.2778 254.213 -1030.54
v 30.2135 255.486 -1032.7
v 30.8698 257.144 -1032.66
v 36.9938 251.919 -1028.54
v 36.5948 254.27 -1029.18
v 37.0856 250.789 -1030.17
v 36.9943 253.362 -1031.06
v 36.9494 255.684 -1030.89
v 36.4431 250.427 -1032.19
v 35.5049 250.075 -1033.2
v 33.9291 251.917 -1034.92
v 32.3621 252.731 -1034.17
v 31.1179 253.971 -1033.58
v 31.9893 256.213 -1035.85
v 33.3356 256.518 -1038.36
v 34.0329 253.589 -1037.41
v 37.0813 252.208 -1033.68
v 37.262 255.3 -1033.87
v 37.8309 256.029 -1036.89
v 35.9927 251.868 -1035.82
v 36.6572 252.742 -1039.34
v 37.1735 253.423 -1036.19
v 37.0894 253.138 -1038.2
v 35.2011 252.903 -1037.75
v 37.3629 252.816 -1040.24
v 38.5934 253.453 -1041.7
v 33.2443 254.638 -1037.36
v 39.2647 254.172 -1041.97
v 36.5211 253.412 -1042.21
v 38.2181 253.397 -1043.62
v 35.1859 254.046 -1040.62
v 34.6884 255.397 -1041.51
v 35.7549 254.785 -1044.85
v 34.8611 257.303 -1041.62
v 35.8619 257.75 -1026.94
v 35.1359 259.834 -1027.06
v 36.2587 259.514 -1027.7
v 30.5562 257.182 -1028.19
v 30.4567 258.841 -1029.1
v 33.9937 258.603 -1027.11
v 32.536 259.834 -1027.88
v 32.8778 260.699 -1029
v 31.7054 259.457 -1030.83
v 36.8285 257.748 -1028.08
v 34.888 260.967 -1028.06
v 34.5254 261.403 -1029.52
v 35.737 260.842 -1029.69
v 36.6528 259.483 -1030.46
v 37.0682 257.743 -1032.29
v 34.7279 260.794 -1031.47
v 33.2741 260.699 -1030.63
v 33.2586 258.332 -1035.64
v 35.603 260.207 -1033.6
v 33.9239 259.864 -1033.01
v 34.9742 259.698 -1035.9
v 36.9786 259.596 -1034.29
v 38.725 257.932 -1038.82
v 37.7351 258.649 -1036.11
v 36.1876 260.022 -1035.9
v 36.0783 260.376 -1038.39
v 37.3009 260.232 -1037.34
v 34.4763 258.375 -1039.66
v 38.2608 254.837 -1039.44
v 38.4928 260.283 -1038.52
v 37.872 261.307 -1039.57
v 36.6804 261.234 -1040.82
v 39.4619 261.371 -1040
v 39.58 262.017 -1041.39
v 34.7959 259.386 -1038.85
v 39.9786 260.06 -1040.43
v 41.3908 261.096 -1041.9
v 40.0487 257.737 -1041.5
v 41.6145 258.942 -1043.93
v 35.674 255.887 -1044.73
v 37.9796 254.045 -1045.96
v 36.7751 255.447 -1047.25
v 38.0784 254.221 -1047.65
v 40.9914 253.387 -1048.22
v 37.1726 256.024 -1048.39
v 38.4461 254.874 -1048.58
v 40.5409 253.799 -1046.22
v 42.5416 254.107 -1046.49
v 40.8441 253.877 -1045.1
v 41.7497 255.687 -1044.96
v 41.1035 257.117 -1044.04
v 42.9258 253.902 -1047.74
v 43.8357 255.037 -1046.88
v 44.5134 255.525 -1048.54
v 45.549 257.351 -1049.75
v 41.1751 255.623 -1049.52
v 43.5462 255.449 -1049.68
v 36.1294 260.339 -1043.84
v 36.9214 257.745 -1047.91
v 38.0309 262.121 -1043.02
v 37.267 261.677 -1045.09
v 37.5259 260.825 -1047.21
v 39.0708 259.291 -1049.1
v 42.9059 259.813 -1045.29
v 40.9924 262.132 -1044.05
v 41.8135 261.2 -1043.79
v 44.3831 260.469 -1046.79
v 43.2383 261.537 -1045.58
v 40.3934 261.265 -1049.09
v 44.2233 256.121 -1047.06
v 45.1846 258.797 -1048.21
v 45.4098 260.847 -1048.8
v 39.2718 262.377 -1044.93
v 40.6925 262.545 -1045.88
v 42.1036 261.96 -1045.14
v 39.0666 262.153 -1046.91
v 41.8549 263.02 -1046.78
v 43.893 262.146 -1047
v 44.1344 261.833 -1050.07
v 40.5383 257.441 -1050.04
v 41.6819 258.444 -1051.69
v 42.3515 256.961 -1051.08
v 42.5068 261.782 -1050.01
v 43.0847 257.887 -1053.12
v 44.0797 256.923 -1052.41
v 40.5076 259.45 -1050.25
v 41.9813 260.664 -1051.57
v 45.266 256.506 -1051.18
v 44.9117 261.657 -1049.28
v 46.5284 260.328 -1051.31
v 46.1325 257.176 -1052.7
v 47.0028 258.996 -1052.82
v 45.685 256.951 -1054.09
v 43.7751 261.756 -1052.59
v 46.2098 261.801 -1051.24
v 46.7771 263.18 -1052.85
v 45.8769 263.096 -1052.94
v 45.1116 262.533 -1053.75
v 47.86 263.087 -1053.82
v 43.3368 260.349 -1054.09
v 45.6238 257.151 -1056.93
v 44.5475 257.787 -1055.32
v 46.6899 257.301 -1057.66
v 47.435 257.239 -1056.08
v 48.3224 258.708 -1055.8
v 44.1736 259.434 -1055.86
v 44.8807 261.442 -1056.02
v 48.4827 261.42 -1054.56
v 49.5276 260.723 -1056.48
v 49.2534 262.298 -1056.13
v 45.201 257.91 -1057.8
v 45.4347 259.763 -1058.44
v 46.0652 258.049 -1059.3
v 48.3171 258.358 -1058.16
v 47.9841 259.201 -1059.96
v 49.4641 259.589 -1057.9
v 49.6421 261.244 -1058
v 47.0543 263.812 -1054.83
v 46.0856 263.285 -1055.98
v 48.3213 263.513 -1056.66
v 46.3658 262.13 -1058.64
v 46.8404 263.834 -1057.61
v 49.1401 262.738 -1057.96
v 47.678 263.157 -1058.72
v 46.7086 260.227 -1060.01
v 48.0098 261.859 -1060.19
v 48.1295 260.125 -1060.46
v 28.5021 254.918 -1030.69
v 40.3014 258.827 -1050.02
v 37.6585 261.899 -1043.71
v 45.6659 257.597 -1057.58
v 45.7561 262.782 -1055.99
vn -0.985247 0.045924 0.164861
vn -0.00331546 -0.291883 0.956448
vn 0.446131 0.00941992 0.894918
vn 0.505536 -0.174039 0.84507
vn -0.0530611 -0.0976895 0.993801
vn -0.313429 -0.501333 0.80649
vn -0.416079 -0.712541 0.564946
vn -0.123796 -0.987035 0.102162
vn -0.54812 -0.768413 -0.330311
vn -0.113319 -0.856052 -0.504316
vn 0.100801 -0.759183 0.643025
vn 0.528419 -0.811982 0.247908
vn 0.649425 -0.337333 0.681509
vn 0.353019 -0.927852 -0.12028
vn -0.654707 -0.715308 0.244322
vn -0.549803 -0.0443416 0.834117
vn -0.333108 -0.12358 0.934755
vn -0.678684 -0.449543 0.580774
vn -0.744156 0.404738 0.531431
vn -0.783535 0.580228 -0.222282
vn -0.806954 0.306244 -0.505015
vn -0.850232 -0.442161 -0.285657
vn -0.694382 -0.50987 -0.507805
vn -0.875201 -0.0893298 -0.47544
vn -0.794947 0.108706 -0.59686
vn -0.753509 0.475017 -0.454514
vn 0.890733 0.0706527 0.449002
vn 0.925775 0.0290097 0.376962
vn 0.91013 -0.412319 0.0407086
vn 0.995581 0.0393868 0.08525
vn 0.993599 -0.0209929 0.111
vn 0.720585 -0.660223 -0.211809
vn 0.345536 -0.830651 -0.436604
vn -0.432832 -0.68321 -0.588116
vn -0.639876 -0.476144 -0.603196
vn -0.750381 -0.265971 -0.605135
vn -0.866238 0.160426 -0.473175
vn -0.920426 0.1255 -0.370225
vn -0.649559 -0.630812 -0.424439
vn 0.940143 -0.311969 -0.137138
vn 0.992806 -0.0523081 0.107699
vn 0.963895 -0.12884 0.233038
vn 0.315169 -0.865311 -0.389751
vn 0.0240401 -0.996904 -0.0748647
vn 0.919609 -0.391417 0.0333634
vn 0.777498 -0.626315 0.0568105
vn -0.460782 -0.819388 -0.341002
vn 0.368632 -0.928118 0.0520389
vn 0.600264 -0.768181 0.222669
vn -0.815947 -0.364408 -0.448818
vn 0.800768 -0.402111 0.443933
vn -0.408069 -0.881415 -0.23788
vn -0.0116816 -0.989228 -0.145918
vn -0.722897 -0.626652 -0.29108
vn -0.926008 -0.207393 -0.315433
vn -0.790178 -0.490083 -0.368019
vn -0.934408 0.146382 -0.324736
vn 0.413052 -0.0506234 0.9093
vn 0.146666 0.431586 0.890069
vn 0.768536 0.412375 0.489183
vn -0.413796 0.216448 0.884264
vn -0.68466 0.669066 0.289121
vn -0.221319 0.090673 0.970977
vn -0.447935 0.526735 0.72243
vn -0.483456 0.856137 0.182483
vn -0.619802 0.723988 -0.3028
vn 0.922848 0.00886862 0.385063
vn 0.162449 0.845012 0.509475
vn 0.0105316 0.999935 0.00433299
vn 0.62227 0.781754 0.0405111
vn 0.930041 0.356301 0.0898477
vn 0.990836 0.0781064 0.110197
vn -0.0249392 0.956469 -0.290767
vn -0.444238 0.853616 -0.272014
vn -0.727526 0.618187 -0.297574
vn 0.0538593 0.984102 -0.169241
vn -0.418151 0.847068 -0.328064
vn -0.462379 0.882478 -0.0862436
vn 0.750806 0.649556 0.11986
vn 0.905751 -0.105632 0.410435
vn 0.943411 0.181009 0.277871
vn -0.039176 0.994542 0.0967068
vn -0.412383 0.896552 0.161665
vn 0.310509 0.865646 0.392735
vn -0.898157 0.353939 -0.260846
vn 0.887204 -0.336776 0.315359
vn 0.677126 0.4427 0.587807
vn -0.0625923 0.912568 0.404105
vn -0.515807 0.850029 0.106739
vn 0.48692 0.61128 0.623895
vn 0.190237 0.937098 0.292673
vn -0.767834 0.631915 -0.105424
vn 0.793756 -0.0698542 0.604211
vn 0.838696 0.30263 0.452773
vn 0.86305 -0.239924 0.444501
vn 0.838856 -0.22367 0.496278
vn -0.943674 0.0420239 -0.328197
vn -0.349479 -0.910331 -0.221723
vn -0.808801 -0.408852 -0.422707
vn -0.517681 -0.769156 -0.374706
vn -0.00319433 -0.922704 -0.385496
vn -0.65716 -0.201703 -0.726262
vn -0.401867 -0.453339 -0.795604
vn 0.0664719 -0.994549 0.0803341
vn 0.456113 -0.762328 0.459149
vn 0.49227 -0.81803 0.297485
vn 0.703534 -0.232509 0.67155
vn 0.80131 -0.177637 0.571269
vn 0.474372 -0.877612 -0.069055
vn 0.753492 -0.449498 0.479793
vn 0.7884 -0.61503 0.0127882
vn 0.916389 -0.301159 0.263693
vn -0.214052 -0.486128 -0.847267
vn 0.163674 -0.82941 -0.534126
vn -0.892863 0.391388 -0.222737
vn -0.80564 0.148472 -0.573499
vn -0.295771 0.952686 0.0700606
vn -0.634264 0.750688 -0.184871
vn -0.708707 0.482803 -0.514428
vn -0.575508 0.197893 -0.793491
vn 0.726896 -0.0392235 0.685627
vn 0.364019 0.897893 0.247543
vn 0.862536 0.333745 0.380324
vn 0.813968 0.0963272 0.572868
vn 0.602269 0.34351 0.720606
vn -0.52635 0.594605 -0.607783
vn 0.826476 -0.181352 0.532963
vn 0.894699 -0.0709703 0.440996
vn 0.863419 0.295377 0.408975
vn -0.144177 0.989407 0.0169129
vn -0.0648622 0.9786 0.195282
vn 0.508453 0.687375 0.518644
vn -0.391597 0.861763 -0.322516
vn 0.0533866 0.995684 0.0759155
vn 0.635343 0.709844 0.304075
vn 0.0461756 0.998897 0.00853572
vn -0.564039 -0.229482 -0.79322
vn -0.75055 -0.328012 -0.573658
vn -0.45587 -0.642695 -0.615731
vn -0.265786 0.8989 -0.348334
vn -0.638028 -0.602823 -0.479087
vn -0.283189 -0.883674 -0.372726
vn -0.738328 0.143493 -0.659
vn -0.682275 0.578002 -0.447677
vn 0.528846 -0.84296 -0.0986921
vn 0.479952 0.856493 0.189909
vn 0.899584 -0.00284591 0.43674
vn 0.727425 -0.670292 0.146839
vn 0.881201 -0.270012 0.388045
vn -0.0311303 -0.994771 -0.0972682
vn -0.589148 0.781745 -0.204399
vn 0.630932 0.540653 0.556435
vn 0.237282 0.80245 0.547513
vn -0.314835 0.910983 0.266437
vn -0.639791 0.758353 -0.124773
vn 0.704647 0.54782 0.45096
vn -0.785067 0.420986 -0.454357
vn -0.339272 -0.907694 -0.246953
vn -0.715655 -0.631085 -0.299283
vn 0.126701 -0.934652 -0.332224
vn 0.540272 -0.84057 0.0393451
vn 0.842123 -0.449066 0.298612
vn -0.888542 -0.00939979 -0.458698
vn -0.828253 0.440043 -0.346928
vn 0.868497 -0.0518103 0.492979
vn 0.943027 -0.13062 0.306004
vn 0.897702 0.354206 0.26205
vn -0.750394 -0.497756 -0.434911
vn -0.854797 0.125823 -0.503479
vn -0.38195 -0.593342 -0.708561
vn 0.631177 -0.734579 -0.249016
vn 0.345533 -0.561482 -0.751894
vn 0.904468 -0.40546 -0.132436
vn 0.964515 0.105402 -0.242077
vn 0.00550466 0.989139 0.146882
vn -0.701725 0.70313 -0.114848
vn 0.522844 0.852405 0.00629097
vn -0.716078 0.444524 -0.538174
vn -0.337223 0.881309 -0.331021
vn 0.754043 0.601403 -0.264073
vn 0.0233891 0.808088 -0.588597
vn -0.542366 0.0537382 -0.838422
vn 0.163698 0.466933 -0.869009
vn 0.331887 -0.166066 -0.928587
vn -0.815883 0.137612 -0.561603
vn -0.616039 -0.0943262 -0.782048
vn -0.532654 0.846204 0.0148212
vn -0.26985 -0.786571 -0.555417
vn -0.808939 0.534563 -0.244664

g grp1
usemtl mtl1
f 1//1 24//24 22//22 
f 2//2 5//5 17//17 
f 63//63 17//17 5//5 
f 13//13 3//3 2//2 
f 2//2 3//3 5//5 
f 3//3 4//4 5//5 
f 5//5 4//4 58//58 
f 15//15 8//8 7//7 
f 6//6 7//7 11//11 
f 8//8 11//11 7//7 
f 15//15 9//9 8//8 
f 9//9 10//10 8//8 
f 15//15 23//23 9//9 
f 35//35 9//9 23//23 
f 35//35 34//34 9//9 
f 34//34 10//10 9//9 
f 2//2 6//6 11//11 
f 11//11 13//13 2//2 
f 13//13 11//11 12//12 
f 13//13 12//12 29//29 
f 13//13 29//29 27//27 
f 11//11 8//8 14//14 
f 14//14 8//8 10//10 
f 11//11 14//14 12//12 
f 12//12 14//14 32//32 
f 14//14 10//10 33//33 
f 32//32 14//14 33//33 
f 12//12 32//32 29//29 
f 29//29 32//32 40//40 
f 6//6 15//15 7//7 
f 17//17 18//18 6//6 
f 6//6 18//18 15//15 
f 17//17 16//16 18//18 
f 22//22 15//15 18//18 
f 16//16 1//1 18//18 
f 18//18 1//1 22//22 
f 2//2 17//17 6//6 
f 17//17 61//61 16//16 
f 19//19 1//1 16//16 
f 16//16 61//61 19//19 
f 19//19 20//20 1//1 
f 1//1 20//20 21//21 
f 17//17 63//63 61//61 
f 15//15 22//22 23//23 
f 36//36 22//22 24//24 
f 23//23 22//22 35//35 
f 22//22 36//36 35//35 
f 25//25 21//21 26//26 
f 26//26 21//21 20//20 
f 24//24 25//25 36//36 
f 13//13 27//27 3//3 
f 3//3 27//27 28//28 
f 27//27 30//30 28//28 
f 28//28 4//4 3//3 
f 4//4 28//28 58//58 
f 28//28 67//67 58//58 
f 67//67 28//28 31//31 
f 27//27 29//29 30//30 
f 29//29 40//40 30//30 
f 28//28 30//30 31//31 
f 43//43 33//33 10//10 
f 43//43 32//32 33//33 
f 39//39 34//34 35//35 
f 36//36 50//50 35//35 
f 25//25 37//37 36//36 
f 26//26 37//37 25//25 
f 36//36 37//37 50//50 
f 35//35 50//50 39//39 
f 37//37 38//38 50//50 
f 10//10 34//34 43//43 
f 30//30 40//40 41//41 
f 43//43 40//40 32//32 
f 40//40 43//43 45//45 
f 45//45 41//41 40//40 
f 31//31 30//30 41//41 
f 41//41 72//72 31//31 
f 47//47 34//34 39//39 
f 43//43 34//34 47//47 
f 43//43 47//47 44//44 
f 45//45 43//43 46//46 
f 44//44 46//46 43//43 
f 45//45 46//46 86//86 
f 41//41 45//45 42//42 
f 45//45 86//86 42//42 
f 47//47 39//39 54//54 
f 47//47 52//52 44//44 
f 47//47 54//54 52//52 
f 46//46 44//44 48//48 
f 48//48 86//86 46//46 
f 48//48 44//44 52//52 
f 49//49 86//86 48//48 
f 86//86 49//49 51//51 
f 39//39 50//50 54//54 
f 50//50 55//55 54//54 
f 50//50 38//38 55//55 
f 57//57 55//55 38//38 
f 86//86 51//51 95//95 
f 56//56 52//52 54//54 
f 48//48 52//52 53//53 
f 49//49 48//48 53//53 
f 97//97 56//56 55//55 
f 54//54 55//55 56//56 
f 55//55 57//57 97//97 
f 115//115 97//97 57//57 
f 49//49 53//53 106//106 
f 106//106 51//51 49//49 
f 51//51 106//106 107//107 
f 107//107 108//108 51//51 
f 51//51 108//108 95//95 
f 58//58 63//63 5//5 
f 58//58 59//59 63//63 
f 60//60 59//59 58//58 
f 67//67 60//60 58//58 
f 63//63 59//59 64//64 
f 59//59 68//68 64//64 
f 59//59 60//60 68//68 
f 19//19 61//61 62//62 
f 64//64 62//62 61//61 
f 19//19 62//62 20//20 
f 66//66 20//20 62//62 
f 64//64 61//61 63//63 
f 64//64 65//65 62//62 
f 62//62 65//65 66//66 
f 65//65 74//74 66//66 
f 26//26 20//20 66//66 
f 67//67 71//71 60//60 
f 31//31 72//72 67//67 
f 67//67 72//72 71//71 
f 68//68 60//60 70//70 
f 60//60 71//71 70//70 
f 64//64 68//68 65//65 
f 68//68 69//69 65//65 
f 65//65 69//69 74//74 
f 68//68 70//70 69//69 
f 71//71 72//72 79//79 
f 73//73 74//74 69//69 
f 70//70 73//73 69//69 
f 73//73 77//77 74//74 
f 70//70 76//76 73//73 
f 71//71 79//79 70//70 
f 26//26 75//75 37//37 
f 26//26 66//66 75//75 
f 77//77 66//66 74//74 
f 37//37 75//75 38//38 
f 66//66 77//77 75//75 
f 75//75 85//85 38//38 
f 75//75 92//92 85//85 
f 42//42 81//81 41//41 
f 72//72 41//41 81//81 
f 72//72 81//81 79//79 
f 73//73 76//76 77//77 
f 76//76 78//78 77//77 
f 82//82 78//78 76//76 
f 70//70 79//79 76//76 
f 82//82 76//76 79//79 
f 77//77 78//78 75//75 
f 92//92 75//75 78//78 
f 81//81 42//42 80//80 
f 83//83 78//78 82//82 
f 78//78 83//83 92//92 
f 82//82 79//79 84//84 
f 82//82 84//84 83//83 
f 88//88 83//83 84//84 
f 84//84 87//87 88//88 
f 79//79 81//81 84//84 
f 80//80 87//87 81//81 
f 84//84 81//81 87//87 
f 57//57 38//38 85//85 
f 92//92 115//115 85//85 
f 80//80 42//42 86//86 
f 86//86 95//95 80//80 
f 83//83 89//89 92//92 
f 87//87 80//80 93//93 
f 93//93 90//90 87//87 
f 88//88 89//89 83//83 
f 90//90 88//88 87//87 
f 88//88 117//117 89//89 
f 91//91 117//117 88//88 
f 88//88 90//90 91//91 
f 85//85 115//115 57//57 
f 118//118 92//92 89//89 
f 92//92 118//118 115//115 
f 80//80 95//95 93//93 
f 90//90 93//93 94//94 
f 94//94 91//91 90//90 
f 93//93 95//95 94//94 
f 91//91 94//94 122//122 
f 95//95 96//96 94//94 
f 123//123 122//122 94//94 
f 91//91 130//130 117//117 
f 91//91 122//122 130//130 
f 97//97 99//99 56//56 
f 56//56 98//98 52//52 
f 52//52 98//98 53//53 
f 56//56 99//99 98//98 
f 99//99 100//100 98//98 
f 101//101 98//98 100//100 
f 97//97 116//116 99//99 
f 99//99 103//103 100//100 
f 99//99 102//102 103//103 
f 100//100 103//103 101//101 
f 102//102 99//99 116//116 
f 104//104 106//106 53//53 
f 98//98 104//104 53//53 
f 106//106 104//104 105//105 
f 107//107 106//106 105//105 
f 105//105 110//110 107//107 
f 107//107 110//110 121//121 
f 98//98 101//101 104//104 
f 101//101 109//109 104//104 
f 109//109 105//105 104//104 
f 114//114 109//109 101//101 
f 103//103 113//113 101//101 
f 109//109 110//110 105//105 
f 109//109 111//111 110//110 
f 110//110 111//111 127//127 
f 113//113 114//114 101//101 
f 109//109 114//114 111//111 
f 111//111 114//114 145//145 
f 127//127 111//111 112//112 
f 137//137 113//113 103//103 
f 139//139 114//114 113//113 
f 142//142 114//114 139//139 
f 114//114 142//142 145//145 
f 111//111 145//145 112//112 
f 115//115 116//116 97//97 
f 117//117 130//130 118//118 
f 130//130 133//133 118//118 
f 115//115 119//119 116//116 
f 102//102 120//120 103//103 
f 116//116 120//120 102//102 
f 118//118 119//119 115//115 
f 133//133 119//119 118//118 
f 120//120 116//116 119//119 
f 95//95 108//108 96//96 
f 107//107 121//121 108//108 
f 96//96 108//108 121//121 
f 110//110 127//127 121//121 
f 132//132 122//122 123//123 
f 94//94 96//96 123//123 
f 96//96 121//121 123//123 
f 121//121 132//132 123//123 
f 124//124 121//121 127//127 
f 125//125 132//132 121//121 
f 124//124 125//125 121//121 
f 125//125 124//124 135//135 
f 119//119 126//126 120//120 
f 119//119 133//133 126//126 
f 133//133 140//140 126//126 
f 135//135 146//146 136//136 
f 112//112 128//128 127//127 
f 127//127 128//128 124//124 
f 124//124 128//128 129//129 
f 135//135 124//124 129//129 
f 147//147 129//129 128//128 
f 135//135 129//129 146//146 
f 131//131 130//130 122//122 
f 131//131 133//133 130//130 
f 122//122 132//132 131//131 
f 131//131 132//132 134//134 
f 125//125 135//135 132//132 
f 132//132 135//135 134//134 
f 134//134 133//133 131//131 
f 140//140 133//133 134//134 
f 134//134 136//136 140//140 
f 134//134 135//135 136//136 
f 137//137 103//103 120//120 
f 137//137 143//143 138//138 
f 139//139 113//113 137//137 
f 137//137 138//138 139//139 
f 126//126 143//143 120//120 
f 126//126 144//144 143//143 
f 126//126 140//140 144//144 
f 136//136 151//151 140//140 
f 139//139 138//138 141//141 
f 139//139 141//141 142//142 
f 163//163 141//141 138//138 
f 143//143 163//163 138//138 
f 159//159 142//142 141//141 
f 141//141 163//163 159//159 
f 157//157 143//143 144//144 
f 151//151 144//144 140//140 
f 157//157 163//163 143//143 
f 144//144 151//151 157//157 
f 112//112 147//147 128//128 
f 112//112 145//145 148//148 
f 112//112 148//148 149//149 
f 112//112 149//149 147//147 
f 152//152 146//146 129//129 
f 152//152 136//136 146//146 
f 129//129 147//147 152//152 
f 145//145 142//142 150//150 
f 148//148 145//145 150//150 
f 149//149 148//148 162//162 
f 165//165 149//149 162//162 
f 147//147 149//149 165//165 
f 154//154 151//151 136//136 
f 152//152 154//154 136//136 
f 151//151 154//154 155//155 
f 152//152 147//147 156//156 
f 153//153 154//154 152//152 
f 156//156 153//153 152//152 
f 175//175 154//154 153//153 
f 147//147 165//165 156//156 
f 153//153 156//156 175//175 
f 151//151 164//164 157//157 
f 142//142 159//159 150//150 
f 150//150 159//159 158//158 
f 150//150 158//158 161//161 
f 150//150 161//161 148//148 
f 159//159 168//168 158//158 
f 161//161 158//158 160//160 
f 159//159 163//163 168//168 
f 148//148 161//161 162//162 
f 157//157 164//164 163//163 
f 165//165 162//162 166//166 
f 163//163 169//169 168//168 
f 170//170 160//160 168//168 
f 172//172 160//160 170//170 
f 169//169 170//170 168//168 
f 161//161 160//160 171//171 
f 161//161 171//171 162//162 
f 162//162 171//171 173//173 
f 172//172 171//171 160//160 
f 172//172 173//173 171//171 
f 163//163 164//164 169//169 
f 164//164 178//178 169//169 
f 182//182 170//170 169//169 
f 169//169 178//178 182//182 
f 162//162 173//173 166//166 
f 166//166 173//173 174//174 
f 167//167 166//166 174//174 
f 173//173 172//172 184//184 
f 174//174 173//173 184//184 
f 184//184 183//183 174//174 
f 151//151 155//155 164//164 
f 155//155 154//154 176//176 
f 154//154 175//175 176//176 
f 179//179 176//176 175//175 
f 166//166 167//167 165//165 
f 165//165 167//167 156//156 
f 156//156 167//167 177//177 
f 156//156 177//177 175//175 
f 179//179 175//175 177//177 
f 177//177 167//167 180//180 
f 176//176 179//179 178//178 
f 181//181 178//178 179//179 
f 167//167 174//174 180//180 
f 177//177 181//181 179//179 
f 177//177 180//180 181//181 
f 180//180 183//183 181//181 
f 174//174 183//183 180//180 
f 170//170 182//182 172//172 
f 178//178 183//183 182//182 
f 182//182 184//184 172//172 
f 182//182 183//183 184//184 
f 183//183 178//178 181//181 
f 24//24 185//185 25//25 
f 185//185 21//21 25//25 
f 21//21 185//185 1//1 
f 185//185 24//24 1//1 
f 137//137 120//120 186//186 
f 120//120 143//143 186//186 
f 143//143 137//137 186//186 
f 89//89 117//117 187//187 
f 117//117 118//118 187//187 
f 118//118 89//89 187//187 
f 158//158 168//168 188//188 
f 168//168 160//160 188//188 
f 160//160 158//158 188//188 
f 164//164 189//189 178//178 
f 189//189 176//176 178//178 
f 176//176 189//189 155//155 
f 189//189 164//164 155//155 
