# PIPER geometrical reference model based on a manual segmentation. See the
# documentation for more info.
# Author: CEESAR, SOTON, UCBL-Ifsttar
# Version: 1.0.0
# License: Creative Commons Attribution 4.0 International License.
# (https://creativecommons.org/licenses/by/4.0/)
# 
# This work has received funding from the European Union Seventh Framework
# Program ([FP7/2007-2013]) under grant agreement 605544 [PIPER project]).
# Contributors include Pierre Maillez, Christophe Lecomte (SOTON), Erwan
# Jolivet (CEESAR), Philippe Beillas (UCBL-Ifsttar)
# This work is derived from a CT scan provided by CEESAR under a CCBY-4.0
# License
# 
# wavefront obj file written by the visualization toolkit

mtllib C:/desktop/registration_reference_model/22_REF_LTE635_Assembly_hands_corr/CCTs635_BP040_Thoracic_T04.mtl

v 24.651 104.259 -456.833
v 33.578 65.147 -470.506
v 50.981 120.36 -449.596
v 44.567 127.955 -450.304
v 45.308 127.405 -452.717
v 33.674 65.115 -466.671
v 46.586 126.295 -450.997
v 41.081 130.189 -449.943
v 35.66 65.683 -466.697
v 41.215 128.099 -448.836
v 35.704 65.29 -463.806
v 47.08 100.946 -460.02
v 37.186 67.283 -465.221
v 47.155 124.575 -449.618
v 32.132 66.169 -469.325
v 49.793 119.439 -447.944
v 45.391 125.037 -448.918
v 47.391 120.854 -464.972
v 47.872 124.475 -451.872
v 49.339 122.832 -450.115
v 40.973 126.052 -448.068
v 33.499 68.006 -470.899
v 53.126 100.978 -434.938
v 51.394 103.095 -435.086
v 53.912 99.947 -436.896
v 52.277 98.91 -435.785
v 50.707 100.469 -434.737
v 31.946 68.234 -468.259
v 48.811 105.008 -441.052
v 30.386 120.631 -446.41
v 51.937 102.64 -438.92
v 50.787 103.734 -440.579
v 32.042 66.401 -466.143
v 53.145 102.099 -437.104
v 53.529 99.37 -440.728
v 49.241 102.056 -434.968
v 47.609 101.826 -436.142
v 48.505 100.225 -435.38
v 50.437 103.372 -438.579
v 48.7 102.872 -437.516
v 44.816 98.347 -436.12
v 48.49 103.508 -439.849
v 33.633 69.913 -468.528
v 46.377 100.849 -440.031
v 35.674 68.809 -468.572
v 44.49 98.911 -438.497
v 50.14 115.582 -446.971
v 39.751 85.505 -443.949
v 51.151 115.815 -448.789
v 50.412 119.992 -451.427
v 51.306 114.264 -450.516
v 51.893 111.351 -447.192
v 32.954 71.94 -465.981
v 46.352 100.169 -435.279
v 35.318 72.714 -465.925
v 47.816 117.494 -446.725
v 41.875 116.867 -445.81
v 31.637 70.3 -465.247
v 48.644 112.935 -445.042
v 32.861 65.917 -463.217
v 46.017 115.332 -445.74
v 42.295 112.195 -443.864
v 31.406 68.471 -464.442
v 50.61 109.256 -444.279
v 48.979 107.625 -442.364
v 50.752 105.264 -442.626
v 32.402 68.084 -461.523
v 51.198 104.747 -444.264
v 51.53 102.373 -442.558
v 37.237 67.714 -462.477
v 52.295 99.705 -444.2
v 51.109 100.872 -446.598
v 51.95 109.145 -448.606
v 37.56 70.137 -462.891
v 50.836 108.867 -452.952
v 50.963 102.842 -448.104
v 34.037 68.923 -459.297
v 50.032 100.095 -449.305
v 46.698 110.244 -443.364
v 46.182 108.402 -442.854
v 42.51 109.852 -443.75
v 45.256 106.149 -443.389
v 47.108 104.504 -441.655
v 44.418 104.633 -445.394
v 41.264 108.695 -444.726
v 43.485 107 -444.63
v 36.632 68.938 -459.976
v 40.577 107.622 -446.791
v 32.419 73.516 -462.359
v 45.588 103.426 -443.598
v 32.607 71.449 -460.247
v 33.874 75.067 -463.92
v 45.598 101.04 -443.292
v 45.16 99.85 -447.238
v 33.674 72.218 -457.951
v 44.722 98.689 -444.6
v 37.076 71.894 -464.664
v 42.883 106.146 -446.6
v 37.446 73.415 -461.489
v 39.421 106.916 -450.591
v 44.852 101.534 -447.763
v 46.035 99.396 -449.412
v 49.812 102.411 -452.21
v 44.103 103.136 -449.317
v 48.222 99.162 -450.577
v 48.199 100.771 -452.688
v 45.906 100.938 -451.353
v 42.844 104.629 -450.27
v 27.612 91.602 -456.247
v 39.198 131.308 -452.052
v 36.814 131.088 -452.377
v 38.416 122.335 -446.686
v 35.894 70.472 -458.022
v 35.185 123.629 -446.782
v 32.27 124.164 -447.463
v 32.375 122.129 -446.369
v 28.748 118.699 -446.781
v 37.858 129.53 -449.07
v 37.815 131.258 -450.335
v 36.314 126.088 -447.537
v 35.158 72.269 -456.594
v 37.29 72.044 -458.582
v 35.747 128.355 -448.723
v 33.783 128.556 -450.362
v 35.625 130.439 -450.106
v 34.909 129.377 -452.511
v 37.628 74.764 -458.082
v 33.557 126.722 -448.735
v 32.738 126.19 -450.779
v 30.399 122.687 -448.018
v 28.996 119.894 -448.705
v 32.763 124.95 -452.698
v 31.229 123.895 -449.583
v 28.799 108.174 -440.956
v 34.564 74.545 -454.957
v 36.89 74.235 -455.412
v 35.91 115.345 -444.446
v 29.625 105.019 -434.767
v 30.331 103.267 -433.14
v 32.641 100.271 -435.396
v 30.161 105.395 -438.323
v 31.298 107.167 -440.664
v 28.755 105.81 -438.579
v 31.622 104.568 -440.006
v 32.06 105.053 -442.322
v 31.882 103.355 -436.498
v 31.777 103.499 -438.314
v 27.455 104.447 -433.056
v 27.916 105.129 -436.085
v 27.077 101.76 -434.149
v 25.684 101.111 -435.927
v 26.364 103.3 -435.794
v 27.327 99.341 -435.531
v 24.781 99.393 -435.979
v 27.134 104.682 -439.098
v 22.466 99.089 -436.248
v 32.392 77.653 -460.964
v 25.557 102.282 -438.406
v 24.039 100.787 -438.27
v 22.078 99.681 -438.114
v 18.234 98.529 -438.592
v 52.238 91.198 -453.549
v 37.834 118.005 -445.638
v 32.829 119.784 -445.646
v 31.14 115.503 -444.033
v 30.729 118.441 -445.193
v 38.488 113.476 -443.823
v 37.485 111.755 -443.327
v 36.339 108.274 -445.559
v 34.933 77.089 -463.116
v 37.208 109.691 -444.005
v 29.338 113.865 -443.42
v 30.675 110.018 -441.482
v 35.892 79.091 -462.104
v 37.355 77.287 -461.346
v 33.13 80.714 -461.085
v 27.116 114.516 -445.374
v 27.702 111.464 -443.221
v 27.206 115.918 -447.268
v 26.024 110.501 -447.583
v 27.203 114.59 -452.028
v 26.106 111.482 -451.852
v 33.614 107.767 -443.261
v 38.734 108.296 -446.289
v 34.119 106.992 -445.387
v 33.893 110.087 -442.342
v 32.108 104.593 -444.391
v 31.66 103.559 -446.303
v 31.974 101.905 -442.687
v 32.628 99.596 -442.185
v 31.099 119.428 -463.733
v 31.303 100.239 -445.123
v 30.331 99.853 -446.854
v 30.352 101.846 -447.496
v 38.016 105.636 -455.171
v 37.011 107.622 -448.956
v 35.002 107.029 -448.434
v 31.073 103.914 -451.346
v 38.614 80.289 -459.128
v 37.507 81.698 -460.266
v 32.302 104.856 -448.353
v 29.2 102.335 -449.339
v 30.031 103.102 -454.254
v 28.408 102.568 -451.334
v 27.431 106.719 -441.649
v 26.256 111.215 -445.787
v 26.654 105.107 -443.516
v 36.496 74.528 -463.71
v 25.68 102.201 -442.98
v 23.003 99.98 -441.073
v 26.381 102.74 -446.876
v 25.979 101.232 -445.863
v 25.577 108.243 -449.931
v 24.785 104.896 -452.27
v 26.041 104.868 -448.527
v 26.931 87.608 -455.544
v 27.781 100.475 -447.94
v 36.96 68.131 -466.86
v 26.792 102.659 -449.378
v 26.218 103.01 -451.729
v 63.988 89.649 -435.161
v 44.999 121.725 -447.618
v 65.812 87.738 -436.794
v 60.061 87.708 -435.115
v 60.409 93.297 -437.323
v 41.722 86.043 -457.144
v 61.524 93.758 -440.458
v 65.797 90.3 -437.319
v 43.52 85.026 -455.976
v 67.244 88.716 -438.738
v 69.492 88.436 -442.696
v 62.278 91.776 -435.73
v 67.649 89.836 -440.555
v 63.892 92.417 -438.87
v 63.099 87.951 -434.915
v 68.272 87.105 -440.655
v 66.423 86.111 -438.81
v 63.036 86.324 -436.418
v 29.748 100.094 -435.048
v 59.627 85.954 -439.599
v 39.486 84.768 -458.076
v 61.877 85.249 -441.075
v 64.195 84.821 -439.839
v 63.697 93.156 -442.829
v 62.864 92.972 -445.144
v 32.471 76.485 -458.82
v 61.059 93.977 -443.845
v 67.78 90.283 -443.494
v 26.036 102.296 -456.809
v 25.154 102.668 -454.321
v 67.921 88.341 -444.686
v 66.087 90.66 -445.628
v 65.55 89.23 -446.886
v 62.41 91.231 -447.115
v 63.869 88.167 -446.686
v 31.401 80.344 -457.31
v 66.517 84.914 -441.405
v 66.37 86.684 -445.071
v 65.446 85.207 -443.354
v 62.439 87.728 -445.249
v 60.659 90.617 -434.592
v 58.337 89.766 -435.325
v 57.1 93.944 -437.957
v 33.168 76.268 -456.264
v 55.396 95.527 -439.333
v 43.088 84.367 -453.937
v 57.75 95.489 -440.242
v 53.533 96.747 -438.352
v 51.339 95.315 -438.631
v 54.425 97.738 -439.903
v 56.193 92.512 -437.185
v 56.494 89.527 -437.014
v 55.293 91.517 -437.361
v 57.954 87.825 -437.029
v 53.397 94.325 -438.742
v 38.029 77.379 -458.318
v 51.754 92.785 -439.491
v 49.044 92.476 -440.863
v 53.473 89.968 -439.987
v 49.212 97.767 -437.174
v 46.555 97.011 -437.089
v 47.194 93.429 -440.263
v 43.597 96.031 -437.54
v 28.515 102.411 -433.155
v 41.821 95.72 -440.67
v 43.309 92.648 -439.135
v 40.57 92.867 -440.61
v 40.69 90.524 -441.065
v 43.246 90.311 -441.264
v 60.937 85.876 -437.835
v 37.737 76.993 -454.687
v 58.229 95.742 -442.393
v 56.208 96.764 -441.445
v 55.852 96.419 -444.248
v 60.293 93.588 -445.712
v 55.021 95.78 -446.522
v 54.204 98 -443.247
v 52.573 97.222 -447.22
v 46.083 86.138 -455.215
v 57.605 88.744 -446.977
v 55.402 88.417 -445.89
v 54.101 88.617 -444.017
v 54.372 88.731 -441.701
v 52.353 88.975 -446.433
v 50.41 89.929 -443.363
v 50.636 98.378 -448.792
v 51.004 96.426 -449.229
v 53.357 94.572 -448.783
v 50.007 94.914 -450.818
v 30.615 83.415 -458.024
v 50.356 92.344 -453.538
v 56.957 93.34 -447.717
v 60.686 89.677 -447.356
v 56.765 91.117 -448.227
v 32.297 84.275 -458.423
v 54.685 92.134 -449.308
v 54.1 89.452 -448.544
v 52.756 92.53 -451.124
v 52.087 88.844 -450.36
v 53.307 90.275 -451.166
v 43.244 96.961 -442.856
v 39.536 93.517 -446.578
v 43.591 89.18 -443.23
v 47.406 90.468 -443.581
v 29.472 84.726 -455.971
v 46.313 89.16 -445.59
v 26.306 103.623 -458.664
v 39.681 93.388 -442.751
v 40.735 88.335 -442.081
v 44.358 87.407 -457.47
v 46.853 97.278 -449.888
v 44.961 97.3 -448.223
v 48.783 96.884 -450.07
v 45.846 95.786 -450.376
v 43.42 95.215 -448.505
v 40.862 94.37 -444.827
v 41.211 93.32 -449.746
v 50.351 88.486 -449.345
v 47.666 86.969 -452.425
v 42.284 92.769 -451.719
v 39 92.37 -450.733
v 59.387 87.044 -444.426
v 30.651 86.282 -456.733
v 59.313 86.077 -442.159
v 26.84 106.275 -460.238
v 44.277 87.941 -446.377
v 44.478 85.969 -450.831
v 40.609 84.448 -446.887
v 41.914 83.867 -451.436
v 40.107 82.126 -451.712
v 19.252 93.109 -429.907
v 14.286 93.449 -428.487
v 16.455 95.666 -429.53
v 13.24 94.332 -430.66
v 16.873 93.522 -428.571
v 14.583 91.122 -428.833
v 12.478 92.543 -429.751
v 16.26 90.028 -429.722
v 33.908 98.702 -436.992
v 33.533 96.241 -437.403
v 34.448 97.699 -439.49
v 35.002 94.997 -439.19
v 34.352 92.803 -439.798
v 35.724 93.803 -441.117
v 31.805 97.736 -436.406
v 29.54 97.337 -437.104
v 29.27 86.531 -456.417
v 32.697 94.323 -438.747
v 37.162 92.822 -442.59
v 38.524 91.375 -441.769
v 37.704 88.523 -441.375
v 36.088 91.821 -441.077
v 28.168 86.443 -454.009
v 33.565 90.664 -440.509
v 29.416 92.438 -440.344
v 22.192 95.15 -431.912
v 26.585 96.658 -436.605
v 25.076 97.434 -435.63
v 20.351 96.342 -431.11
v 19.461 97.845 -432.883
v 34.96 82.223 -460.531
v 21.81 93.202 -432.29
v 23.251 98.06 -435.099
v 18.129 98.373 -434.549
v 23.729 93.817 -434.652
v 28.237 94.085 -439.012
v 26.038 94.324 -437.362
v 18.485 97.736 -441.151
v 25.064 92.636 -438.919
v 26.513 92.445 -440.416
v 21.166 91.35 -438.189
v 20.528 91.752 -441.812
v 37.863 93.503 -444.611
v 35.516 94.539 -442.786
v 37.022 93.562 -447.04
v 35.493 94.54 -445.356
v 33.723 96.595 -443.751
v 30.157 89.208 -444.245
v 34.324 94.4 -448.511
v 35.238 92.766 -450.939
v 31.433 97.29 -447.056
v 29.061 98.089 -448.193
v 29.758 95.809 -450.344
v 33.421 92.364 -452.623
v 25.119 98.781 -446.182
v 22.366 98.317 -443.273
v 19.841 93.558 -444.147
v 22.541 96.326 -445.626
v 20.543 94.996 -444.892
v 26.41 91.652 -442.582
v 22.743 91.678 -442.043
v 28.48 90.754 -443.435
v 24.211 91.213 -445.705
v 22.552 91.553 -447.391
v 21.526 92.302 -445.353
v 26.856 97.703 -448.347
v 23.54 96.08 -448.215
v 26.448 96.64 -449.81
v 24.682 93.055 -455.175
v 25.018 96.285 -451.588
v 21.306 93.78 -447.368
v 21.83 94.598 -450.908
v 22.309 90.69 -452.692
v 23.483 90.442 -449.281
v 26.366 88.604 -450.798
v 24.409 89.198 -453.065
v 21.597 91.94 -449.195
v 21.807 93.262 -453.795
v 24.192 90.744 -455.741
v 21.327 92.523 -451.394
v 35.749 86.769 -442.028
v 32.187 89.197 -442.136
v 32.21 86.826 -444.773
v 37.632 85.365 -442.7
v 41.262 83.52 -456.805
v 35.659 82.843 -444.644
v 36.335 81.11 -445.891
v 27.39 89.092 -456.792
v 28.406 86.955 -450.945
v 30.903 84.947 -449.618
v 30.027 83.839 -455.091
v 37.828 81.54 -446.13
v 36.744 78.759 -448.828
v 35.335 80.37 -447.07
v 38.796 80.108 -453.099
v 35.367 77.496 -450.553
v 37.781 78.56 -451.251
v 34.454 79.355 -449.383
v 34.114 77.259 -452.533
v 32.696 83.012 -448.768
v 32.023 81.354 -453.409
v 16.266 96.565 -432.193
v 15.495 97.525 -436.661
v 14.676 96.396 -434.396
v 22.652 92.35 -436.266
v 12.02 95.086 -434.417
v 18.053 89.627 -432.236
v 16.607 88.359 -434.667
v 12.777 89.689 -431.001
v 14.88 88.144 -432.732
v 10.896 89.953 -432.91
v 15.662 88.795 -437.455
v 14.358 87.868 -435.078
v 12.446 88.574 -433.903
v 40.017 87.696 -456.247
v 10.226 91.344 -433.276
v 10.927 93.279 -433.557
v 9.03399 92.641 -435.071
v 10.354 89.98 -435.546
v 12.945 97.145 -438.416
v 18 96.312 -442.322
v 14.833 96.349 -439.675
v 11.757 95.548 -440.092
v 13.669 94.195 -440.524
v 10.349 96.392 -437.676
v 11.801 93.227 -439.121
v 9.62099 94.324 -439.333
v 14.997 92.969 -440.723
v 12.352 91.43 -437.414
v 18.845 90.242 -438.429
v 13.381 89.042 -436.626
v 18.132 92.259 -441.682
v 9.65499 91.987 -437.866
v 18.033 94.317 -442.8
v 36.305 76.367 -452.236
v 24.15 105.854 -455.597
v 42.173 130.471 -452.103
v 42.383 127.649 -455.602
v 40.315 90.749 -453.512
v 45.037 124.294 -455.855
v 44.93 93.847 -451.685
v 41.551 126.503 -458.864
v 43.859 124.373 -459.084
v 39.637 127.805 -457.783
v 40.346 126.916 -461.417
v 23.295 95.052 -453.434
v 47.324 87.483 -456.475
v 45.818 121.661 -459.694
v 46.027 89.632 -456.137
v 46.795 120.473 -462.447
v 43.459 124.573 -462.317
v 39.331 127.94 -465.029
v 39.519 126.043 -465.889
v 44.716 123.456 -466.249
v 46.01 122.38 -464.319
v 45.458 120.985 -466.5
v 42.493 125.941 -465.256
v 42.706 122.806 -466.425
v 38.624 121.561 -465.087
v 48.622 120.776 -453.623
v 50.205 112.629 -454.296
v 49.885 110.106 -458.82
v 49.698 115.789 -454.233
v 29.427 88.35 -456.281
v 47.807 120.194 -455.45
v 47.736 118.891 -457.583
v 38.862 81.345 -448.813
v 47.717 118.306 -459.914
v 48.625 89.662 -455.984
v 48.371 117.113 -462.158
v 49.211 114.027 -457.868
v 49.773 108.089 -461.157
v 50.65 105.001 -452.459
v 50.612 106.907 -456.034
v 49.552 87.633 -455.052
v 49.848 102.892 -455.63
v 49.716 105 -458.639
v 49.821 102.681 -458.811
v 41.234 104.883 -453.411
v 48.619 101.139 -454.75
v 46.086 100.984 -454.682
v 43.715 90 -455.839
v 44.301 102.307 -453.694
v 48.63 107.643 -463.241
v 41.067 103.613 -460.621
v 46.078 104.978 -462.977
v 42.762 104.52 -462.09
v 49.128 101.143 -458.168
v 47.29 100.545 -456.969
v 48.451 102.936 -462.015
v 45.853 102.118 -461.633
v 39.977 104.121 -458.303
v 43.559 102.142 -459.907
v 48.542 118.614 -464.116
v 48.403 116.564 -465.116
v 46.634 115.604 -465.371
v 47.159 119.009 -466.389
v 32.156 91.244 -454.203
v 27.392 102.096 -454.959
v 47.502 113.58 -464.676
v 48.854 113.762 -462.851
v 45.041 115.618 -465.185
v 46.069 109.528 -464.046
v 38.875 129.385 -455
v 34.912 127.498 -454.654
v 36.212 86.491 -456.983
v 37.086 128.591 -455.731
v 33.661 90.114 -454.43
v 33.523 125.153 -456.059
v 35.043 126.504 -458.472
v 38.24 127.596 -459.938
v 36.646 127.44 -459.64
v 36.998 89.468 -454.767
v 34.846 127.17 -463.518
v 29.494 119.028 -456.618
v 32.998 124.5 -459.566
v 36.839 91.846 -452.113
v 33.694 126.042 -462.124
v 30.394 121.615 -460.117
v 30.975 123.15 -462.221
v 29.479 121.255 -462.835
v 28.428 120.102 -460.812
v 36.863 127.687 -464.225
v 35.938 125.602 -465.116
v 34.016 123.192 -464.801
v 32.389 124.805 -463.841
v 31.53 121.96 -464.174
v 28.983 118.137 -452.779
v 28.411 117.037 -454.773
v 29.89 94.069 -453.611
v 37.511 115.599 -463.425
v 27.537 94.858 -453.769
v 34.871 121.005 -464.523
v 28.748 118.74 -462.962
v 30.362 115.893 -462.933
v 28.312 115.486 -462.477
v 27.276 115.448 -456.116
v 48.001 92.549 -453.287
v 26.08 113.995 -458.66
v 24.365 108.316 -454.339
v 27.065 116.742 -458.989
v 27.018 117.976 -461.129
v 25.15 110.451 -459.143
v 26.233 112.828 -460.854
v 26.57 115.457 -461.086
v 28.314 110.463 -461.695
v 26.613 110.252 -461.146
v 51.036 89.615 -455.342
v 33.991 105.209 -454.55
v 35.465 105.346 -456.852
v 32.251 104.166 -457.053
v 51.46 88.474 -452.825
v 25.216 107.195 -459.324
v 38.656 79.345 -456.515
v 28.518 102.692 -457.177
v 34.52 106.368 -460.655
v 36.578 105.484 -458.783
v 39.164 107.203 -462.228
v 38.328 105.558 -460.92
v 30.793 106.68 -460.581
v 28.702 104.11 -459.215
v 32.552 105.035 -459.129
v 33.455 109.716 -461.823
v 40.058 81.578 -455.349
v 34.907 66.47 -460.828
v 35.295 66.382 -469.182
v 28.765 116.74 -445.01
v 48.593 111.404 -463.83
v 67.846 86.39 -443.204
v 8.57999 94.394 -436.955
v 35.084 66.129 -461.711
v 38.672 130.539 -449.91
v 33.547 66.269 -470.66
v 29.612 117.53 -445.139
v 49.514 114.474 -446.164
v 39.017 111.895 -443.498
v 27.621 113.416 -461.753
v 38.231 127.175 -464.943
v 47.757 113.072 -464.479
v 35.954 106.063 -460.755
v 68.786 88.393 -443.59
v 8.83999 93.75 -436.988
vn -0.889287 -0.345732 -0.299397
vn -0.00245561 -0.734353 -0.678763
vn 0.919349 0.347695 0.184132
vn 0.586775 0.654882 0.476261
vn 0.688409 0.655701 -0.310079
vn -0.166508 -0.985544 -0.031276
vn 0.733613 0.640478 0.227156
vn 0.313153 0.728741 0.608993
vn 0.579569 -0.7805 -0.234348
vn 0.230524 0.409256 0.882819
vn 0.394807 -0.901487 0.177336
vn 0.0514828 -0.929076 -0.366287
vn 0.925113 -0.358614 -0.124746
vn 0.575503 0.517133 0.633537
vn -0.873461 -0.369855 -0.31666
vn 0.526943 0.320517 0.787146
vn 0.37674 0.441513 0.81433
vn 0.785518 0.565451 -0.251447
vn 0.801333 0.550376 -0.234417
vn 0.76906 0.594711 0.234236
vn 0.170606 0.302968 0.937605
vn -0.0931743 0.327683 -0.940182
vn 0.648562 0.0589809 0.758873
vn 0.183802 0.768138 0.613335
vn 0.952389 -0.0170433 0.30441
vn 0.28653 -0.558694 0.778307
vn -0.0530029 -0.270482 0.961265
vn -0.91099 0.233756 -0.339786
vn -0.00775124 0.59873 0.800913
vn -0.53789 0.448902 0.713555
vn 0.537323 0.842721 -0.0332316
vn 0.58584 0.761475 0.277395
vn -0.85451 -0.519113 0.0182883
vn 0.771989 0.635322 0.0199817
vn 0.867113 0.465869 -0.176296
vn -0.374241 0.434522 0.819228
vn -0.568091 0.68591 0.454752
vn -0.157364 -0.246053 0.956397
vn 0.138472 0.978473 0.153023
vn -0.4521 0.866296 0.212456
vn -0.589687 -0.0107248 0.807561
vn -0.38402 0.748319 0.540877
vn -0.194981 0.688416 -0.698618
vn -0.803136 0.572609 0.164592
vn 0.65647 0.338668 -0.674055
vn -0.801725 0.586423 0.115523
vn 0.632965 0.318967 0.705419
vn 0.528497 -0.6261 0.573315
vn 0.956565 0.18996 0.221129
vn 0.884296 0.253831 -0.391907
vn 0.974797 0.108779 -0.194777
vn 0.953357 0.162388 0.254441
vn -0.574921 0.600693 -0.555548
vn -0.440116 0.222783 0.869866
vn 0.271244 0.604746 -0.748805
vn 0.228212 0.319756 0.919606
vn 0.122732 0.32375 0.938148
vn -0.939371 0.292194 -0.179456
vn 0.283331 0.409273 0.867306
vn -0.576013 -0.754788 0.313854
vn 0.110922 0.365606 0.924137
vn 0.0792014 0.25118 0.964694
vn -0.987252 -0.127525 0.0952372
vn 0.71063 0.285568 0.643006
vn 0.246303 0.372207 0.894873
vn 0.819597 0.3559 0.448994
vn -0.802583 -0.348753 0.483975
vn 0.993067 0.0654942 0.0976088
vn 0.929348 0.352917 -0.108451
vn 0.885453 -0.394073 0.246333
vn 0.819455 0.481573 -0.310774
vn 0.957314 0.0950287 -0.272983
vn 0.99591 -0.0442858 -0.0787476
vn 0.999456 -0.0328274 -0.00313204
vn 0.982445 0.0148714 -0.185959
vn 0.976598 -0.148622 -0.155458
vn -0.373994 -0.496319 0.783451
vn 0.841024 -0.160911 -0.516513
vn 0.0291121 0.363443 0.931162
vn -0.265634 0.152979 0.951859
vn -0.157519 -0.194247 0.968223
vn -0.692161 -0.0937107 0.715634
vn -0.625363 0.29004 0.724429
vn -0.83297 -0.390417 0.392092
vn -0.272031 -0.640869 0.717834
vn -0.573287 -0.452395 0.68314
vn 0.685612 -0.4884 0.539816
vn -0.359894 -0.837038 0.412121
vn -0.971277 0.188875 -0.144734
vn -0.878224 -0.0855699 0.470531
vn -0.927658 -0.104659 0.358465
vn -0.408463 0.504383 -0.76076
vn -0.957776 0.171843 0.23051
vn -0.990513 0.0105381 -0.137013
vn -0.731901 -0.377659 0.567181
vn -0.892928 0.445778 -0.062934
vn 0.873084 0.27192 -0.404702
vn -0.666228 -0.646639 0.371482
vn 0.990007 0.0391738 -0.135472
vn -0.293422 -0.91133 0.288759
vn -0.955315 -0.295385 0.0109616
vn -0.781906 -0.245209 -0.573145
vn 0.871372 -0.44841 -0.199095
vn -0.838789 -0.535437 0.0986932
vn 0.15144 -0.468129 -0.870587
vn 0.318325 -0.905232 -0.281468
vn -0.60786 -0.766601 -0.206953
vn -0.723742 -0.651724 0.226835
vn 0.120438 0.380129 -0.917059
vn 0.150488 0.971285 -0.184281
vn -0.338246 0.890546 -0.304168
vn 0.110684 0.248149 0.962378
vn 0.262869 -0.543909 0.796908
vn -0.020297 0.31135 0.950079
vn -0.486393 0.548994 0.679726
vn -0.231736 0.387191 0.892402
vn -0.755296 0.495097 0.429427
vn -0.00104553 0.502521 0.864564
vn -0.0519781 0.896417 0.440152
vn -0.054929 0.368854 0.927863
vn -0.0802357 -0.682347 0.726612
vn 0.891787 -0.296276 0.341961
vn -0.289909 0.486059 0.824439
vn -0.800872 0.567625 0.190804
vn -0.500307 0.757306 0.419738
vn -0.714512 0.615247 -0.333081
vn 0.980388 -0.173182 0.0940655
vn -0.590346 0.545802 0.594636
vn -0.877227 0.472027 -0.0875413
vn -0.773658 0.540198 0.33112
vn -0.892754 0.449733 0.0270347
vn -0.850866 0.468521 -0.237729
vn -0.831413 0.555291 -0.0200969
vn -0.361053 0.475537 0.802187
vn -0.482125 -0.61319 0.625743
vn 0.617913 -0.584041 0.526384
vn 0.0982283 0.352754 0.930546
vn 0.342675 0.878361 0.333251
vn 0.502088 0.165478 0.848837
vn 0.651678 -0.081529 0.754102
vn 0.480786 0.777819 0.404775
vn 0.566984 0.271683 0.777636
vn -0.231043 0.86508 0.44526
vn 0.937761 0.23734 0.253525
vn 0.960924 -0.138763 0.239518
vn 0.827806 0.526357 0.194128
vn 0.877023 0.479887 0.0232231
vn -0.457541 0.506911 0.730546
vn -0.414864 0.90126 0.124973
vn -0.59114 -0.321202 0.739854
vn -0.753345 0.188058 0.630163
vn -0.884101 0.407868 0.228054
vn -0.0595303 -0.380718 0.922773
vn -0.238603 0.425506 0.872934
vn -0.785642 0.602106 0.142247
vn -0.0778162 0.869788 0.48725
vn -0.895828 0.0545176 -0.441044
vn -0.790111 0.605057 0.0981426
vn -0.595086 0.767606 0.238018
vn -0.334407 0.932807 0.134325
vn -0.380864 0.9143 -0.137831
vn 0.753513 0.277316 -0.596082
vn 0.109527 0.277313 0.954516
vn -0.0172693 0.305015 0.952191
vn -0.0147232 0.407483 0.913094
vn -0.214553 0.415372 0.883987
vn 0.0698295 0.329444 0.941589
vn 0.125185 0.0271823 0.991761
vn 0.351588 -0.86181 0.365607
vn 0.00680162 0.422456 -0.906358
vn 0.253558 -0.572942 0.779388
vn -0.307739 0.406598 0.860218
vn -0.0060819 0.371188 0.928538
vn 0.305977 0.334253 -0.891433
vn 0.837272 0.104465 -0.536715
vn -0.420841 0.342363 -0.840048
vn -0.825196 0.338652 0.452068
vn -0.648326 0.307693 0.696418
vn -0.923228 0.367896 0.110917
vn -0.989151 0.125517 0.0763259
vn -0.929461 0.368873 -0.0058582
vn -0.937593 0.327725 0.116257
vn 0.684899 -0.481192 0.547144
vn -0.0854419 -0.906869 0.412661
vn 0.640849 -0.728422 0.24231
vn 0.373485 0.00386762 0.927628
vn 0.936655 -0.349166 0.0275814
vn 0.916648 -0.373258 -0.142952
vn 0.991406 0.0696389 -0.11075
vn 0.889287 0.379085 -0.255857
vn -0.258642 -0.103271 -0.960437
vn 0.90862 0.117963 -0.400617
vn 0.667978 0.100878 -0.737313
vn 0.680677 -0.464741 -0.566299
vn -0.148088 -0.962763 0.22618
vn 0.102224 -0.960439 0.25905
vn 0.469881 -0.864708 0.177458
vn 0.532719 -0.845821 0.0282316
vn 0.875505 -0.167965 -0.453076
vn 0.472682 0.29975 -0.828687
vn 0.709518 -0.703381 -0.0428872
vn 0.354861 -0.83421 -0.422099
vn 0.411627 -0.91118 0.0177352
vn 0.119188 -0.992325 -0.0329304
vn -0.861039 0.316036 0.398413
vn -0.959441 0.139588 0.244924
vn -0.978865 0.160136 0.127197
vn 0.656898 0.403343 -0.637024
vn -0.857118 0.492839 -0.149861
vn -0.567189 0.801044 -0.191375
vn -0.98007 -0.127342 -0.152471
vn -0.895672 0.218928 -0.387093
vn -0.977553 0.089541 0.190718
vn -0.93633 -0.230118 0.2652
vn -0.974483 -0.176474 0.138707
vn -0.517363 -0.681228 -0.517942
vn -0.267464 -0.173273 -0.94786
vn 0.917338 -0.0723928 -0.391472
vn -0.700149 -0.688463 -0.189233
vn -0.567938 -0.795776 0.210207
vn 0.491594 0.223089 0.841764
vn 0.189035 0.30339 0.933927
vn 0.669986 -0.282491 0.686525
vn -0.292471 -0.540151 0.789112
vn 0.19771 0.835248 0.513101
vn 0.144093 0.0252963 -0.989241
vn 0.400907 0.902427 0.157792
vn 0.69952 0.496808 0.513667
vn 0.474314 -0.706229 -0.525611
vn 0.860161 0.0862301 0.50268
vn 0.995596 0.0517431 -0.0781711
vn 0.296064 0.700829 0.648988
vn 0.774929 0.554355 0.303604
vn 0.491524 0.830595 0.261755
vn 0.238947 -0.36597 0.899428
vn 0.863728 -0.340881 0.371178
vn 0.577821 -0.633568 0.514505
vn 0.127493 -0.797318 0.58994
vn 0.0406764 -0.545647 0.837028
vn -0.395838 -0.907013 0.143663
vn 0.311171 0.34487 -0.885572
vn -0.215048 -0.961109 -0.173272
vn 0.0396953 -0.979641 0.196796
vn 0.468199 0.88237 -0.0470511
vn 0.395153 0.806338 -0.440083
vn -0.973647 -0.191569 0.123742
vn 0.390033 0.902952 -0.180423
vn 0.707786 0.67144 -0.219561
vn -0.372038 -0.867331 -0.330643
vn -0.680851 -0.721795 0.124314
vn 0.745749 -0.0643037 -0.663117
vn 0.582932 0.59455 -0.553805
vn 0.407564 0.000562432 -0.913176
vn 0.263482 0.351075 -0.898512
vn -0.0576794 -0.553634 -0.83076
vn -0.943576 -0.324411 0.0664941
vn 0.417106 -0.90822 0.0340528
vn 0.353996 -0.639002 -0.682908
vn 0.0399573 -0.902452 -0.428934
vn -0.169377 -0.816733 -0.551597
vn -0.0587083 0.295597 0.953507
vn -0.502744 -0.0939952 0.85931
vn -0.0414847 0.68802 0.724505
vn -0.892546 -0.331853 0.305343
vn 0.329385 0.539143 0.775133
vn 0.583016 -0.812446 0.00488947
vn 0.331817 0.854264 0.400164
vn 0.561273 -0.250871 0.788693
vn -0.0734011 -0.47002 0.879599
vn 0.86951 0.426417 0.249239
vn -0.324513 0.34161 0.88204
vn -0.632565 -0.336961 0.697366
vn -0.486653 -0.0579217 0.871673
vn -0.551674 -0.687797 0.471795
vn -0.127221 0.00858332 0.991837
vn 0.979697 -0.18823 -0.0690121
vn -0.395184 -0.312693 0.863744
vn -0.248515 -0.638825 0.728109
vn -0.545803 -0.650502 0.528154
vn 0.0065091 -0.596293 0.802741
vn 0.146062 -0.553609 0.819868
vn 0.154603 -0.649018 0.744899
vn -0.556263 -0.0784115 0.827299
vn -0.0993169 -0.395182 0.913218
vn -0.809433 0.554168 0.194206
vn -0.0552195 -0.530053 0.846164
vn -0.680408 0.116461 0.723521
vn -0.144923 -0.308492 0.940122
vn 0.245204 -0.69155 0.679437
vn -0.261834 -0.905311 0.334447
vn 0.908338 -0.37249 0.190193
vn 0.455955 0.889477 -0.0305955
vn 0.521798 0.835503 0.172225
vn 0.478179 0.823566 -0.305095
vn 0.359166 0.778141 -0.515263
vn 0.467384 0.707382 -0.530248
vn 0.663332 0.714405 -0.222749
vn 0.627697 0.573169 -0.526758
vn 0.42431 -0.848414 -0.316472
vn 0.0370204 -0.716486 -0.696618
vn -0.17542 -0.946216 -0.271852
vn -0.334771 -0.942161 0.0161656
vn -0.458958 -0.864834 0.203518
vn -0.0863401 -0.995694 0.0337336
vn -0.300118 -0.887937 0.348565
vn 0.708721 0.221651 -0.669765
vn 0.514419 0.417782 -0.748887
vn 0.497565 0.534472 -0.683204
vn 0.287941 0.59853 -0.747564
vn -0.817877 0.0824097 -0.569461
vn 0.232744 0.69016 -0.685208
vn 0.380164 0.449043 -0.808601
vn 0.10241 -0.341247 -0.934378
vn 0.32468 -0.111086 -0.939278
vn -0.239879 0.547465 -0.801711
vn 0.607409 0.122301 -0.784918
vn 0.371566 -0.799636 -0.471721
vn 0.65095 0.483279 -0.58541
vn 0.438432 -0.896948 -0.0571078
vn 0.848964 -0.296236 -0.437613
vn -0.741727 0.661189 -0.112561
vn -0.176225 0.964223 -0.198035
vn 0.420957 -0.765527 0.486584
vn 0.108741 -0.85123 0.513404
vn -0.860749 -0.333261 -0.384769
vn 0.302357 -0.869774 0.389966
vn -0.383564 -0.612967 -0.69076
vn -0.534386 0.761545 0.366717
vn 0.299675 -0.53425 0.790425
vn 0.131012 -0.0474081 -0.990247
vn -0.362503 0.168528 -0.916619
vn -0.788236 0.395091 -0.471791
vn 0.206793 0.198735 -0.957988
vn -0.304126 0.608199 -0.733213
vn -0.603638 0.712289 -0.358142
vn -0.518292 0.846812 -0.119509
vn -0.366013 0.873127 -0.321999
vn 0.182908 -0.964699 0.189473
vn 0.38016 -0.909194 0.169837
vn -0.325367 0.792775 -0.515407
vn -0.0587549 0.91696 -0.394629
vn -0.0245675 -0.890297 -0.454717
vn -0.206823 0.320472 -0.924403
vn -0.260548 -0.941672 -0.212997
vn -0.321171 -0.351678 -0.879302
vn 0.48894 -0.787807 0.374564
vn 0.488552 -0.813658 0.315084
vn 0.676735 -0.653996 0.338109
vn 0.635616 -0.738659 0.224443
vn 0.731237 -0.66167 0.165785
vn 0.55989 -0.220332 0.798735
vn -0.35666 0.27163 0.893874
vn -0.121174 0.719682 0.683649
vn -0.609723 0.677427 0.411497
vn 0.260628 0.0536205 0.963949
vn -0.178014 -0.437692 0.881327
vn -0.752239 0.101865 0.650968
vn 0.251705 -0.678277 0.690351
vn 0.864729 0.0123686 0.502086
vn 0.465497 -0.378885 0.799849
vn 0.95003 0.309634 0.0396155
vn 0.812059 -0.113872 0.572358
vn 0.436038 -0.319319 0.841372
vn 0.859874 0.275013 0.430098
vn 0.0861731 -0.511438 0.854988
vn 0.0398524 -0.562231 0.826019
vn -0.479842 -0.19388 -0.855665
vn 0.0542466 -0.511944 0.857304
vn 0.39491 0.694962 0.600894
vn -0.112662 0.313422 0.942907
vn 0.10256 -0.23169 0.967368
vn 0.456033 0.102917 0.883992
vn -0.706215 -0.707851 -0.0143693
vn -0.0366181 -0.437296 0.898572
vn -0.149821 -0.678263 0.719383
vn 0.690714 0.0899149 0.717516
vn 0.439491 -0.372002 0.817596
vn 0.410639 0.0627179 0.909639
vn 0.377439 0.537337 0.754194
vn 0.025037 0.875023 0.483434
vn -0.0135763 0.542019 -0.840256
vn 0.694191 -0.473943 0.541735
vn 0.269166 0.644962 0.715244
vn -0.264688 0.929062 0.258427
vn 0.729022 -0.489727 0.478221
vn 0.233196 -0.612118 0.7556
vn 0.570896 -0.566728 0.594051
vn -0.444998 0.763349 -0.468268
vn 0.349185 -0.869444 0.34948
vn 0.170657 -0.881652 0.439961
vn 0.400764 -0.916099 -0.0122435
vn -0.134272 -0.937641 -0.320624
vn 0.107848 0.988808 0.103089
vn 0.756748 0.651006 0.0593678
vn 0.244336 0.949921 -0.194807
vn 0.536571 0.833003 -0.134899
vn 0.775011 0.572519 -0.267544
vn -0.552243 -0.709655 0.437513
vn 0.465337 0.799177 -0.380496
vn 0.226094 0.880889 -0.415833
vn 0.620956 0.570083 -0.537976
vn 0.297339 0.491736 -0.818404
vn 0.332691 0.792567 -0.511032
vn 0.328546 0.728499 -0.601121
vn -0.649608 0.526196 -0.54875
vn -0.55453 0.649984 -0.519632
vn -0.637553 -0.375495 -0.672703
vn -0.653162 0.605137 -0.455181
vn -0.69484 0.289636 -0.658262
vn -0.0831778 -0.943271 0.321436
vn -0.00329215 -0.99978 0.0207264
vn -0.373235 -0.82131 0.431446
vn -0.267195 -0.94621 0.182468
vn -0.626944 -0.76135 0.165189
vn -0.663542 -0.718881 -0.207176
vn -0.310818 0.632348 -0.709598
vn -0.580577 0.769271 -0.266744
vn -0.0861621 0.912073 -0.400873
vn -0.196923 0.464661 -0.863314
vn -0.148315 0.944397 -0.293456
vn -0.981496 0.0988852 -0.163972
vn -0.814274 0.572682 -0.0948351
vn -0.764486 -0.618409 -0.182018
vn -0.488188 -0.843774 0.222978
vn -0.504304 -0.816031 0.282437
vn -0.599463 -0.798224 -0.0590072
vn -0.890319 -0.44039 0.115709
vn -0.80688 0.196634 -0.557027
vn -0.567559 -0.204586 -0.797509
vn -0.994653 -0.0931507 -0.0445859
vn -0.163197 -0.466189 0.869502
vn -0.438849 -0.61286 0.657126
vn -0.666845 -0.580468 0.467306
vn 0.170521 -0.548969 0.818264
vn 0.712547 -0.412104 -0.567844
vn -0.272479 -0.607115 0.746436
vn 0.0727122 -0.756457 0.649989
vn -0.0964964 -0.203153 -0.97438
vn -0.648578 -0.704352 0.288505
vn -0.735721 -0.582643 0.345315
vn -0.839763 -0.536221 0.085235
vn 0.480183 -0.671024 0.564934
vn 0.269683 -0.803084 0.531344
vn -0.391171 -0.696706 0.60132
vn 0.863727 -0.491835 0.109883
vn -0.174611 -0.802334 0.570764
vn 0.751589 -0.59186 0.291231
vn -0.63294 -0.582843 0.50959
vn -0.699218 -0.570745 0.430516
vn -0.779804 -0.50234 0.373579
vn -0.856633 -0.44231 0.265596
vn -0.396013 0.861629 0.317443
vn -0.358324 0.931997 0.0546454
vn -0.417649 0.85373 0.310989
vn 0.531997 -0.817086 0.22215
vn -0.522998 0.718227 0.458938
vn 0.531534 -0.782498 0.324297
vn 0.383907 -0.923343 -0.00722361
vn -0.474636 -0.650758 0.592651
vn 0.0226759 -0.945266 0.325513
vn -0.739495 -0.525938 0.420161
vn -0.00850649 -0.858352 -0.512991
vn -0.130137 -0.97841 -0.160559
vn -0.440745 -0.89401 0.0805569
vn -0.0989236 0.557187 -0.824474
vn -0.873098 -0.0953943 0.478121
vn -0.706656 0.48963 0.510783
vn -0.93278 0.0127146 0.360223
vn -0.671134 -0.702524 -0.236724
vn -0.175603 0.954893 -0.239465
vn -0.508616 0.474072 -0.718725
vn -0.295126 0.753331 -0.587702
vn -0.328663 0.342361 -0.88021
vn -0.390039 -0.0410285 -0.919884
vn -0.555263 0.831625 -0.00906151
vn -0.255154 -0.550039 -0.795207
vn -0.638918 0.0135019 -0.769157
vn -0.410781 -0.477716 -0.77656
vn -0.33234 -0.611693 -0.717901
vn 0.306035 -0.891204 -0.334811
vn -0.410519 -0.716686 -0.563769
vn -0.29372 -0.680417 -0.671387
vn -0.582183 -0.601042 -0.547551
vn -0.576078 -0.111466 -0.809759
vn 0.271386 -0.776122 0.569196
vn -0.995768 -0.0793536 -0.0463484
vn 0.463844 0.876134 -0.131291
vn 0.504574 0.720909 -0.475074
vn -0.159396 0.750241 -0.641663
vn 0.749492 0.530637 -0.395837
vn -0.186653 0.666457 -0.7218
vn 0.549886 0.800945 -0.236878
vn 0.736026 0.652901 -0.178847
vn 0.255388 0.919953 -0.297428
vn 0.47947 0.877519 0.00838006
vn -0.379599 0.7547 -0.535101
vn 0.352683 -0.366165 -0.861126
vn 0.829575 0.552967 -0.0776726
vn 0.0719703 0.523066 -0.849248
vn 0.825429 0.533419 0.184744
vn 0.70378 0.709481 0.0364805
vn 0.105286 0.859701 -0.499829
vn -0.0675653 0.255385 -0.964476
vn 0.522138 0.519494 -0.676386
vn 0.763199 0.645233 -0.0346698
vn 0.262148 0.148376 -0.953553
vn 0.529625 0.714182 -0.457648
vn -0.0979825 0.0265942 -0.994833
vn -0.197304 -0.195111 -0.96073
vn 0.788476 0.346454 -0.508207
vn 0.962755 0.129745 -0.23721
vn 0.985228 0.101147 -0.138189
vn 0.923383 0.196708 -0.32965
vn 0.127502 0.132459 -0.982954
vn 0.832381 0.400125 -0.383461
vn 0.897971 0.396316 -0.191261
vn 0.771057 -0.582501 0.257222
vn 0.912913 0.408117 -0.00554828
vn 0.209665 0.30237 -0.929846
vn 0.964792 0.25428 0.0672216
vn 0.963287 0.228426 -0.141063
vn 0.965349 -0.0381673 -0.258157
vn 0.971847 -0.193055 -0.135065
vn 0.987248 -0.0376383 -0.154677
vn 0.513243 -0.717156 -0.471454
vn 0.928592 -0.371032 -0.00720067
vn 0.987111 0.0304463 -0.157112
vn 0.931427 -0.294235 -0.21417
vn -0.515206 -0.808384 0.284743
vn 0.514373 -0.857397 0.0170302
vn -0.293732 -0.955357 0.0318422
vn -0.154518 0.63895 -0.753569
vn -0.620574 -0.772311 0.13573
vn 0.578782 -0.178241 -0.795765
vn -0.433122 -0.791594 -0.431026
vn -0.0313458 -0.310112 -0.950183
vn -0.264906 -0.497135 -0.826246
vn 0.642111 -0.754634 -0.134986
vn -0.0151982 -0.999873 0.00488391
vn 0.51812 -0.468655 -0.715482
vn -0.161357 -0.691119 -0.704499
vn -0.469846 -0.881617 0.0446788
vn -0.417446 -0.865216 -0.27774
vn 0.962225 0.2699 -0.0357404
vn 0.797161 -0.118763 -0.591971
vn 0.0484185 -0.297804 -0.953398
vn 0.419143 0.0410247 -0.906993
vn 0.354386 0.473492 -0.806359
vn 0.0658482 -0.997659 0.0184394
vn 0.414888 -0.192381 -0.889302
vn 0.95536 0.0712599 -0.286722
vn -0.157073 -0.241677 -0.95756
vn -0.00309866 -0.202218 -0.979336
vn 0.072643 0.83163 -0.550558
vn -0.719794 0.609601 -0.332089
vn -0.0260087 0.606206 -0.794882
vn -0.331695 0.839754 -0.429873
vn 0.111501 0.539506 -0.834566
vn -0.811486 0.576609 -0.0949333
vn -0.63777 0.768492 -0.0516737
vn 0.0611411 0.993753 -0.0933602
vn -0.331436 0.941542 -0.0604031
vn 0.0145943 0.651997 -0.758081
vn -0.490686 0.816343 -0.304649
vn -0.808159 0.55864 0.186549
vn -0.754898 0.641158 0.138003
vn 0.12132 0.82075 -0.558258
vn -0.663215 0.738452 0.121802
vn -0.717798 0.651685 0.245096
vn -0.79434 0.604373 -0.061296
vn -0.75626 0.456023 -0.469162
vn -0.800102 0.597908 0.0483955
vn -0.267578 0.852528 -0.448997
vn -0.286711 0.238878 -0.927757
vn -0.194312 -0.00429582 -0.98093
vn -0.675129 0.525936 -0.517293
vn -0.475302 0.133985 -0.869561
vn -0.881513 0.461201 -0.101135
vn -0.856434 0.514176 0.0463026
vn 0.387707 0.687313 -0.614235
vn -0.148424 -0.212762 -0.965765
vn 0.152374 0.767154 -0.623103
vn -0.109149 -0.181614 -0.977294
vn -0.593385 0.125662 -0.795049
vn -0.140467 -0.179007 -0.973769
vn -0.429791 -0.0683072 -0.900341
vn -0.870634 0.462695 0.16706
vn -0.0113621 0.699392 -0.714648
vn -0.950574 0.309836 0.0202549
vn -0.976108 0.184939 0.114063
vn -0.886604 0.409586 0.214877
vn -0.910231 0.343416 -0.231398
vn -0.940713 0.121604 -0.316656
vn -0.8025 0.0535867 -0.594241
vn -0.887522 0.148983 -0.436016
vn -0.200888 -0.192284 -0.960558
vn -0.537975 -0.0778207 -0.839361
vn 0.614944 -0.0319377 -0.787924
vn 0.345265 -0.926751 0.14807
vn 0.174719 -0.984599 -0.0061099
vn 0.385573 -0.911774 -0.141428
vn 0.655841 -0.736174 -0.167094
vn -0.810264 -0.149237 -0.566745
vn 0.912781 -0.407405 -0.0291735
vn 0.21793 -0.916491 -0.335485
vn -0.0864481 -0.651402 -0.753792
vn -0.124118 -0.982656 -0.137775
vn -0.219705 -0.334819 -0.916311
vn -0.321578 -0.748545 -0.579886
vn -0.0124667 -0.447877 -0.894008
vn 0.0611561 -0.668457 -0.741232
vn 0.171193 -0.827431 -0.534837
vn -0.105277 -0.266024 -0.958201
vn 0.793397 -0.60867 0.00656153
vn 0.0650639 -0.757479 0.64961
vn 0.761403 -0.419522 -0.494233
vn -0.533201 0.453333 0.714273
vn 0.674249 -0.0629068 -0.73582
vn 0.675848 -0.666852 -0.313907
vn -0.955703 0.282511 0.0825735
vn -0.138005 -0.932891 0.332669
vn 0.096701 0.589437 0.802006
vn -0.917165 -0.079027 -0.390593
vn -0.452484 0.593966 0.665178
vn -0.556485 0.671258 0.48963
vn 0.0921554 0.186282 0.978165
vn -0.498061 -0.133515 -0.856801
vn -0.322306 0.363927 -0.873886
vn 0.857001 0.256518 -0.446931
vn -0.21368 -0.842715 -0.494137
vn 0.709772 -0.453954 -0.538655
vn -0.922657 -0.366562 -0.119732

g grp1
usemtl mtl1
f 557//557 111//111 554//554 
f 128//128 123//123 124//124 
f 536//536 553//553 534//534 
f 505//505 18//18 506//506 
f 21//21 10//10 120//120 
f 55//55 45//45 43//43 
f 191//191 583//583 585//585 
f 7//7 17//17 14//14 
f 490//490 19//19 510//510 
f 515//515 510//510 513//513 
f 45//45 22//22 43//43 
f 613//613 585//585 581//581 
f 53//53 28//28 58//58 
f 3//3 16//16 49//49 
f 335//335 334//334 340//340 
f 58//58 28//28 63//63 
f 125//125 126//126 124//124 
f 432//432 398//398 433//433 
f 114//114 120//120 115//115 
f 28//28 15//15 33//33 
f 394//394 362//362 364//364 
f 506//506 552//552 508//508 
f 554//554 110//110 487//487 
f 487//487 4//4 5//5 
f 8//8 487//487 110//110 
f 487//487 5//5 488//488 
f 11//11 9//9 13//13 
f 43//43 53//53 55//55 
f 559//559 555//555 560//560 
f 20//20 3//3 50//50 
f 87//87 615//615 70//70 
f 196//196 169//169 197//197 
f 8//8 4//4 487//487 
f 343//343 367//367 514//514 
f 540//540 534//534 522//522 
f 47//47 16//16 56//56 
f 45//45 616//616 22//22 
f 557//557 494//494 561//561 
f 120//120 10//10 118//118 
f 522//522 512//512 527//527 
f 510//510 19//19 50//50 
f 617//617 172//172 165//165 
f 50//50 49//49 51//51 
f 443//443 447//447 517//517 
f 490//490 515//515 516//516 
f 540//540 12//12 541//541 
f 526//526 523//523 103//103 
f 513//513 51//51 511//511 
f 163//163 57//57 112//112 
f 490//490 510//510 515//515 
f 513//513 50//50 51//51 
f 544//544 500//500 520//520 
f 28//28 53//53 43//43 
f 22//22 28//28 43//43 
f 257//257 237//237 243//243 
f 39//39 34//34 31//31 
f 279//279 272//272 273//273 
f 71//71 35//35 297//297 
f 508//508 504//504 506//506 
f 23//23 24//24 27//27 
f 449//449 135//135 485//485 
f 63//63 28//28 33//33 
f 435//435 200//200 241//241 
f 6//6 616//616 9//9 
f 465//465 226//226 241//241 
f 375//375 366//366 386//386 
f 242//242 243//243 290//290 
f 275//275 265//265 268//268 
f 69//69 34//34 35//35 
f 349//349 266//266 347//347 
f 33//33 6//6 60//60 
f 267//267 227//227 292//292 
f 35//35 270//270 297//297 
f 259//259 257//257 243//243 
f 39//39 32//32 42//42 
f 22//22 15//15 28//28 
f 277//277 269//269 278//278 
f 290//290 224//224 274//274 
f 39//39 42//42 40//40 
f 11//11 6//6 9//9 
f 263//263 261//261 225//225 
f 122//122 99//99 127//127 
f 40//40 44//44 46//46 
f 270//270 265//265 293//293 
f 267//267 263//263 225//225 
f 240//240 290//290 274//274 
f 6//6 15//15 2//2 
f 441//441 310//310 256//256 
f 240//240 274//274 303//303 
f 272//272 271//271 273//273 
f 266//266 435//435 229//229 
f 52//52 47//47 64//64 
f 27//27 24//24 36//36 
f 38//38 27//27 36//36 
f 38//38 36//36 37//37 
f 40//40 24//24 39//39 
f 87//87 74//74 122//122 
f 33//33 15//15 6//6 
f 100//100 88//88 196//196 
f 512//512 521//521 511//511 
f 91//91 67//67 77//77 
f 114//114 115//115 116//116 
f 31//31 34//34 69//69 
f 91//91 63//63 67//67 
f 415//415 411//411 392//392 
f 76//76 72//72 78//78 
f 283//283 281//281 41//41 
f 76//76 68//68 72//72 
f 268//268 265//265 270//270 
f 285//285 283//283 46//46 
f 491//491 334//334 588//588 
f 585//585 613//613 596//596 
f 2//2 616//616 6//6 
f 45//45 97//97 218//218 
f 59//59 79//79 65//65 
f 62//62 57//57 167//167 
f 74//74 97//97 99//99 
f 74//74 13//13 218//218 
f 515//515 513//513 516//516 
f 517//517 348//348 442//442 
f 62//62 167//167 168//168 
f 520//520 500//500 518//518 
f 539//539 531//531 543//543 
f 572//572 571//571 584//584 
f 395//395 393//393 322//322 
f 215//215 207//207 213//213 
f 351//351 379//379 355//355 
f 63//63 91//91 89//89 
f 19//19 7//7 14//14 
f 378//378 154//154 383//383 
f 64//64 65//65 66//66 
f 395//395 322//322 341//341 
f 447//447 291//291 445//445 
f 184//184 85//85 171//171 
f 184//184 171//171 169//169 
f 73//73 52//52 68//68 
f 575//575 574//574 583//583 
f 415//415 407//407 409//409 
f 518//518 498//498 516//516 
f 572//572 584//584 592//592 
f 13//13 9//9 218//218 
f 199//199 175//175 200//200 
f 318//318 162//162 311//311 
f 79//79 61//61 62//62 
f 334//334 309//309 588//588 
f 59//59 56//56 61//61 
f 217//217 405//405 212//212 
f 16//16 17//17 222//222 
f 523//523 75//75 73//73 
f 399//399 395//395 400//400 
f 293//293 294//294 297//297 
f 397//397 394//394 396//396 
f 31//31 69//69 32//32 
f 104//104 98//98 108//108 
f 81//81 79//79 62//62 
f 16//16 20//20 17//17 
f 121//121 122//122 136//136 
f 20//20 14//14 17//17 
f 102//102 101//101 107//107 
f 57//57 222//222 112//112 
f 79//79 59//59 61//61 
f 198//198 202//202 204//204 
f 213//213 207//207 180//180 
f 66//66 29//29 32//32 
f 69//69 66//66 32//32 
f 218//218 97//97 74//74 
f 85//85 168//168 171//171 
f 76//76 73//73 68//68 
f 54//54 37//37 46//46 
f 80//80 83//83 65//65 
f 34//34 25//25 270//270 
f 282//282 278//278 280//280 
f 121//121 95//95 113//113 
f 302//302 344//344 303//303 
f 184//184 169//169 196//196 
f 170//170 176//176 174//174 
f 529//529 98//98 100//100 
f 533//533 529//529 542//542 
f 318//318 316//316 320//320 
f 86//86 81//81 85//85 
f 122//122 74//74 99//99 
f 80//80 65//65 79//79 
f 60//60 6//6 11//11 
f 65//65 83//83 29//29 
f 265//265 263//263 267//267 
f 524//524 512//512 75//75 
f 78//78 72//72 306//306 
f 74//74 70//70 13//13 
f 403//403 404//404 580//580 
f 26//26 23//23 27//27 
f 306//306 72//72 71//71 
f 297//297 298//298 71//71 
f 71//71 69//69 35//35 
f 98//98 84//84 86//86 
f 102//102 94//94 101//101 
f 98//98 86//86 85//85 
f 95//95 77//77 113//113 
f 44//44 40//40 42//42 
f 615//615 11//11 70//70 
f 64//64 66//66 68//68 
f 106//106 105//105 107//107 
f 105//105 306//306 333//333 
f 121//121 113//113 122//122 
f 519//519 588//588 311//311 
f 297//297 270//270 293//293 
f 127//127 99//99 276//276 
f 11//11 13//13 70//70 
f 93//93 90//90 101//101 
f 92//92 53//53 89//89 
f 66//66 65//65 29//29 
f 104//104 84//84 98//98 
f 318//318 320//320 162//162 
f 9//9 616//616 218//218 
f 106//106 107//107 531//531 
f 106//106 103//103 105//105 
f 89//89 91//91 246//246 
f 93//93 83//83 90//90 
f 82//82 80//80 86//86 
f 157//157 170//170 92//92 
f 107//107 105//105 102//102 
f 88//88 85//85 184//184 
f 283//283 285//285 287//287 
f 84//84 82//82 86//86 
f 320//320 602//602 162//162 
f 197//197 185//185 201//201 
f 598//598 525//525 519//519 
f 42//42 32//32 29//29 
f 42//42 29//29 83//83 
f 175//175 99//99 208//208 
f 512//512 511//511 75//75 
f 320//320 316//316 317//317 
f 531//531 107//107 533//533 
f 320//320 317//317 319//319 
f 72//72 68//68 69//69 
f 316//316 312//312 314//314 
f 316//316 314//314 317//317 
f 120//120 123//123 128//128 
f 99//99 175//175 276//276 
f 21//21 112//112 222//222 
f 443//443 444//444 448//448 
f 570//570 566//566 568//568 
f 447//447 443//443 446//446 
f 132//132 133//133 129//129 
f 562//562 557//557 561//561 
f 56//56 16//16 222//222 
f 173//173 165//165 172//172 
f 178//178 173//173 172//172 
f 447//447 485//485 291//291 
f 211//211 212//212 207//207 
f 87//87 70//70 74//74 
f 577//577 576//576 575//575 
f 68//68 66//66 69//69 
f 157//157 89//89 246//246 
f 53//53 58//58 89//89 
f 563//563 558//558 404//404 
f 97//97 45//45 55//55 
f 264//264 95//95 135//135 
f 557//557 562//562 560//560 
f 55//55 208//208 97//97 
f 532//532 465//465 489//489 
f 112//112 21//21 120//120 
f 120//120 118//118 123//123 
f 75//75 51//51 73//73 
f 16//16 3//3 20//20 
f 95//95 121//121 135//135 
f 95//95 91//91 77//77 
f 112//112 120//120 114//114 
f 124//124 132//132 129//129 
f 126//126 125//125 111//111 
f 129//129 128//128 124//124 
f 126//126 111//111 557//557 
f 135//135 121//121 136//136 
f 559//559 560//560 566//566 
f 222//222 17//17 21//21 
f 208//208 99//99 97//97 
f 208//208 92//92 170//170 
f 115//115 128//128 133//133 
f 115//115 133//133 130//130 
f 55//55 53//53 92//92 
f 405//405 209//209 212//212 
f 591//591 587//587 565//565 
f 166//166 30//30 117//117 
f 590//590 182//182 589//589 
f 149//149 155//155 152//152 
f 166//166 137//137 164//164 
f 152//152 148//148 149//149 
f 30//30 116//116 130//130 
f 617//617 165//165 166//166 
f 606//606 613//613 608//608 
f 149//149 148//148 138//138 
f 558//558 343//343 548//548 
f 321//321 336//336 328//328 
f 141//141 138//138 146//146 
f 234//234 228//228 233//233 
f 220//220 215//215 214//214 
f 417//417 416//416 418//418 
f 203//203 204//204 549//549 
f 451//451 449//449 450//450 
f 370//370 328//328 369//369 
f 146//146 359//359 361//361 
f 171//171 168//168 186//186 
f 219//219 202//202 217//217 
f 417//417 405//405 416//416 
f 140//140 239//239 365//365 
f 171//171 186//186 183//183 
f 186//186 173//173 142//142 
f 185//185 169//169 183//183 
f 85//85 81//81 168//168 
f 146//146 138//138 139//139 
f 101//101 90//90 84//84 
f 337//337 336//336 335//335 
f 143//143 134//134 205//205 
f 158//158 152//152 155//155 
f 393//393 328//328 336//336 
f 219//219 211//211 215//215 
f 142//142 134//134 143//143 
f 146//146 140//140 359//359 
f 383//383 379//379 376//376 
f 441//441 440//440 439//439 
f 186//186 142//142 183//183 
f 219//219 215//215 220//220 
f 370//370 287//287 328//328 
f 140//140 146//146 139//139 
f 358//358 351//351 355//355 
f 142//142 173//173 134//134 
f 169//169 171//171 183//183 
f 356//356 358//358 355//355 
f 354//354 352//352 353//353 
f 353//353 379//379 380//380 
f 452//452 353//353 380//380 
f 426//426 423//423 429//429 
f 410//410 375//375 390//390 
f 155//155 205//205 207//207 
f 175//175 174//174 200//200 
f 376//376 378//378 383//383 
f 213//213 180//180 182//182 
f 187//187 185//185 183//183 
f 600//600 599//599 601//601 
f 420//420 418//418 403//403 
f 148//148 150//150 284//284 
f 89//89 58//58 63//63 
f 419//419 109//109 429//429 
f 206//206 177//177 179//179 
f 472//472 161//161 388//388 
f 418//418 416//416 402//402 
f 458//458 463//463 462//462 
f 212//212 209//209 207//207 
f 179//179 131//131 578//578 
f 472//472 388//388 471//471 
f 209//209 155//155 207//207 
f 474//474 472//472 471//471 
f 480//480 392//392 391//391 
f 180//180 179//179 181//181 
f 180//180 181//181 182//182 
f 474//474 471//471 484//484 
f 496//496 420//420 582//582 
f 61//61 222//222 57//57 
f 116//116 30//30 164//164 
f 155//155 143//143 205//205 
f 207//207 206//206 180//180 
f 164//164 112//112 114//114 
f 167//167 57//57 137//137 
f 307//307 306//306 298//298 
f 172//172 177//177 178//178 
f 205//205 134//134 178//178 
f 176//176 157//157 310//310 
f 166//166 165//165 137//137 
f 137//137 163//163 164//164 
f 186//186 168//168 137//137 
f 614//614 604//604 435//435 
f 407//407 484//484 409//409 
f 484//484 471//471 409//409 
f 83//83 80//80 82//82 
f 217//217 211//211 219//219 
f 90//90 83//83 82//82 
f 284//284 150//150 239//239 
f 139//139 239//239 140//140 
f 174//174 381//381 200//200 
f 168//168 167//167 137//137 
f 164//164 114//114 116//116 
f 117//117 30//30 131//131 
f 67//67 60//60 615//615 
f 67//67 615//615 77//77 
f 181//181 578//578 579//579 
f 587//587 181//181 579//579 
f 442//442 437//437 444//444 
f 161//161 384//384 160//160 
f 207//207 205//205 206//206 
f 384//384 156//156 160//160 
f 445//445 517//517 447//447 
f 182//182 587//587 589//589 
f 179//179 117//117 131//131 
f 177//177 172//172 617//617 
f 179//179 617//617 117//117 
f 617//617 179//179 177//177 
f 611//611 605//605 327//327 
f 587//587 579//579 565//565 
f 206//206 179//179 180//180 
f 186//186 137//137 173//173 
f 214//214 213//213 590//590 
f 486//486 214//214 590//590 
f 593//593 597//597 603//603 
f 612//612 607//607 600//600 
f 170//170 157//157 176//176 
f 181//181 179//179 578//578 
f 90//90 82//82 84//84 
f 204//204 202//202 219//219 
f 163//163 137//137 57//57 
f 174//174 175//175 170//170 
f 141//141 146//146 147//147 
f 138//138 141//141 149//149 
f 402//402 403//403 418//418 
f 376//376 351//351 382//382 
f 599//599 196//196 197//197 
f 599//599 197//197 198//198 
f 610//610 606//606 612//612 
f 361//361 359//359 360//360 
f 361//361 360//360 362//362 
f 536//536 540//540 541//541 
f 217//217 202//202 194//194 
f 201//201 185//185 187//187 
f 266//266 299//299 339//339 
f 92//92 89//89 157//157 
f 613//613 606//606 610//610 
f 144//144 141//141 147//147 
f 394//394 397//397 361//361 
f 607//607 542//542 195//195 
f 321//321 96//96 335//335 
f 192//192 187//187 189//189 
f 609//609 607//607 606//606 
f 101//101 84//84 104//104 
f 163//163 112//112 164//164 
f 536//536 534//534 540//540 
f 80//80 79//79 81//81 
f 157//157 246//246 256//256 
f 361//361 362//362 394//394 
f 394//394 364//364 369//369 
f 543//543 537//537 541//541 
f 192//192 189//189 190//190 
f 406//406 209//209 405//405 
f 394//394 369//369 393//393 
f 174//174 176//176 381//381 
f 396//396 394//394 393//393 
f 396//396 393//393 395//395 
f 149//149 141//141 143//143 
f 164//164 30//30 166//166 
f 250//250 249//249 549//549 
f 147//147 146//146 361//361 
f 155//155 149//149 143//143 
f 190//190 147//147 361//361 
f 52//52 64//64 68//68 
f 482//482 480//480 462//462 
f 410//410 389//389 411//411 
f 338//338 326//326 339//339 
f 612//612 605//605 611//611 
f 435//435 199//199 200//200 
f 359//359 140//140 365//365 
f 411//411 389//389 391//391 
f 421//421 417//417 422//422 
f 443//443 442//442 444//444 
f 183//183 142//142 145//145 
f 453//453 161//161 472//472 
f 420//420 403//403 582//582 
f 470//470 453//453 472//472 
f 392//392 480//480 482//482 
f 582//582 403//403 580//580 
f 377//377 366//366 153//153 
f 473//473 470//470 472//472 
f 581//581 509//509 552//552 
f 597//597 593//593 594//594 
f 201//201 187//187 188//188 
f 250//250 1//1 249//249 
f 363//363 362//362 368//368 
f 63//63 33//33 60//60 
f 589//589 587//587 591//591 
f 213//213 182//182 590//590 
f 589//589 591//591 595//595 
f 220//220 204//204 219//219 
f 310//310 325//325 343//343 
f 176//176 310//310 315//315 
f 218//218 616//616 45//45 
f 593//593 589//589 594//594 
f 374//374 363//363 368//368 
f 248//248 233//233 231//231 
f 244//244 234//234 248//248 
f 303//303 274//274 279//279 
f 236//236 233//233 230//230 
f 8//8 10//10 4//4 
f 381//381 176//176 315//315 
f 335//335 340//340 337//337 
f 251//251 248//248 231//231 
f 282//282 286//286 289//289 
f 224//224 262//262 274//274 
f 294//294 292//292 247//247 
f 303//303 279//279 305//305 
f 230//230 233//233 228//228 
f 313//313 255//255 260//260 
f 324//324 289//289 323//323 
f 334//334 331//331 333//333 
f 238//238 223//223 235//235 
f 224//224 261//261 262//262 
f 241//241 226//226 435//435 
f 313//313 260//260 300//300 
f 248//248 234//234 233//233 
f 255//255 258//258 259//259 
f 300//300 314//314 313//313 
f 252//252 244//244 248//248 
f 254//254 253//253 255//255 
f 258//258 619//619 259//259 
f 231//231 233//233 236//236 
f 295//295 247//247 245//245 
f 247//247 227//227 244//244 
f 619//619 236//236 257//257 
f 619//619 257//257 259//259 
f 255//255 259//259 260//260 
f 241//241 556//556 465//465 
f 317//317 314//314 300//300 
f 312//312 254//254 313//313 
f 314//314 312//312 313//313 
f 344//344 301//301 342//342 
f 267//267 292//292 293//293 
f 274//274 272//272 279//279 
f 215//215 213//213 214//214 
f 232//232 221//221 228//228 
f 246//246 95//95 264//264 
f 255//255 253//253 258//258 
f 67//67 63//63 60//60 
f 254//254 245//245 252//252 
f 619//619 231//231 236//236 
f 335//335 332//332 334//334 
f 331//331 102//102 105//105 
f 295//295 294//294 247//247 
f 245//245 244//244 252//252 
f 295//295 254//254 312//312 
f 254//254 295//295 245//245 
f 309//309 307//307 308//308 
f 308//308 296//296 312//312 
f 310//310 157//157 256//256 
f 308//308 312//312 316//316 
f 403//403 402//402 401//401 
f 399//399 396//396 395//395 
f 400//400 395//395 341//341 
f 252//252 253//253 254//254 
f 305//305 302//302 303//303 
f 296//296 294//294 295//295 
f 548//548 580//580 404//404 
f 261//261 232//232 225//225 
f 227//227 234//234 244//244 
f 244//244 245//245 247//247 
f 258//258 251//251 619//619 
f 259//259 243//243 242//242 
f 260//260 259//259 242//242 
f 235//235 221//221 261//261 
f 262//262 271//271 272//272 
f 238//238 235//235 224//224 
f 275//275 268//268 269//269 
f 260//260 242//242 344//344 
f 261//261 221//221 232//232 
f 237//237 236//236 230//230 
f 267//267 293//293 265//265 
f 234//234 232//232 228//228 
f 552//552 547//547 546//546 
f 342//342 260//260 344//344 
f 340//340 334//334 491//491 
f 238//238 224//224 290//290 
f 301//301 302//302 304//304 
f 274//274 262//262 272//272 
f 254//254 255//255 313//313 
f 328//328 287//287 285//285 
f 549//549 220//220 250//250 
f 46//46 37//37 40//40 
f 346//346 323//323 348//348 
f 339//339 602//602 338//338 
f 296//296 298//298 297//297 
f 446//446 448//448 449//449 
f 435//435 266//266 614//614 
f 403//403 401//401 399//399 
f 271//271 265//265 275//275 
f 46//46 44//44 321//321 
f 24//24 23//23 34//34 
f 277//277 271//271 275//275 
f 35//35 34//34 270//270 
f 349//349 346//346 348//348 
f 436//436 432//432 433//433 
f 278//278 269//269 280//280 
f 282//282 280//280 281//281 
f 280//280 26//26 27//27 
f 225//225 234//234 227//227 
f 230//230 228//228 223//223 
f 350//350 349//349 348//348 
f 345//345 327//327 603//603 
f 228//228 221//221 223//223 
f 237//237 223//223 238//238 
f 317//317 300//300 301//301 
f 446//446 449//449 485//485 
f 517//517 445//445 350//350 
f 36//36 24//24 40//40 
f 36//36 40//40 37//37 
f 280//280 27//27 38//38 
f 403//403 399//399 404//404 
f 243//243 237//237 238//238 
f 39//39 24//24 34//34 
f 54//54 38//38 37//37 
f 208//208 170//170 175//175 
f 25//25 23//23 26//26 
f 41//41 46//46 283//283 
f 336//336 321//321 335//335 
f 281//281 38//38 54//54 
f 230//230 223//223 237//237 
f 281//281 54//54 41//41 
f 25//25 26//26 268//268 
f 270//270 25//25 268//268 
f 376//376 379//379 351//351 
f 341//341 322//322 337//337 
f 286//286 281//281 283//283 
f 286//286 283//283 287//287 
f 362//362 360//360 368//368 
f 257//257 236//236 237//237 
f 286//286 282//282 281//281 
f 333//333 307//307 309//309 
f 436//436 431//431 432//432 
f 580//580 109//109 582//582 
f 250//250 220//220 214//214 
f 444//444 436//436 433//433 
f 55//55 92//92 208//208 
f 450//450 444//444 433//433 
f 342//342 300//300 260//260 
f 275//275 269//269 277//277 
f 77//77 615//615 87//87 
f 517//517 350//350 348//348 
f 435//435 226//226 229//229 
f 262//262 261//261 271//271 
f 54//54 46//46 41//41 
f 223//223 221//221 235//235 
f 344//344 240//240 303//303 
f 556//556 315//315 343//343 
f 32//32 39//39 31//31 
f 339//339 326//326 346//346 
f 217//217 194//194 193//193 
f 293//293 292//292 294//294 
f 113//113 77//77 87//87 
f 243//243 238//238 290//290 
f 252//252 248//248 251//251 
f 339//339 346//346 347//347 
f 249//249 327//327 605//605 
f 225//225 227//227 267//267 
f 344//344 242//242 240//240 
f 588//588 309//309 311//311 
f 280//280 38//38 281//281 
f 225//225 232//232 234//234 
f 301//301 300//300 342//342 
f 305//305 278//278 324//324 
f 242//242 290//290 240//240 
f 271//271 261//261 263//263 
f 271//271 263//263 265//265 
f 496//496 422//422 420//420 
f 289//289 329//329 323//323 
f 339//339 299//299 525//525 
f 276//276 199//199 604//604 
f 252//252 251//251 253//253 
f 34//34 23//23 25//25 
f 531//531 533//533 542//542 
f 614//614 350//350 445//445 
f 98//98 88//88 100//100 
f 451//451 440//440 441//441 
f 268//268 26//26 269//269 
f 309//309 308//308 318//318 
f 311//311 309//309 318//318 
f 402//402 193//193 401//401 
f 429//429 423//423 428//428 
f 296//296 295//295 312//312 
f 258//258 253//253 251//251 
f 292//292 227//227 247//247 
f 574//574 508//508 509//509 
f 431//431 434//434 371//371 
f 317//317 301//301 304//304 
f 338//338 317//317 304//304 
f 289//289 288//288 329//329 
f 297//297 294//294 296//296 
f 326//326 324//324 323//323 
f 306//306 71//71 298//298 
f 273//273 271//271 277//277 
f 279//279 273//273 277//277 
f 285//285 46//46 321//321 
f 525//525 602//602 339//339 
f 336//336 337//337 322//322 
f 393//393 336//336 322//322 
f 321//321 44//44 96//96 
f 428//428 423//423 430//430 
f 499//499 532//532 588//588 
f 334//334 333//333 309//309 
f 269//269 26//26 280//280 
f 567//567 489//489 563//563 
f 289//289 286//286 288//288 
f 374//374 368//368 375//375 
f 279//279 277//277 278//278 
f 333//333 306//306 307//307 
f 523//523 76//76 103//103 
f 523//523 73//73 76//76 
f 533//533 104//104 108//108 
f 44//44 42//42 83//83 
f 93//93 44//44 83//83 
f 526//526 103//103 530//530 
f 347//347 266//266 339//339 
f 194//194 192//192 193//193 
f 614//614 266//266 350//350 
f 194//194 188//188 192//192 
f 318//318 308//308 316//316 
f 298//298 296//296 308//308 
f 602//602 319//319 338//338 
f 598//598 602//602 525//525 
f 603//603 327//327 1//1 
f 430//430 422//422 428//428 
f 328//328 285//285 321//321 
f 96//96 44//44 93//93 
f 525//525 497//497 519//519 
f 519//519 499//499 588//588 
f 188//188 187//187 192//192 
f 324//324 278//278 282//282 
f 538//538 526//526 530//530 
f 367//367 216//216 514//514 
f 532//532 491//491 588//588 
f 304//304 305//305 338//338 
f 206//206 178//178 177//177 
f 332//332 94//94 102//102 
f 598//598 311//311 162//162 
f 96//96 93//93 94//94 
f 332//332 102//102 331//331 
f 235//235 261//261 224//224 
f 419//419 429//429 428//428 
f 438//438 514//514 216//216 
f 431//431 371//371 374//374 
f 341//341 337//337 340//340 
f 563//563 343//343 558//558 
f 331//331 105//105 333//333 
f 445//445 291//291 604//604 
f 301//301 344//344 302//302 
f 434//434 431//431 436//436 
f 326//326 338//338 324//324 
f 348//348 48//48 442//442 
f 519//519 311//311 598//598 
f 371//371 372//372 374//374 
f 611//611 345//345 610//610 
f 291//291 136//136 127//127 
f 602//602 598//598 162//162 
f 602//602 320//320 319//319 
f 449//449 264//264 135//135 
f 305//305 279//279 278//278 
f 338//338 305//305 324//324 
f 612//612 601//601 605//605 
f 437//437 442//442 436//436 
f 276//276 175//175 199//199 
f 355//355 379//379 353//353 
f 355//355 353//353 352//352 
f 356//356 352//352 357//357 
f 459//459 357//357 466//466 
f 390//390 386//386 389//389 
f 383//383 154//154 156//156 
f 466//466 467//467 468//468 
f 479//479 476//476 478//478 
f 460//460 358//358 459//459 
f 325//325 310//310 441//441 
f 460//460 459//459 464//464 
f 463//463 460//460 464//464 
f 463//463 458//458 460//460 
f 466//466 468//468 469//469 
f 406//406 408//408 409//409 
f 471//471 406//406 409//409 
f 343//343 325//325 367//367 
f 479//479 481//481 469//469 
f 474//474 478//478 476//476 
f 468//468 456//456 620//620 
f 187//187 183//183 145//145 
f 139//139 148//148 284//284 
f 148//148 139//139 138//138 
f 153//153 239//239 150//150 
f 371//371 288//288 370//370 
f 144//144 142//142 141//141 
f 390//390 375//375 386//386 
f 158//158 151//151 152//152 
f 372//372 364//364 363//363 
f 212//212 211//211 217//217 
f 142//142 143//143 141//141 
f 365//365 239//239 366//366 
f 365//365 360//360 359//359 
f 426//426 373//373 425//425 
f 378//378 376//376 385//385 
f 556//556 343//343 563//563 
f 431//431 374//374 432//432 
f 374//374 372//372 363//363 
f 369//369 328//328 393//393 
f 369//369 364//364 372//372 
f 370//370 369//369 372//372 
f 323//323 48//48 348//348 
f 405//405 217//217 416//416 
f 367//367 325//325 373//373 
f 426//426 216//216 373//373 
f 445//445 604//604 614//614 
f 441//441 256//256 451//451 
f 485//485 447//447 446//446 
f 558//558 548//548 404//404 
f 387//387 386//386 377//377 
f 384//384 161//161 453//453 
f 159//159 158//158 210//210 
f 360//360 365//365 366//366 
f 386//386 366//366 377//377 
f 381//381 315//315 556//556 
f 347//347 346//346 349//349 
f 239//239 153//153 366//366 
f 461//461 459//459 466//466 
f 485//485 136//136 291//291 
f 481//481 478//478 482//482 
f 356//356 355//355 352//352 
f 399//399 400//400 404//404 
f 455//455 389//389 387//387 
f 353//353 452//452 354//354 
f 153//153 151//151 154//154 
f 489//489 340//340 491//491 
f 454//454 453//453 470//470 
f 549//549 249//249 605//605 
f 466//466 354//354 467//467 
f 475//475 470//470 473//473 
f 377//377 153//153 378//378 
f 424//424 413//413 414//414 
f 457//457 385//385 382//382 
f 384//384 453//453 454//454 
f 160//160 159//159 210//210 
f 389//389 386//386 387//387 
f 391//391 389//389 455//455 
f 383//383 156//156 380//380 
f 413//413 411//411 415//415 
f 284//284 239//239 139//139 
f 150//150 148//148 152//152 
f 414//414 415//415 421//421 
f 153//153 150//150 151//151 
f 150//150 152//152 151//151 
f 390//390 389//389 410//410 
f 457//457 382//382 358//358 
f 356//356 357//357 459//459 
f 387//387 377//377 385//385 
f 466//466 357//357 354//354 
f 392//392 407//407 415//415 
f 370//370 372//372 371//371 
f 145//145 142//142 144//144 
f 145//145 144//144 189//189 
f 432//432 374//374 375//375 
f 432//432 375//375 412//412 
f 549//549 204//204 220//220 
f 363//363 364//364 362//362 
f 187//187 145//145 189//189 
f 156//156 154//154 159//159 
f 189//189 144//144 147//147 
f 425//425 373//373 439//439 
f 256//256 246//246 264//264 
f 433//433 398//398 439//439 
f 440//440 433//433 439//439 
f 451//451 256//256 264//264 
f 485//485 135//135 136//136 
f 415//415 409//409 421//421 
f 93//93 101//101 94//94 
f 241//241 381//381 556//556 
f 375//375 368//368 366//366 
f 368//368 360//360 366//366 
f 605//605 203//203 549//549 
f 154//154 151//151 159//159 
f 189//189 147//147 190//190 
f 397//397 190//190 361//361 
f 404//404 400//400 567//567 
f 435//435 604//604 199//199 
f 412//412 375//375 410//410 
f 425//425 398//398 412//412 
f 214//214 486//486 250//250 
f 211//211 207//207 215//215 
f 417//417 420//420 422//422 
f 582//582 419//419 496//496 
f 417//417 418//418 420//420 
f 458//458 457//457 460//460 
f 582//582 109//109 419//419 
f 482//482 484//484 407//407 
f 156//156 159//159 160//160 
f 387//387 385//385 455//455 
f 423//423 424//424 427//427 
f 430//430 423//423 427//427 
f 482//482 407//407 392//392 
f 377//377 378//378 385//385 
f 409//409 408//408 421//421 
f 427//427 414//414 421//421 
f 388//388 210//210 406//406 
f 406//406 405//405 408//408 
f 327//327 345//345 611//611 
f 408//408 405//405 417//417 
f 563//563 404//404 567//567 
f 217//217 193//193 402//402 
f 158//158 155//155 209//209 
f 315//315 310//310 343//343 
f 210//210 158//158 209//209 
f 416//416 217//217 402//402 
f 161//161 160//160 210//210 
f 388//388 161//161 210//210 
f 471//471 388//388 406//406 
f 210//210 209//209 406//406 
f 489//489 341//341 340//340 
f 425//425 424//424 426//426 
f 427//427 422//422 430//430 
f 427//427 421//421 422//422 
f 329//329 288//288 371//371 
f 291//291 276//276 604//604 
f 329//329 434//434 48//48 
f 434//434 329//329 371//371 
f 288//288 286//286 287//287 
f 291//291 127//127 276//276 
f 449//449 451//451 264//264 
f 288//288 287//287 370//370 
f 412//412 413//413 424//424 
f 398//398 432//432 412//412 
f 450//450 433//433 440//440 
f 442//442 48//48 434//434 
f 442//442 434//434 436//436 
f 241//241 200//200 381//381 
f 451//451 450//450 440//440 
f 412//412 410//410 413//413 
f 373//373 325//325 441//441 
f 439//439 373//373 441//441 
f 323//323 329//329 48//48 
f 448//448 444//444 450//450 
f 449//449 448//448 450//450 
f 216//216 429//429 438//438 
f 437//437 436//436 444//444 
f 517//517 442//442 443//443 
f 448//448 446//446 443//443 
f 401//401 193//193 192//192 
f 567//567 400//400 341//341 
f 580//580 548//548 109//109 
f 358//358 356//356 459//459 
f 462//462 463//463 481//481 
f 411//411 413//413 410//410 
f 380//380 379//379 383//383 
f 411//411 391//391 392//392 
f 478//478 474//474 484//484 
f 467//467 354//354 456//456 
f 380//380 156//156 384//384 
f 611//611 610//610 612//612 
f 429//429 216//216 426//426 
f 481//481 479//479 478//478 
f 476//476 483//483 477//477 
f 457//457 358//358 460//460 
f 475//475 454//454 470//470 
f 477//477 473//473 476//476 
f 457//457 458//458 391//391 
f 620//620 477//477 483//483 
f 469//469 483//483 479//479 
f 483//483 469//469 468//468 
f 352//352 354//354 357//357 
f 343//343 514//514 548//548 
f 378//378 153//153 154//154 
f 334//334 332//332 331//331 
f 464//464 459//459 461//461 
f 482//482 462//462 481//481 
f 464//464 461//461 469//469 
f 456//456 454//454 475//475 
f 475//475 477//477 620//620 
f 481//481 464//464 469//469 
f 469//469 461//461 466//466 
f 481//481 463//463 464//464 
f 391//391 455//455 457//457 
f 385//385 376//376 382//382 
f 620//620 456//456 475//475 
f 452//452 380//380 384//384 
f 454//454 452//452 384//384 
f 159//159 151//151 158//158 
f 455//455 385//385 457//457 
f 354//354 452//452 454//454 
f 413//413 415//415 414//414 
f 109//109 514//514 438//438 
f 476//476 473//473 474//474 
f 473//473 472//472 474//474 
f 391//391 458//458 480//480 
f 477//477 475//475 473//473 
f 468//468 467//467 456//456 
f 483//483 476//476 479//479 
f 484//484 482//482 478//478 
f 456//456 354//354 454//454 
f 480//480 458//458 462//462 
f 382//382 351//351 358//358 
f 514//514 109//109 548//548 
f 133//133 128//128 129//129 
f 424//424 414//414 427//427 
f 4//4 10//10 17//17 
f 493//493 488//488 490//490 
f 490//490 5//5 19//19 
f 96//96 94//94 332//332 
f 539//539 538//538 530//530 
f 118//118 10//10 8//8 
f 125//125 118//118 119//119 
f 5//5 7//7 19//19 
f 429//429 109//109 438//438 
f 599//599 203//203 601//601 
f 192//192 397//397 401//401 
f 508//508 503//503 507//507 
f 465//465 563//563 489//489 
f 119//119 110//110 111//111 
f 426//426 424//424 423//423 
f 330//330 465//465 532//532 
f 119//119 111//111 125//125 
f 330//330 532//532 499//499 
f 111//111 110//110 554//554 
f 4//4 17//17 7//7 
f 4//4 7//7 5//5 
f 554//554 488//488 494//494 
f 501//501 495//495 492//492 
f 554//554 487//487 488//488 
f 503//503 502//502 507//507 
f 577//577 571//571 570//570 
f 132//132 126//126 555//555 
f 576//576 568//568 564//564 
f 492//492 488//488 493//493 
f 545//545 544//544 520//520 
f 507//507 501//501 504//504 
f 488//488 5//5 490//490 
f 495//495 501//501 507//507 
f 561//561 495//495 502//502 
f 502//502 495//495 507//507 
f 501//501 500//500 505//505 
f 551//551 520//520 521//521 
f 574//574 573//573 503//503 
f 568//568 562//562 564//564 
f 497//497 330//330 499//499 
f 568//568 560//560 562//562 
f 501//501 492//492 493//493 
f 565//565 566//566 569//569 
f 576//576 564//564 574//574 
f 576//576 574//574 575//575 
f 493//493 498//498 501//501 
f 570//570 568//568 576//576 
f 493//493 490//490 498//498 
f 498//498 490//490 516//516 
f 192//192 190//190 397//397 
f 577//577 570//570 576//576 
f 128//128 115//115 120//120 
f 56//56 222//222 61//61 
f 17//17 10//10 21//21 
f 425//425 412//412 424//424 
f 19//19 14//14 20//20 
f 50//50 19//19 20//20 
f 527//527 524//524 528//528 
f 545//545 520//520 551//551 
f 527//527 512//512 524//524 
f 546//546 545//545 550//550 
f 65//65 64//64 59//59 
f 61//61 57//57 62//62 
f 49//49 16//16 47//47 
f 552//552 546//546 550//550 
f 552//552 550//550 553//553 
f 439//439 398//398 425//425 
f 520//520 518//518 521//521 
f 508//508 507//507 504//504 
f 546//546 547//547 545//545 
f 618//618 522//522 534//534 
f 553//553 618//618 534//534 
f 1//1 327//327 249//249 
f 195//195 600//600 607//607 
f 559//559 566//566 565//565 
f 609//609 542//542 607//607 
f 105//105 78//78 306//306 
f 50//50 3//3 49//49 
f 511//511 51//51 75//75 
f 69//69 71//71 72//72 
f 428//428 422//422 496//496 
f 497//497 499//499 519//519 
f 299//299 497//497 525//525 
f 530//530 531//531 539//539 
f 530//530 103//103 106//106 
f 397//397 396//396 399//399 
f 419//419 428//428 496//496 
f 401//401 397//397 399//399 
f 86//86 80//80 81//81 
f 533//533 107//107 104//104 
f 543//543 531//531 542//542 
f 107//107 101//101 104//104 
f 524//524 523//523 526//526 
f 528//528 524//524 526//526 
f 103//103 76//76 78//78 
f 105//105 103//103 78//78 
f 529//529 100//100 195//195 
f 529//529 195//195 542//542 
f 324//324 282//282 289//289 
f 229//229 226//226 330//330 
f 528//528 538//538 540//540 
f 465//465 556//556 563//563 
f 550//550 545//545 551//551 
f 618//618 551//551 522//522 
f 299//299 330//330 497//497 
f 550//550 551//551 618//618 
f 421//421 408//408 417//417 
f 542//542 535//535 543//543 
f 543//543 12//12 539//539 
f 195//195 100//100 196//196 
f 536//536 541//541 537//537 
f 608//608 537//537 609//609 
f 195//195 196//196 599//599 
f 195//195 599//599 600//600 
f 528//528 526//526 538//538 
f 532//532 489//489 491//491 
f 607//607 612//612 606//606 
f 530//530 106//106 531//531 
f 524//524 75//75 523//523 
f 108//108 98//98 529//529 
f 330//330 299//299 229//229 
f 108//108 529//529 533//533 
f 581//581 552//552 553//553 
f 547//547 18//18 544//544 
f 547//547 544//544 545//545 
f 304//304 302//302 305//305 
f 551//551 512//512 522//522 
f 49//49 47//47 52//52 
f 516//516 513//513 521//521 
f 51//51 49//49 52//52 
f 51//51 52//52 73//73 
f 513//513 511//511 521//521 
f 498//498 518//518 500//500 
f 612//612 600//600 601//601 
f 574//574 503//503 508//508 
f 592//592 584//584 586//586 
f 592//592 565//565 572//572 
f 583//583 574//574 509//509 
f 501//501 498//498 500//500 
f 510//510 50//50 513//513 
f 537//537 608//608 536//536 
f 505//505 500//500 18//18 
f 521//521 512//512 551//551 
f 506//506 18//18 547//547 
f 8//8 110//110 119//119 
f 349//349 350//350 266//266 
f 555//555 126//126 557//557 
f 594//594 595//595 586//586 
f 494//494 492//492 495//495 
f 560//560 555//555 557//557 
f 594//594 589//589 595//595 
f 583//583 509//509 581//581 
f 130//130 116//116 115//115 
f 131//131 133//133 578//578 
f 579//579 559//559 565//565 
f 577//577 583//583 191//191 
f 373//373 216//216 367//367 
f 504//504 505//505 506//506 
f 557//557 554//554 494//494 
f 569//569 571//571 572//572 
f 509//509 508//508 552//552 
f 569//569 566//566 570//570 
f 571//571 569//569 570//570 
f 573//573 574//574 564//564 
f 566//566 560//560 568//568 
f 486//486 590//590 593//593 
f 595//595 591//591 592//592 
f 131//131 130//130 133//133 
f 335//335 96//96 332//332 
f 567//567 341//341 489//489 
f 494//494 488//488 492//492 
f 307//307 298//298 308//308 
f 591//591 565//565 592//592 
f 64//64 47//47 59//59 
f 584//584 585//585 586//586 
f 500//500 544//544 18//18 
f 562//562 561//561 573//573 
f 564//564 562//562 573//573 
f 191//191 571//571 577//577 
f 501//501 505//505 504//504 
f 593//593 603//603 486//486 
f 494//494 495//495 561//561 
f 575//575 583//583 577//577 
f 573//573 561//561 502//502 
f 578//578 132//132 559//559 
f 131//131 30//30 130//130 
f 123//123 118//118 125//125 
f 552//552 506//506 547//547 
f 583//583 581//581 585//585 
f 345//345 603//603 597//597 
f 133//133 132//132 578//578 
f 584//584 571//571 191//191 
f 584//584 191//191 585//585 
f 595//595 592//592 586//586 
f 578//578 559//559 579//579 
f 586//586 585//585 596//596 
f 518//518 516//516 521//521 
f 198//198 201//201 202//202 
f 608//608 553//553 536//536 
f 601//601 203//203 605//605 
f 266//266 229//229 299//299 
f 345//345 597//597 596//596 
f 565//565 569//569 572//572 
f 540//540 538//538 12//12 
f 541//541 12//12 543//543 
f 124//124 126//126 132//132 
f 136//136 122//122 127//127 
f 198//198 203//203 599//599 
f 246//246 91//91 95//95 
f 197//197 169//169 185//185 
f 330//330 226//226 465//465 
f 173//173 137//137 165//165 
f 178//178 206//206 205//205 
f 250//250 486//486 1//1 
f 134//134 173//173 178//178 
f 182//182 181//181 587//587 
f 124//124 123//123 125//125 
f 132//132 555//555 559//559 
f 345//345 596//596 610//610 
f 486//486 603//603 1//1 
f 319//319 317//317 338//338 
f 597//597 594//594 596//596 
f 98//98 85//85 88//88 
f 613//613 581//581 608//608 
f 538//538 539//539 12//12 
f 581//581 553//553 608//608 
f 522//522 527//527 528//528 
f 609//609 537//537 535//535 
f 201//201 188//188 194//194 
f 542//542 609//609 535//535 
f 201//201 194//194 202//202 
f 346//346 326//326 323//323 
f 196//196 88//88 184//184 
f 535//535 537//537 543//543 
f 540//540 522//522 528//528 
f 203//203 198//198 204//204 
f 593//593 590//590 589//589 
f 596//596 613//613 610//610 
f 198//198 197//197 201//201 
f 113//113 87//87 122//122 
f 2//2 22//22 616//616 
f 60//60 11//11 621//621 
f 11//11 615//615 621//621 
f 615//615 60//60 621//621 
f 119//119 118//118 622//622 
f 118//118 8//8 622//622 
f 8//8 119//119 622//622 
f 2//2 15//15 623//623 
f 15//15 22//22 623//623 
f 22//22 2//2 623//623 
f 166//166 117//117 624//624 
f 117//117 617//617 624//624 
f 617//617 166//166 624//624 
f 56//56 59//59 625//625 
f 59//59 47//47 625//625 
f 47//47 56//56 625//625 
f 81//81 62//62 626//626 
f 62//62 168//168 626//626 
f 168//168 81//81 626//626 
f 596//596 594//594 627//627 
f 594//594 586//586 627//627 
f 586//586 596//596 627//627 
f 573//573 502//502 628//628 
f 502//502 503//503 628//628 
f 503//503 573//573 628//628 
f 553//553 550//550 629//629 
f 550//550 618//618 629//629 
f 618//618 553//553 629//629 
f 606//606 608//608 630//630 
f 608//608 609//609 630//630 
f 609//609 606//606 630//630 
f 251//251 231//231 631//631 
f 231//231 619//619 631//631 
f 619//619 251//251 631//631 
f 483//483 468//468 632//632 
f 468//468 620//620 632//632 
f 620//620 483//483 632//632 
