# PIPER geometrical reference model based on a manual segmentation. See the
# documentation for more info.
# Author: CEESAR, SOTON, UCBL-Ifsttar
# Version: 1.0.0
# License: Creative Commons Attribution 4.0 International License.
# (https://creativecommons.org/licenses/by/4.0/)
# 
# This work has received funding from the European Union Seventh Framework
# Program ([FP7/2007-2013]) under grant agreement 605544 [PIPER project]).
# Contributors include Pierre Maillez, Christophe Lecomte (SOTON), Erwan
# Jolivet (CEESAR), Philippe Beillas (UCBL-Ifsttar)
# This work is derived from a CT scan provided by CEESAR under a CCBY-4.0
# License
# 
# wavefront obj file written by the visualization toolkit

mtllib C:/desktop/registration_reference_model/22_REF_LTE635_Assembly_hands_corr/CCTu635_BP127_ProximalPhalSecond_R.mtl

v 32.4805 263.158 -987.57
v 29.4679 263.992 -987.254
v 31.0939 260.546 -989.184
v 29.5857 261.829 -988.262
v 27.5984 262.8 -990.512
v 29.5444 260.624 -990.133
v 26.564 265.404 -991.493
v 28.039 263.002 -988.69
v 26.8815 266.521 -989.415
v 26.089 267.67 -991.344
v 27.1259 264.906 -994.892
v 28.6965 262.035 -992.008
v 30.3271 262.388 -994.063
v 30.611 264.27 -999.06
v 26.3623 266.812 -996.75
v 25.7494 267.709 -994.49
v 28.7607 264.221 -997.108
v 27.2619 266.037 -999.432
v 30.017 265.419 -1004.08
v 25.6037 269.018 -999.544
v 25.8678 267.797 -1000.65
v 26.9131 266.798 -1004
v 28.5435 265.674 -1003.19
v 27.4461 266.669 -1007.8
v 24.7155 269.043 -1005.13
v 31.4925 261.38 -987.896
v 35.3493 260.906 -990.214
v 37.2683 262.065 -989.8
v 32.0991 260.442 -990.772
v 35.3269 262.291 -994.526
v 36.3892 261.409 -992.362
v 37.6218 262.015 -991.451
v 34.0589 267.588 -988.147
v 35.198 264.862 -988.232
v 36.8239 262.441 -989.192
v 29.9339 267.306 -987.289
v 37.1826 268.233 -988.828
v 36.5224 266.928 -988.419
v 38.0332 263.655 -989.903
v 38.0667 264.088 -992.621
v 37.1523 264.512 -994.355
v 38.1741 265.707 -990.798
v 37.1983 268.601 -992.674
v 32.2489 262.725 -995.297
v 36.861 262.712 -993.962
v 34.6631 264.986 -997.596
v 32.8829 264.224 -998.057
v 32.9511 265.852 -1000.24
v 34.7702 266.399 -997.468
v 31.4964 265.21 -1001.62
v 33.5483 268.741 -999.252
v 32.1391 270.14 -1002.36
v 31.8882 265.841 -1002.63
v 31.9523 267.106 -1003.72
v 27.8652 269.506 -987.817
v 29.5337 272.126 -986.678
v 29.9538 273.748 -987.096
v 26.7042 269.778 -989.959
v 27.5656 271.795 -988.207
v 30.3975 274.56 -989.446
v 25.8954 269.268 -993.339
v 28.337 273.076 -989.972
v 31.1321 274.088 -992.528
v 25.7835 270.295 -996.646
v 26.9345 271.399 -992.542
v 25.8997 270.691 -998.711
v 28.9301 272.93 -994.711
v 27.2491 272.3 -998.822
v 29.035 273.072 -997.759
v 31.5817 273.376 -999.068
v 27.3129 273.119 -1003.32
v 29.064 273.414 -1000.86
v 25.8911 271.798 -1002.34
v 30.5563 273.384 -1002.2
v 31.9641 272.791 -986.387
v 36.2849 271.176 -988.08
v 34.7923 273.547 -987.334
v 33.632 274.388 -987.331
v 30.1062 269.424 -987.131
v 37.6712 268.087 -990.122
v 31.9134 274.726 -988.108
v 37.5101 272.932 -988.739
v 36.4285 274.662 -989.239
v 37.0332 274.743 -991.369
v 33.4722 275.44 -991.288
v 34.7581 274.877 -993.11
v 34.9257 275.506 -990.401
v 38.1667 273.727 -990.232
v 37.7829 273.526 -991.659
v 35.5399 267.902 -995.892
v 30.8949 273.645 -996.643
v 35.0362 271.253 -995.709
v 33.1656 273.379 -996.859
v 35.5668 274.086 -994.262
v 32.4545 272.532 -999.362
v 31.4355 272.021 -1003.42
v 24.6503 268.562 -1009.37
v 30.6322 265.642 -1005.65
v 29.9922 266.339 -1010.07
v 25.4487 267.802 -1008.94
v 31.778 266.26 -1004.74
v 30.8016 267.331 -1009.43
v 24.7228 268.903 -1016.28
v 27.527 266.781 -1012.01
v 25.8728 267.704 -1014.24
v 28.8004 266.284 -1010.85
v 29.0464 266.817 -1013.32
v 29.0658 267.517 -1015.47
v 29.8909 269.184 -1015.01
v 26.2119 267.615 -1018.27
v 24.9564 268.515 -1019.81
v 27.6368 267.203 -1016.75
v 29.1347 267.69 -1018.07
v 24.75 269.004 -1022.53
v 28.0592 266.907 -1021.52
v 30.4827 267.964 -1020.99
v 30.1559 270.675 -1018.33
v 29.9258 267 -1022.67
v 26.3919 267.672 -1021.97
v 26.0054 268.519 -1024.73
v 27.549 268.182 -1025.74
v 29.882 268.336 -1025.49
v 28.5229 269.817 -1026.57
v 31.5005 267.486 -1023.23
v 24.1889 269.885 -1010.72
v 24.8485 270.783 -1004.44
v 31.3057 270.295 -1006.06
v 26.5993 273.864 -1008.17
v 29.5135 273.959 -1004.42
v 30.726 273.753 -1007.1
v 30.5402 272.893 -1010.21
v 28.6225 274.499 -1007.77
v 30.1519 274.511 -1009.53
v 30.571 269.889 -1010.85
v 25.148 272.937 -1009.16
v 24.2106 271.324 -1011.15
v 24.2159 270.485 -1016.14
v 24.408 272.617 -1016.27
v 30.3642 267.698 -1012.23
v 30.0576 271.625 -1015.09
v 26.5916 275.043 -1013.13
v 25.3401 274.361 -1016.09
v 28.0061 275.162 -1011.54
v 29.0925 275.149 -1013.56
v 29.8273 273.823 -1014.05
v 25.7544 275.983 -1020.08
v 29.8479 274.544 -1017.22
v 30.5 273.114 -1019.71
v 28.8332 276.098 -1016.88
v 24.2616 273.096 -1021.68
v 24.8007 275.224 -1021.81
v 24.2039 270.117 -1021.64
v 24.8405 270.302 -1024.65
v 24.4633 273.438 -1024.02
v 31.4357 273.44 -1022.79
v 31.0449 273.724 -1021.34
v 30.2677 276.024 -1019.48
v 31.2077 271.048 -1024.26
v 25.4079 276.136 -1024.44
v 25.9041 276.124 -1025.38
v 30.902 274.199 -1024.57
v 27.5366 276.874 -1020.07
v 27.8514 276.322 -1017.09
v 29.9369 277.373 -1020.84
v 26.5753 276.91 -1022.95
v 29.8267 278.03 -1022.87
v 27.6428 277.432 -1024.78
v 29.9334 271.782 -1025.69
v 25.8825 270.366 -1025.81
v 29.4686 275.279 -1025.53
v 27.7893 272.618 -1026.14
v 29.4158 277.333 -1025.24
v 31.1834 270.596 -1022.19
v 31.1954 269.353 -1025.11
v 31.8374 275.446 -1022.55
v 31.4756 277.06 -1021.97
v 31.5797 277.295 -1024.03
v 26.3967 266.691 -991.037
v 25.4063 269.356 -1024.57
v 26.1254 276.605 -1023.64
vn 0.197256 -0.146276 0.969378
vn -0.296724 -0.166094 0.940408
vn -0.0790189 -0.928013 0.364071
vn -0.437573 -0.596038 0.673252
vn -0.856078 -0.513635 0.0575336
vn -0.449657 -0.892774 0.0276185
vn -0.944884 -0.312148 0.0987789
vn -0.75618 -0.391424 0.524385
vn -0.878065 -0.126975 0.461389
vn -0.972848 -0.050102 0.225958
vn -0.804509 -0.566973 -0.176937
vn -0.580245 -0.750426 -0.316506
vn -0.215463 -0.888261 -0.40567
vn -0.0520933 -0.951834 -0.302155
vn -0.884473 -0.457612 -0.0910924
vn -0.981777 -0.189876 0.00784137
vn -0.480981 -0.831965 -0.276572
vn -0.709896 -0.694374 -0.117868
vn -0.0780689 -0.988081 -0.132666
vn -0.99125 -0.0959917 0.090605
vn -0.866145 -0.498212 0.0397293
vn -0.597058 -0.801781 -0.0258562
vn -0.409358 -0.903769 -0.12501
vn -0.462109 -0.88508 -0.0555722
vn -0.951869 -0.292515 0.0915505
vn 0.0211299 -0.60309 0.797394
vn 0.294151 -0.921267 0.254444
vn 0.637892 -0.626504 0.447869
vn -0.000509534 -0.983781 -0.179373
vn 0.225934 -0.808953 -0.542723
vn 0.367723 -0.882862 -0.292119
vn 0.781797 -0.619239 -0.0730513
vn 0.163333 -0.0392576 0.98579
vn 0.267069 -0.0653652 0.961458
vn 0.450267 -0.40145 0.797557
vn -0.0210765 -0.00368933 0.999771
vn 0.773283 -0.0266874 0.6335
vn 0.38862 -0.0606596 0.919399
vn 0.888656 -0.163967 0.428259
vn 0.9534 -0.101432 -0.284147
vn 0.843548 -0.0437892 -0.535266
vn 0.991893 0.108875 0.0655304
vn 0.924626 0.0926702 -0.36943
vn -0.0260305 -0.901665 -0.431651
vn 0.657053 -0.531765 -0.534329
vn 0.682043 -0.354146 -0.639842
vn 0.305005 -0.812647 -0.496566
vn 0.811282 -0.375206 -0.448377
vn 0.835626 0.0453259 -0.547426
vn 0.427506 -0.861566 -0.273758
vn 0.89194 0.114418 -0.437437
vn 0.945691 0.164712 -0.280247
vn 0.767772 -0.580585 -0.27101
vn 0.97323 -0.0405919 -0.226219
vn -0.646766 -0.0484114 0.761151
vn -0.371483 0.0874752 0.92431
vn -0.415101 0.659229 0.626983
vn -0.940933 0.156452 0.30028
vn -0.820327 0.345364 0.455836
vn -0.438731 0.898522 0.0131973
vn -0.970806 0.200387 0.131835
vn -0.666113 0.745585 0.0198921
vn -0.362315 0.916149 -0.17146
vn -0.934596 0.351247 0.0561729
vn -0.819156 0.570066 0.0633133
vn -0.89998 0.424014 0.101236
vn -0.472888 0.881081 -0.00861934
vn -0.60024 0.791555 0.114682
vn -0.379181 0.923085 0.0643107
vn 0.336331 0.92333 -0.185321
vn -0.455056 0.874001 0.170431
vn -0.194141 0.976896 0.0893514
vn -0.741279 0.649887 0.167786
vn 0.45794 0.888861 -0.0147139
vn 0.0777231 0.105411 0.991387
vn 0.392357 -0.0839683 0.915972
vn 0.397906 0.265881 0.878053
vn 0.151158 0.692547 0.705358
vn -0.0508412 -0.160334 0.985753
vn 0.990801 0.0524089 0.124769
vn -0.151526 0.923008 0.35369
vn 0.721815 0.184568 0.667021
vn 0.449359 0.766757 0.458432
vn 0.557856 0.808453 -0.187617
vn -0.164922 0.971852 -0.168241
vn 0.0962425 0.934553 -0.342561
vn 0.146055 0.985306 0.0885426
vn 0.914671 0.381665 0.133079
vn 0.875807 0.251702 -0.411835
vn 0.85554 0.148468 -0.495993
vn -0.143909 0.985852 -0.0859376
vn 0.81172 0.191474 -0.551769
vn 0.464127 0.783341 -0.413478
vn 0.543603 0.601452 -0.58545
vn 0.779811 0.513088 -0.358658
vn 0.92026 0.364855 -0.14143
vn -0.84372 -0.536431 0.019454
vn 0.321581 -0.930513 -0.175303
vn 0.522927 -0.82093 -0.229393
vn -0.612015 -0.79083 0.00506785
vn 0.883492 -0.424118 -0.198911
vn 0.935529 -0.267635 -0.230557
vn -0.84223 -0.538889 -0.0157592
vn -0.323123 -0.94218 -0.0888138
vn -0.545214 -0.836737 -0.0511186
vn -0.0926718 -0.985879 -0.139479
vn 0.329212 -0.919934 -0.212934
vn 0.67932 -0.708267 -0.192048
vn 0.968136 -0.213489 -0.130905
vn -0.47134 -0.881916 0.00788138
vn -0.74917 -0.661993 -0.0225739
vn -0.0232359 -0.999377 -0.0265824
vn 0.71463 -0.682169 0.154756
vn -0.806092 -0.567492 -0.167836
vn -0.16485 -0.98347 -0.0749083
vn 0.818088 -0.468999 0.332825
vn 0.981095 -0.107004 0.161251
vn 0.19993 -0.976958 -0.0747055
vn -0.476828 -0.868874 -0.133015
vn -0.586458 -0.685707 -0.43113
vn -0.221867 -0.709477 -0.668893
vn 0.320774 -0.625903 -0.710879
vn 0.0893008 -0.132969 -0.987089
vn 0.782245 -0.619713 -0.0636357
vn -0.988213 -0.151039 0.024939
vn -0.952017 0.263294 0.156013
vn 0.982285 0.0965016 -0.160638
vn -0.485021 0.851138 0.200795
vn 0.054349 0.987791 0.145996
vn 0.826384 0.562889 0.0156623
vn 0.978162 0.155878 -0.137484
vn -0.0972547 0.980059 0.17328
vn 0.658643 0.752417 0.00760927
vn 0.987485 0.0256444 -0.155613
vn -0.789728 0.595349 0.147947
vn -0.973841 0.21958 0.0584631
vn -0.99422 -0.107337 -0.00215489
vn -0.959094 0.27675 0.0595739
vn 0.905682 -0.350407 -0.238652
vn 0.998991 0.0360842 -0.0267304
vn -0.509636 0.841784 0.177965
vn -0.818151 0.557346 0.141404
vn -0.0647576 0.981106 0.182313
vn 0.650996 0.753399 0.0927067
vn 0.957612 0.286756 -0.0273869
vn -0.623123 0.766478 0.155659
vn 0.947346 0.256383 0.191844
vn 0.961508 0.015931 0.274315
vn 0.501728 0.842342 0.196795
vn -0.990724 0.134644 -0.0183473
vn -0.866694 0.497736 0.0331695
vn -0.976163 -0.203962 -0.0742024
vn -0.852349 -0.219243 -0.474798
vn -0.926309 0.115745 -0.358546
vn 0.996503 -0.0834227 -0.00469449
vn 0.938608 -0.0618169 0.339403
vn 0.805579 0.39171 0.444528
vn 0.949512 0.084063 -0.302258
vn -0.779621 0.590062 -0.209806
vn -0.505835 0.449264 -0.736405
vn 0.801588 0.00623196 -0.597845
vn -0.307488 0.932118 0.191332
vn -0.0988481 0.973935 0.204155
vn 0.258596 0.878342 0.40205
vn -0.488913 0.869318 0.0724608
vn 0.0780126 0.996076 0.0418037
vn -0.282292 0.875688 -0.391768
vn 0.52612 0.114545 -0.842661
vn -0.539339 -0.14372 -0.829734
vn 0.353856 0.110245 -0.92878
vn -0.0236135 0.11947 -0.992557
vn 0.17766 0.621875 -0.762698
vn 0.982165 -0.0310223 0.185443
vn 0.801394 -0.111317 -0.587687
vn 0.995195 -0.0602315 0.0771892
vn 0.783239 0.535484 0.315901
vn 0.752542 0.524126 -0.398714
vn -0.941659 -0.214549 0.25932
vn -0.793057 -0.503226 -0.343255
vn -0.507456 0.860282 -0.0490229

g grp1
usemtl mtl1
f 1//1 2//2 26//26 
f 55//55 2//2 36//36 
f 2//2 1//1 36//36 
f 36//36 79//79 55//55 
f 4//4 3//3 26//26 
f 8//8 4//4 2//2 
f 4//4 26//26 2//2 
f 4//4 6//6 3//3 
f 6//6 4//4 8//8 
f 8//8 5//5 6//6 
f 5//5 12//12 6//6 
f 6//6 12//12 13//13 
f 11//11 12//12 5//5 
f 8//8 9//9 5//5 
f 9//9 7//7 5//5 
f 2//2 55//55 8//8 
f 9//9 8//8 55//55 
f 58//58 9//9 55//55 
f 9//9 58//58 10//10 
f 15//15 11//11 7//7 
f 5//5 7//7 11//11 
f 58//58 61//61 10//10 
f 10//10 16//16 7//7 
f 7//7 16//16 15//15 
f 10//10 61//61 16//16 
f 13//13 14//14 44//44 
f 61//61 64//64 16//16 
f 18//18 17//17 11//11 
f 12//12 17//17 13//13 
f 17//17 14//14 13//13 
f 12//12 11//11 17//17 
f 17//17 23//23 14//14 
f 17//17 18//18 23//23 
f 14//14 23//23 19//19 
f 19//19 50//50 14//14 
f 20//20 16//16 64//64 
f 16//16 20//20 15//15 
f 11//11 15//15 18//18 
f 21//21 18//18 15//15 
f 15//15 20//20 21//21 
f 18//18 22//22 23//23 
f 50//50 19//19 98//98 
f 18//18 21//21 22//22 
f 20//20 25//25 21//21 
f 24//24 23//23 22//22 
f 19//19 23//23 106//106 
f 106//106 98//98 19//19 
f 100//100 22//22 21//21 
f 21//21 25//25 100//100 
f 22//22 100//100 24//24 
f 1//1 26//26 35//35 
f 26//26 3//3 27//27 
f 3//3 6//6 29//29 
f 27//27 3//3 29//29 
f 35//35 26//26 27//27 
f 35//35 27//27 28//28 
f 6//6 13//13 29//29 
f 27//27 29//29 31//31 
f 31//31 32//32 27//27 
f 28//28 27//27 32//32 
f 31//31 29//29 30//30 
f 31//31 30//30 45//45 
f 32//32 31//31 45//45 
f 28//28 32//32 39//39 
f 39//39 32//32 40//40 
f 40//40 32//32 45//45 
f 33//33 36//36 1//1 
f 35//35 34//34 1//1 
f 38//38 34//34 35//35 
f 34//34 33//33 1//1 
f 35//35 39//39 38//38 
f 33//33 79//79 36//36 
f 34//34 38//38 33//33 
f 39//39 37//37 38//38 
f 33//33 38//38 76//76 
f 37//37 76//76 38//38 
f 39//39 80//80 37//37 
f 43//43 40//40 41//41 
f 43//43 41//41 90//90 
f 35//35 28//28 39//39 
f 39//39 42//42 80//80 
f 39//39 40//40 42//42 
f 45//45 41//41 40//40 
f 42//42 40//40 43//43 
f 42//42 43//43 80//80 
f 44//44 29//29 13//13 
f 44//44 30//30 29//29 
f 45//45 30//30 46//46 
f 45//45 46//46 41//41 
f 46//46 49//49 41//41 
f 41//41 49//49 90//90 
f 44//44 14//14 47//47 
f 44//44 47//47 30//30 
f 14//14 50//50 47//47 
f 47//47 50//50 48//48 
f 48//48 46//46 47//47 
f 46//46 48//48 49//49 
f 47//47 46//46 30//30 
f 90//90 49//49 51//51 
f 51//51 49//49 48//48 
f 50//50 98//98 53//53 
f 50//50 53//53 48//48 
f 53//53 54//54 48//48 
f 51//51 48//48 54//54 
f 51//51 54//54 52//52 
f 101//101 53//53 98//98 
f 53//53 101//101 54//54 
f 52//52 54//54 127//127 
f 101//101 127//127 54//54 
f 56//56 55//55 79//79 
f 79//79 75//75 56//56 
f 59//59 55//55 56//56 
f 56//56 57//57 59//59 
f 75//75 57//57 56//56 
f 55//55 59//59 58//58 
f 58//58 59//59 65//65 
f 59//59 62//62 65//65 
f 57//57 62//62 59//59 
f 60//60 62//62 57//57 
f 57//57 81//81 60//60 
f 85//85 60//60 81//81 
f 58//58 65//65 61//61 
f 64//64 61//61 65//65 
f 62//62 67//67 65//65 
f 63//63 62//62 60//60 
f 85//85 63//63 60//60 
f 63//63 67//67 62//62 
f 68//68 64//64 65//65 
f 65//65 67//67 68//68 
f 68//68 66//66 64//64 
f 91//91 67//67 63//63 
f 69//69 68//68 67//67 
f 67//67 91//91 69//69 
f 64//64 66//66 20//20 
f 66//66 68//68 73//73 
f 91//91 72//72 69//69 
f 72//72 68//68 69//69 
f 25//25 126//126 125//125 
f 66//66 126//126 20//20 
f 20//20 126//126 25//25 
f 66//66 73//73 126//126 
f 68//68 71//71 73//73 
f 68//68 72//72 71//71 
f 70//70 74//74 72//72 
f 129//129 72//72 74//74 
f 135//135 126//126 73//73 
f 72//72 129//129 71//71 
f 71//71 128//128 73//73 
f 73//73 128//128 135//135 
f 132//132 71//71 129//129 
f 71//71 132//132 128//128 
f 74//74 96//96 130//130 
f 130//130 129//129 74//74 
f 78//78 57//57 75//75 
f 75//75 77//77 78//78 
f 75//75 76//76 77//77 
f 33//33 76//76 79//79 
f 37//37 82//82 76//76 
f 79//79 76//76 75//75 
f 82//82 37//37 80//80 
f 57//57 78//78 81//81 
f 87//87 81//81 78//78 
f 81//81 87//87 85//85 
f 78//78 77//77 83//83 
f 82//82 77//77 76//76 
f 82//82 83//83 77//77 
f 87//87 78//78 83//83 
f 88//88 83//83 82//82 
f 83//83 88//88 84//84 
f 83//83 84//84 87//87 
f 89//89 43//43 92//92 
f 63//63 85//85 86//86 
f 89//89 84//84 88//88 
f 87//87 84//84 86//86 
f 89//89 92//92 94//94 
f 87//87 86//86 85//85 
f 84//84 94//94 86//86 
f 84//84 89//89 94//94 
f 80//80 88//88 82//82 
f 88//88 80//80 43//43 
f 43//43 89//89 88//88 
f 43//43 90//90 92//92 
f 86//86 91//91 63//63 
f 86//86 94//94 91//91 
f 91//91 93//93 70//70 
f 91//91 94//94 93//93 
f 93//93 94//94 92//92 
f 90//90 51//51 92//92 
f 51//51 95//95 92//92 
f 95//95 70//70 93//93 
f 72//72 91//91 70//70 
f 93//93 92//92 95//95 
f 52//52 95//95 51//51 
f 95//95 52//52 96//96 
f 70//70 95//95 74//74 
f 95//95 96//96 74//74 
f 52//52 127//127 96//96 
f 25//25 125//125 97//97 
f 98//98 106//106 99//99 
f 101//101 98//98 99//99 
f 25//25 97//97 100//100 
f 104//104 106//106 24//24 
f 23//23 24//24 106//106 
f 101//101 99//99 102//102 
f 101//101 102//102 134//134 
f 24//24 100//100 104//104 
f 100//100 105//105 104//104 
f 99//99 139//139 102//102 
f 102//102 139//139 134//134 
f 99//99 106//106 107//107 
f 107//107 139//139 99//99 
f 97//97 125//125 103//103 
f 103//103 152//152 111//111 
f 104//104 105//105 112//112 
f 100//100 97//97 105//105 
f 110//110 112//112 105//105 
f 97//97 103//103 105//105 
f 105//105 103//103 110//110 
f 106//106 104//104 107//107 
f 112//112 107//107 104//104 
f 112//112 108//108 107//107 
f 107//107 108//108 139//139 
f 139//139 108//108 109//109 
f 111//111 110//110 103//103 
f 112//112 110//110 115//115 
f 108//108 112//112 113//113 
f 113//113 109//109 108//108 
f 113//113 117//117 109//109 
f 115//115 118//118 112//112 
f 113//113 112//112 118//118 
f 113//113 118//118 116//116 
f 111//111 152//152 114//114 
f 110//110 119//119 115//115 
f 110//110 111//111 119//119 
f 114//114 119//119 111//111 
f 119//119 114//114 120//120 
f 113//113 116//116 117//117 
f 117//117 116//116 173//173 
f 118//118 124//124 116//116 
f 124//124 173//173 116//116 
f 115//115 119//119 121//121 
f 119//119 120//120 121//121 
f 120//120 153//153 169//169 
f 120//120 169//169 121//121 
f 118//118 115//115 121//121 
f 118//118 121//121 122//122 
f 124//124 118//118 122//122 
f 124//124 122//122 174//174 
f 123//123 121//121 169//169 
f 123//123 122//122 121//121 
f 123//123 174//174 122//122 
f 126//126 136//136 125//125 
f 135//135 136//136 126//126 
f 136//136 135//135 138//138 
f 101//101 134//134 127//127 
f 143//143 128//128 132//132 
f 127//127 130//130 96//96 
f 129//129 130//130 133//133 
f 129//129 133//133 132//132 
f 130//130 127//127 131//131 
f 130//130 131//131 133//133 
f 132//132 133//133 143//143 
f 134//134 131//131 127//127 
f 131//131 134//134 145//145 
f 128//128 141//141 135//135 
f 128//128 143//143 141//141 
f 141//141 142//142 135//135 
f 131//131 145//145 133//133 
f 145//145 144//144 133//133 
f 133//133 144//144 143//143 
f 136//136 137//137 125//125 
f 125//125 137//137 103//103 
f 136//136 138//138 137//137 
f 135//135 142//142 138//138 
f 137//137 152//152 103//103 
f 138//138 150//150 137//137 
f 151//151 138//138 142//142 
f 138//138 151//151 150//150 
f 109//109 134//134 139//139 
f 134//134 140//140 145//145 
f 134//134 109//109 140//140 
f 141//141 146//146 142//142 
f 163//163 146//146 141//141 
f 149//149 163//163 143//143 
f 141//141 143//143 163//163 
f 143//143 144//144 149//149 
f 140//140 109//109 117//117 
f 140//140 117//117 147//147 
f 147//147 117//117 148//148 
f 142//142 146//146 151//151 
f 145//145 140//140 147//147 
f 145//145 147//147 144//144 
f 147//147 149//149 144//144 
f 157//157 149//149 147//147 
f 147//147 148//148 157//157 
f 146//146 163//163 162//162 
f 163//163 149//149 157//157 
f 150//150 152//152 137//137 
f 151//151 154//154 150//150 
f 114//114 152//152 153//153 
f 154//154 152//152 150//150 
f 153//153 152//152 154//154 
f 151//151 159//159 154//154 
f 160//160 169//169 154//154 
f 160//160 154//154 159//159 
f 117//117 173//173 148//148 
f 148//148 173//173 156//156 
f 156//156 173//173 155//155 
f 148//148 156//156 157//157 
f 155//155 175//175 156//156 
f 156//156 175//175 157//157 
f 154//154 169//169 153//153 
f 173//173 158//158 155//155 
f 155//155 158//158 161//161 
f 174//174 168//168 158//158 
f 170//170 161//161 168//168 
f 168//168 161//161 158//158 
f 177//177 161//161 170//170 
f 165//165 151//151 146//146 
f 146//146 162//162 165//165 
f 162//162 166//166 165//165 
f 164//164 163//163 157//157 
f 162//162 163//163 164//164 
f 157//157 176//176 164//164 
f 162//162 164//164 166//166 
f 164//164 176//176 166//166 
f 151//151 165//165 159//159 
f 167//167 165//165 166//166 
f 160//160 159//159 167//167 
f 167//167 172//172 160//160 
f 176//176 177//177 166//166 
f 170//170 172//172 177//177 
f 166//166 172//172 167//167 
f 172//172 166//166 177//177 
f 171//171 123//123 169//169 
f 123//123 171//171 168//168 
f 168//168 174//174 123//123 
f 171//171 169//169 160//160 
f 168//168 171//171 170//170 
f 160//160 172//172 171//171 
f 171//171 172//172 170//170 
f 174//174 158//158 124//124 
f 173//173 124//124 158//158 
f 155//155 161//161 175//175 
f 161//161 177//177 175//175 
f 175//175 176//176 157//157 
f 176//176 175//175 177//177 
f 10//10 7//7 178//178 
f 7//7 9//9 178//178 
f 9//9 10//10 178//178 
f 153//153 120//120 179//179 
f 120//120 114//114 179//179 
f 114//114 153//153 179//179 
f 167//167 159//159 180//180 
f 159//159 165//165 180//180 
f 165//165 167//167 180//180 
