# PIPER geometrical reference model based on a manual segmentation. See the
# documentation for more info.
# Author: CEESAR, SOTON, UCBL-Ifsttar
# Version: 1.0.0
# License: Creative Commons Attribution 4.0 International License.
# (https://creativecommons.org/licenses/by/4.0/)
# 
# This work has received funding from the European Union Seventh Framework
# Program ([FP7/2007-2013]) under grant agreement 605544 [PIPER project]).
# Contributors include Pierre Maillez, Christophe Lecomte (SOTON), Erwan
# Jolivet (CEESAR), Philippe Beillas (UCBL-Ifsttar)
# This work is derived from a CT scan provided by CEESAR under a CCBY-4.0
# License
# 
# wavefront obj file written by the visualization toolkit

mtllib C:/desktop/registration_reference_model/22_REF_LTE635_Assembly_hands_corr/CCTu635_BP180_Metatarsal3_L.mtl

v -110.661 174.652 -1705.65
v -116.42 170.407 -1708.88
v -113.798 165.084 -1712.55
v -117.129 169.931 -1711.29
v -113.627 179.066 -1711.59
v -116.077 177.389 -1715.33
v -115.883 186.532 -1720.04
v -115.066 188.023 -1718.16
v -114.825 187.213 -1724.1
v -106.861 172.004 -1705.31
v -114.859 164.73 -1709.59
v -112.748 168.075 -1705.9
v -107.581 166.804 -1709.6
v -104.043 169.259 -1709.36
v -114.052 173.094 -1716.4
v -101.997 169.857 -1713.41
v -104.107 164.642 -1714.91
v -102.291 163.944 -1719.78
v -109.53 166.904 -1717.26
v -105.138 164.468 -1718.63
v -106.212 170.718 -1722.57
v -99.968 166 -1716.17
v -101.649 167.353 -1719.73
v -102.823 173.533 -1719.15
v -109.596 182.532 -1712.71
v -106.881 176.738 -1710.06
v -106.221 179.504 -1714.97
v -108.645 186.779 -1716.51
v -106.816 181.106 -1720.31
v -111.822 175.794 -1723.43
v -109.694 179.768 -1724.07
v -110.216 188.968 -1724.42
v -111.441 189.29 -1716.96
v -110.441 197.96 -1725.64
v -108.426 188.456 -1720.11
v -109.643 195.846 -1721.39
v -112.584 186.761 -1726.15
v -116.101 195.903 -1726.6
v -115.067 197.584 -1729.6
v -116.839 200.234 -1725.83
v -115.275 201.771 -1724.19
v -113.618 205.151 -1726.17
v -111.785 204.861 -1728.06
v -117.892 207.95 -1733.43
v -113.333 199.756 -1730.24
v -113.222 207.666 -1734.07
v -115.277 204.974 -1733.93
v -119.38 211.89 -1732.15
v -116.349 212.434 -1729.6
v -113.197 210.023 -1730.65
v -116.559 209.116 -1736.87
v -116.786 212.988 -1743.71
v -113.321 212.262 -1738.15
v -121.212 215.52 -1735.19
v -119.515 219.188 -1732.42
v -121.663 224.128 -1736.75
v -115.737 219.345 -1732.51
v -115.488 224.977 -1736
v -122.948 220.534 -1740.67
v -113.051 215.854 -1734.56
v -115.59 227.074 -1738.57
v -119.41 214.56 -1741.03
v -114.205 214.104 -1744.36
v -120.628 223.779 -1743.83
v -112.183 222.607 -1740.04
v -115.503 223.442 -1745.65
v -118.975 226.146 -1741.49
v -113.606 224.7 -1742.63
v -118.012 217.058 -1746.69
v -110.85 218.711 -1743.84
v -119.099 221.17 -1733.87
vn -0.174333 0.427857 0.886874
vn -0.836553 0.0624459 0.544316
vn -0.546326 -0.709738 -0.444748
vn -0.978183 -0.16008 -0.13241
vn -0.628873 0.469366 0.619851
vn -0.999341 0.0170586 -0.0320414
vn -0.999797 -0.0121065 0.0160834
vn -0.742037 0.292026 0.603409
vn -0.84007 -0.251983 -0.480403
vn 0.516544 0.0275198 0.855818
vn -0.510895 -0.809514 0.289263
vn -0.218247 -0.402253 0.889135
vn 0.327015 -0.733393 0.595983
vn 0.740986 -0.220679 0.634225
vn -0.775867 -0.343761 -0.529017
vn 0.893074 0.307585 0.328345
vn 0.234595 -0.911387 0.338142
vn 0.333149 -0.781033 -0.528204
vn -0.571392 -0.511887 -0.64147
vn -0.316557 -0.859151 -0.402058
vn 0.114184 -0.268072 -0.956608
vn 0.925142 -0.346732 0.154559
vn 0.766731 0.0279253 -0.641361
vn 0.88516 0.342171 -0.315296
vn 0.290617 0.570111 0.76845
vn 0.751295 0.480609 0.452295
vn 0.863217 0.43333 0.259003
vn 0.711139 0.456437 0.53474
vn 0.904079 0.253733 -0.343891
vn -0.507034 -0.34072 -0.791724
vn 0.453776 -0.0482853 -0.889807
vn 0.813521 -0.0300717 -0.580757
vn -0.0452723 0.499603 0.865071
vn 0.945289 0.0350737 -0.324344
vn 0.9783 0.185331 -0.0926351
vn 0.752864 0.439884 0.48959
vn -0.0421274 -0.246628 -0.968194
vn -0.930773 -0.217329 -0.29399
vn -0.42891 -0.407934 -0.805994
vn -0.959824 0.0166205 0.28011
vn -0.400601 0.386295 0.83084
vn 0.393563 0.5163 0.76062
vn 0.914575 0.351467 0.200059
vn -0.842657 -0.436908 -0.314708
vn 0.540559 -0.350522 -0.764808
vn 0.885126 -0.226002 -0.406786
vn -0.0792098 -0.557248 -0.82656
vn -0.897261 -0.122703 0.424108
vn -0.0200741 0.395673 0.918172
vn 0.876444 0.33321 0.347587
vn -0.588318 -0.633489 -0.502567
vn -0.274836 -0.761377 -0.587172
vn 0.948793 -0.28991 -0.125475
vn -0.956747 -0.22538 0.183956
vn -0.496447 0.306775 0.812053
vn -0.719017 0.574667 0.390861
vn 0.427992 0.403083 0.808917
vn 0.374942 0.623787 0.68579
vn -0.981305 -0.00137261 -0.192456
vn 0.917632 0.118198 0.379449
vn 0.277053 0.941338 0.192674
vn -0.791239 -0.522472 -0.317748
vn 0.474623 -0.566424 -0.673718
vn -0.658314 0.486415 -0.574477
vn 0.909832 0.368462 0.190897
vn 0.19254 0.502452 -0.842894
vn -0.367691 0.888314 -0.275137
vn 0.605793 0.713474 -0.352093
vn -0.307623 -0.259762 -0.915364
vn 0.894845 -0.0298292 -0.445379
vn -0.177307 0.604033 0.776985

g grp1
usemtl mtl1
f 12//12 2//2 11//11 
f 13//13 12//12 11//11 
f 4//4 11//11 2//2 
f 12//12 1//1 2//2 
f 11//11 4//4 3//3 
f 3//3 15//15 19//19 
f 6//6 4//4 2//2 
f 15//15 3//3 4//4 
f 6//6 15//15 4//4 
f 1//1 5//5 2//2 
f 2//2 5//5 6//6 
f 8//8 6//6 5//5 
f 6//6 8//8 7//7 
f 15//15 6//6 30//30 
f 9//9 30//30 6//6 
f 7//7 9//9 6//6 
f 5//5 33//33 8//8 
f 41//41 8//8 33//33 
f 38//38 9//9 7//7 
f 8//8 40//40 7//7 
f 8//8 41//41 40//40 
f 40//40 38//38 7//7 
f 1//1 12//12 10//10 
f 20//20 11//11 3//3 
f 20//20 17//17 11//11 
f 10//10 12//12 13//13 
f 13//13 14//14 10//10 
f 10//10 14//14 26//26 
f 11//11 17//17 13//13 
f 3//3 19//19 20//20 
f 13//13 17//17 14//14 
f 26//26 14//14 16//16 
f 17//17 22//22 14//14 
f 22//22 16//16 14//14 
f 20//20 18//18 17//17 
f 17//17 18//18 22//22 
f 30//30 19//19 15//15 
f 21//21 20//20 30//30 
f 19//19 30//30 20//20 
f 20//20 21//21 18//18 
f 21//21 23//23 18//18 
f 31//31 23//23 21//21 
f 23//23 31//31 24//24 
f 18//18 23//23 22//22 
f 22//22 24//24 16//16 
f 22//22 23//23 24//24 
f 1//1 25//25 5//5 
f 1//1 10//10 25//25 
f 26//26 25//25 10//10 
f 16//16 27//27 26//26 
f 16//16 24//24 27//27 
f 27//27 25//25 26//26 
f 5//5 25//25 33//33 
f 25//25 27//27 28//28 
f 24//24 29//29 27//27 
f 28//28 27//27 35//35 
f 29//29 35//35 27//27 
f 24//24 31//31 29//29 
f 30//30 31//31 21//21 
f 37//37 31//31 30//30 
f 31//31 32//32 29//29 
f 31//31 37//37 32//32 
f 33//33 25//25 28//28 
f 36//36 33//33 28//28 
f 28//28 35//35 36//36 
f 36//36 41//41 33//33 
f 32//32 35//35 29//29 
f 34//34 35//35 32//32 
f 34//34 36//36 35//35 
f 43//43 42//42 36//36 
f 41//41 36//36 42//42 
f 34//34 43//43 36//36 
f 37//37 30//30 9//9 
f 45//45 32//32 37//37 
f 39//39 37//37 9//9 
f 9//9 38//38 39//39 
f 37//37 39//39 45//45 
f 34//34 32//32 45//45 
f 48//48 40//40 41//41 
f 40//40 44//44 38//38 
f 40//40 48//48 44//44 
f 38//38 44//44 39//39 
f 34//34 45//45 46//46 
f 43//43 34//34 46//46 
f 47//47 45//45 39//39 
f 39//39 44//44 47//47 
f 51//51 47//47 44//44 
f 45//45 47//47 46//46 
f 48//48 41//41 49//49 
f 42//42 43//43 50//50 
f 41//41 42//42 49//49 
f 42//42 50//50 49//49 
f 46//46 50//50 43//43 
f 55//55 48//48 49//49 
f 54//54 44//44 48//48 
f 49//49 60//60 57//57 
f 49//49 50//50 60//60 
f 46//46 60//60 50//50 
f 46//46 47//47 53//53 
f 44//44 62//62 51//51 
f 44//44 54//54 62//62 
f 62//62 52//52 51//51 
f 52//52 63//63 51//51 
f 47//47 51//51 63//63 
f 47//47 63//63 53//53 
f 53//53 60//60 46//46 
f 49//49 57//57 55//55 
f 55//55 54//54 48//48 
f 58//58 55//55 57//57 
f 57//57 60//60 58//58 
f 56//56 54//54 55//55 
f 59//59 54//54 56//56 
f 59//59 62//62 54//54 
f 67//67 59//59 56//56 
f 67//67 64//64 59//59 
f 59//59 64//64 69//69 
f 60//60 53//53 70//70 
f 60//60 65//65 58//58 
f 65//65 61//61 58//58 
f 69//69 62//62 59//59 
f 62//62 69//69 52//52 
f 53//53 63//63 70//70 
f 65//65 60//60 70//70 
f 70//70 68//68 65//65 
f 68//68 70//70 66//66 
f 58//58 61//61 56//56 
f 56//56 61//61 67//67 
f 61//61 65//65 68//68 
f 64//64 67//67 66//66 
f 61//61 68//68 67//67 
f 68//68 66//66 67//67 
f 52//52 69//69 63//63 
f 63//63 69//69 70//70 
f 64//64 66//66 69//69 
f 69//69 66//66 70//70 
f 55//55 58//58 71//71 
f 58//58 56//56 71//71 
f 56//56 55//55 71//71 
