# PIPER geometrical reference model based on a manual segmentation. See the
# documentation for more info.
# Author: CEESAR, SOTON, UCBL-Ifsttar
# Version: 1.0.0
# License: Creative Commons Attribution 4.0 International License.
# (https://creativecommons.org/licenses/by/4.0/)
# 
# This work has received funding from the European Union Seventh Framework
# Program ([FP7/2007-2013]) under grant agreement 605544 [PIPER project]).
# Contributors include Pierre Maillez, Christophe Lecomte (SOTON), Erwan
# Jolivet (CEESAR), Philippe Beillas (UCBL-Ifsttar)
# This work is derived from a CT scan provided by CEESAR under a CCBY-4.0
# License
# 
# wavefront obj file written by the visualization toolkit

mtllib C:/desktop/registration_reference_model/22_REF_LTE635_Assembly_hands_corr/CCTu635_BP099_Trapezoid_R.mtl

v 52.8606 242.833 -929.258
v 58.1161 241.176 -928.53
v 56.4166 241.468 -928.578
v 52.3683 248.349 -925.433
v 51.13 247.743 -926.567
v 50.6974 244.088 -930.235
v 49.8411 246.127 -929.389
v 51.211 245.558 -928.054
v 54.0824 248.058 -924.953
v 53.2288 246.591 -925.893
v 55.2486 244.433 -926.652
v 57.0973 245.518 -925.553
v 56.6166 247.031 -925.161
v 53.2877 244.321 -927.466
v 55.0435 242.664 -927.977
v 57.5877 243.07 -926.37
v 63.2257 247.657 -924.256
v 60.2189 241.9 -926.709
v 61.1315 241.713 -927.574
v 59.0429 241.329 -929.368
v 60.0672 243.326 -925.69
v 61.5291 242.67 -926.417
v 63.0639 244.479 -927.344
v 60.8631 244.995 -924.836
v 59.0871 246.642 -924.866
v 61.1852 247.719 -924.212
v 61.3662 246.508 -924.19
v 62.0022 244.332 -925.26
v 62.6 245.675 -924.421
v 64.4287 247.458 -925.241
v 64.5509 246.084 -926.339
v 50.4107 249.623 -926.973
v 52.3293 250.025 -926.719
v 49.8903 248.169 -927.707
v 49.4365 248.277 -929.168
v 49.9328 248.856 -929.93
v 51.5613 250.389 -928.532
v 50.1223 249.595 -928.416
v 53.3985 249.122 -925.316
v 56.926 249.231 -925.986
v 57.3922 248.081 -925.248
v 56.455 249.857 -926.741
v 53.5937 250.483 -928.039
v 55.9972 250.395 -928.166
v 53.2473 250.699 -929.388
v 59.4428 249.13 -925.673
v 57.9284 249.959 -926.948
v 62.8127 249.381 -924.867
v 64.2071 250.267 -925.284
v 60.3903 250.403 -926.771
v 63.0873 251.449 -926.188
v 63.8574 252.885 -926.671
v 58.3268 250.719 -928.343
v 58.4861 251.131 -930.033
v 62.9456 252.914 -927.873
v 64.8778 251.552 -925.851
v 66.469 251.874 -927.238
v 66.2611 248.665 -926.866
v 66.6487 250.842 -926.921
v 66.2995 247.821 -928.355
v 66.8288 249.258 -930.656
v 67.2896 249.865 -928.394
v 66.9029 251.472 -928.382
v 65.4257 252.23 -930.286
v 64.0292 253.218 -928.688
v 63.4437 253.39 -930.887
v 54.4365 241.464 -930.416
v 57.1594 241.21 -929.925
v 56.1842 241.793 -931.146
v 52.1195 242.271 -930.627
v 51.1691 243.156 -931.864
v 51.8839 244.314 -932.174
v 49.8788 246.006 -930.622
v 50.1523 247.471 -930.937
v 53.8279 241.634 -931.354
v 52.2734 243.084 -932.126
v 56.317 243.353 -932.442
v 53.903 246.369 -932.15
v 55.5527 247.917 -931.985
v 54.5129 244.725 -932.489
v 57.0072 245.066 -933.245
v 59.506 245.861 -934.017
v 55.6932 246.163 -932.801
v 57.8187 246.683 -933.735
v 57.7483 248.315 -933.149
v 60.5828 243.589 -932.344
v 61.0998 242.768 -931.356
v 62.4435 244.727 -932.313
v 62.8683 244.258 -930.116
v 58.2338 243.42 -932.63
v 60.6761 247.443 -935.05
v 61.6177 245.412 -933.626
v 63.2487 247.186 -934.172
v 64.9126 246.868 -930.545
v 51.8725 248.727 -931.295
v 51.6238 250.209 -930.123
v 53.196 250.105 -930.983
v 55.2914 250.479 -930.42
v 55.8982 249.472 -931.272
v 57.3623 249.554 -932.032
v 57.0211 250.375 -930.833
v 56.4005 250.637 -929.531
v 58.6645 250.965 -931.707
v 60.7126 251.768 -928.605
v 61.9725 253.439 -929.847
v 59.755 252.301 -931.176
v 60.071 252.149 -932.92
v 59.2771 250.266 -933.246
v 61.8236 248.493 -935.307
v 62.3425 250.415 -935.203
v 63.6611 249.194 -934.756
v 63.9645 250.961 -934.37
v 61.0247 251.311 -934.57
v 61.4835 253.169 -933.967
v 63.975 252.387 -932.871
v 62.0701 252.648 -934.552
v 63.6546 246.135 -933.052
v 66.9468 250.615 -930.529
v 65.0783 249.881 -933.853
v 64.8103 248.537 -933.769
v 66.1964 250.544 -932.491
v 60.9657 253.583 -932.623
v 62.6387 253.761 -929.847
v 62.512 253.464 -932.678
v 60.7825 249.3 -935.094
vn -0.467693 -0.686555 0.556692
vn -0.0339598 -0.974328 0.222558
vn -0.249547 -0.873481 0.418039
vn -0.446681 -0.0341271 0.894042
vn -0.622395 -0.313883 0.717009
vn -0.802162 -0.534078 0.267015
vn -0.89224 -0.364096 0.2671
vn -0.60981 -0.511672 0.605247
vn -0.110214 -0.0361011 0.993252
vn -0.356143 -0.472781 0.806002
vn -0.29794 -0.499374 0.813546
vn -0.204226 -0.346989 0.915364
vn -0.0295228 -0.116941 0.9927
vn -0.419305 -0.571795 0.705148
vn -0.367883 -0.651195 0.663783
vn -0.267685 -0.540183 0.797839
vn 0.328672 0.0365226 0.943738
vn 0.0505092 -0.789882 0.611175
vn 0.498624 -0.856356 0.134271
vn 0.215694 -0.95129 -0.22028
vn -0.0636365 -0.500871 0.86318
vn 0.528296 -0.644338 0.552931
vn 0.746787 -0.651761 0.13235
vn -0.118394 -0.392155 0.912248
vn -0.230628 -0.137403 0.963292
vn -0.152609 0.247212 0.956868
vn -0.115154 -0.161215 0.980178
vn 0.395375 -0.61173 0.685175
vn 0.343224 -0.426843 0.836661
vn 0.679501 -0.234949 0.695038
vn 0.73377 -0.587719 0.340833
vn -0.671175 0.52158 0.526762
vn -0.13374 0.877564 0.460429
vn -0.871762 -0.0991145 0.4798
vn -0.988617 0.148827 -0.022089
vn -0.734605 0.490347 -0.468952
vn -0.303126 0.95079 0.0641269
vn -0.761104 0.648179 0.024162
vn -0.112568 0.561561 0.819742
vn 0.0412823 0.695229 0.717602
vn -0.0466993 0.333132 0.941723
vn 0.037994 0.872194 0.487683
vn -0.00443277 0.968745 0.248017
vn -0.0106817 0.963184 0.26863
vn -0.0816841 0.991848 -0.0978045
vn -0.161788 0.664704 0.729379
vn -0.0880489 0.848999 0.521007
vn -0.106929 0.47881 0.871383
vn 0.221983 0.332484 0.916612
vn -0.284405 0.746049 0.6021
vn -0.351594 0.562353 0.748426
vn -0.106383 0.815907 0.568312
vn -0.218286 0.915075 0.339099
vn -0.421979 0.904649 0.0595266
vn -0.375672 0.820426 0.431012
vn 0.275717 0.426835 0.861274
vn 0.689682 0.629108 0.358554
vn 0.8156 -0.289636 0.500906
vn 0.796981 0.129801 0.589892
vn 0.831502 -0.553897 0.0424616
vn 0.902031 -0.335366 -0.27179
vn 0.986105 -0.106583 0.127425
vn 0.841611 0.54008 0.00200728
vn 0.59633 0.777628 -0.199212
vn 0.298658 0.947526 0.114007
vn 0.442437 0.884769 -0.146402
vn -0.195929 -0.97622 0.0927647
vn 0.0234287 -0.969046 -0.245767
vn 0.091849 -0.804035 -0.587445
vn -0.541574 -0.819973 0.185315
vn -0.66988 -0.483245 -0.56368
vn -0.283444 0.0459298 -0.957888
vn -0.921524 -0.167318 -0.350425
vn -0.665006 0.202605 -0.718832
vn -0.154916 -0.867741 -0.472257
vn -0.165589 -0.365584 -0.915931
vn -0.0745689 -0.470502 -0.879242
vn -0.20338 0.205842 -0.957218
vn -0.291875 0.380503 -0.877511
vn -0.183748 -0.0385922 -0.982216
vn -0.235438 -0.24759 -0.939824
vn -0.117164 -0.434098 -0.893214
vn -0.36097 0.16762 -0.91739
vn -0.405422 0.0237162 -0.913822
vn -0.536626 0.369198 -0.758765
vn 0.232495 -0.662952 -0.711647
vn 0.43883 -0.767928 -0.466599
vn 0.556298 -0.687178 -0.467247
vn 0.741807 -0.652702 -0.153955
vn 0.022873 -0.619669 -0.78453
vn -0.114092 -0.290291 -0.950113
vn 0.255981 -0.598535 -0.759098
vn 0.423637 -0.462608 -0.778797
vn 0.756791 -0.621301 -0.203105
vn -0.314709 0.364913 -0.87624
vn -0.399051 0.799516 -0.448924
vn -0.135526 0.70628 -0.694839
vn -0.00932695 0.881218 -0.472618
vn -0.187664 0.559407 -0.807369
vn -0.501555 0.564492 -0.655585
vn -0.315218 0.829486 -0.461076
vn -0.0851672 0.996185 -0.019029
vn -0.647639 0.675937 -0.351672
vn -0.45658 0.773491 0.439599
vn -0.488218 0.807968 0.329895
vn -0.665168 0.742557 0.0784899
vn -0.757959 0.49681 -0.422702
vn -0.653851 0.432167 -0.621055
vn 0.106948 -0.176681 -0.978441
vn 0.097792 0.183193 -0.978201
vn 0.450852 -0.115212 -0.885132
vn 0.525797 0.361963 -0.769754
vn -0.520804 0.314966 -0.793448
vn -0.268096 0.759639 -0.592514
vn 0.575013 0.704437 -0.416088
vn 0.0888003 0.584363 -0.806619
vn 0.624081 -0.615591 -0.481218
vn 0.908922 0.319042 -0.268465
vn 0.68633 0.035262 -0.726435
vn 0.695825 -0.347476 -0.62856
vn 0.827338 0.259513 -0.498162
vn -0.442423 0.87953 -0.175182
vn -0.0366122 0.984781 0.169897
vn 0.312779 0.908681 -0.27653
vn -0.395224 0.174626 -0.901833

g grp1
usemtl mtl1
f 15//15 1//1 3//3 
f 3//3 2//2 18//18 
f 68//68 2//2 3//3 
f 2//2 68//68 20//20 
f 4//4 5//5 10//10 
f 8//8 10//10 5//5 
f 14//14 8//8 1//1 
f 8//8 6//6 1//1 
f 35//35 7//7 34//34 
f 10//10 8//8 14//14 
f 5//5 34//34 8//8 
f 34//34 7//7 8//8 
f 7//7 6//6 8//8 
f 11//11 16//16 12//12 
f 9//9 10//10 12//12 
f 4//4 10//10 9//9 
f 10//10 11//11 12//12 
f 11//11 10//10 14//14 
f 24//24 25//25 12//12 
f 12//12 13//13 9//9 
f 12//12 25//25 13//13 
f 13//13 25//25 41//41 
f 14//14 1//1 15//15 
f 11//11 14//14 15//15 
f 16//16 11//11 15//15 
f 16//16 15//15 3//3 
f 3//3 18//18 16//16 
f 27//27 29//29 17//17 
f 27//27 17//17 26//26 
f 18//18 2//2 19//19 
f 22//22 18//18 19//19 
f 19//19 2//2 20//20 
f 12//12 21//21 24//24 
f 28//28 24//24 21//21 
f 21//21 16//16 18//18 
f 28//28 21//21 22//22 
f 18//18 22//22 21//21 
f 21//21 12//12 16//16 
f 22//22 23//23 28//28 
f 27//27 24//24 29//29 
f 41//41 25//25 26//26 
f 24//24 27//27 25//25 
f 25//25 27//27 26//26 
f 28//28 29//29 24//24 
f 23//23 31//31 28//28 
f 29//29 28//28 31//31 
f 17//17 29//29 30//30 
f 31//31 30//30 29//29 
f 19//19 23//23 22//22 
f 19//19 89//89 23//23 
f 60//60 23//23 89//89 
f 58//58 30//30 31//31 
f 60//60 31//31 23//23 
f 31//31 60//60 58//58 
f 94//94 60//60 89//89 
f 34//34 5//5 32//32 
f 32//32 5//5 4//4 
f 32//32 4//4 39//39 
f 39//39 33//33 32//32 
f 32//32 38//38 34//34 
f 34//34 38//38 35//35 
f 35//35 38//38 36//36 
f 32//32 37//37 38//38 
f 43//43 37//37 33//33 
f 32//32 33//33 37//37 
f 38//38 37//37 96//96 
f 96//96 36//36 38//38 
f 45//45 96//96 37//37 
f 43//43 45//45 37//37 
f 9//9 39//39 4//4 
f 41//41 9//9 13//13 
f 41//41 39//39 9//9 
f 42//42 33//33 39//39 
f 40//40 42//42 39//39 
f 40//40 39//39 41//41 
f 47//47 42//42 40//40 
f 42//42 43//43 33//33 
f 42//42 44//44 43//43 
f 44//44 42//42 47//47 
f 53//53 44//44 47//47 
f 102//102 45//45 44//44 
f 43//43 44//44 45//45 
f 54//54 102//102 53//53 
f 44//44 53//53 102//102 
f 46//46 41//41 26//26 
f 48//48 46//46 26//26 
f 41//41 46//46 40//40 
f 46//46 47//47 40//40 
f 50//50 47//47 46//46 
f 48//48 50//50 46//46 
f 17//17 48//48 26//26 
f 49//49 48//48 17//17 
f 51//51 50//50 48//48 
f 104//104 50//50 51//51 
f 51//51 48//48 49//49 
f 49//49 56//56 51//51 
f 51//51 56//56 52//52 
f 53//53 47//47 50//50 
f 50//50 104//104 53//53 
f 104//104 54//54 53//53 
f 51//51 55//55 104//104 
f 104//104 55//55 105//105 
f 51//51 52//52 55//55 
f 30//30 59//59 17//17 
f 58//58 59//59 30//30 
f 49//49 17//17 59//59 
f 56//56 49//49 59//59 
f 59//59 57//57 56//56 
f 56//56 57//57 52//52 
f 58//58 60//60 62//62 
f 62//62 59//59 58//58 
f 62//62 60//60 61//61 
f 94//94 61//61 60//60 
f 62//62 61//61 118//118 
f 63//63 57//57 59//59 
f 52//52 57//57 65//65 
f 57//57 64//64 65//65 
f 57//57 63//63 64//64 
f 62//62 63//63 59//59 
f 52//52 65//65 55//55 
f 123//123 105//105 55//55 
f 55//55 65//65 123//123 
f 66//66 123//123 65//65 
f 1//1 70//70 67//67 
f 1//1 67//67 3//3 
f 67//67 70//70 75//75 
f 3//3 67//67 68//68 
f 68//68 67//67 69//69 
f 75//75 69//69 67//67 
f 70//70 1//1 6//6 
f 70//70 6//6 71//71 
f 70//70 71//71 75//75 
f 73//73 6//6 7//7 
f 6//6 73//73 71//71 
f 71//71 76//76 75//75 
f 76//76 71//71 72//72 
f 35//35 73//73 7//7 
f 74//74 73//73 35//35 
f 71//71 73//73 74//74 
f 71//71 74//74 72//72 
f 74//74 95//95 72//72 
f 76//76 77//77 75//75 
f 72//72 80//80 76//76 
f 75//75 77//77 69//69 
f 77//77 90//90 69//69 
f 68//68 69//69 90//90 
f 95//95 78//78 72//72 
f 80//80 72//72 78//78 
f 83//83 80//80 78//78 
f 83//83 78//78 79//79 
f 76//76 80//80 77//77 
f 77//77 80//80 81//81 
f 77//77 81//81 90//90 
f 90//90 81//81 82//82 
f 80//80 83//83 81//81 
f 81//81 83//83 84//84 
f 84//84 82//82 81//81 
f 85//85 83//83 79//79 
f 84//84 83//83 85//85 
f 125//125 84//84 85//85 
f 87//87 20//20 68//68 
f 19//19 20//20 87//87 
f 90//90 87//87 68//68 
f 86//86 87//87 90//90 
f 87//87 89//89 19//19 
f 89//89 87//87 88//88 
f 86//86 88//88 87//87 
f 89//89 88//88 117//117 
f 90//90 92//92 86//86 
f 92//92 88//88 86//86 
f 91//91 92//92 82//82 
f 90//90 82//82 92//92 
f 82//82 84//84 91//91 
f 91//91 84//84 125//125 
f 88//88 92//92 117//117 
f 91//91 93//93 92//92 
f 117//117 92//92 93//93 
f 93//93 120//120 117//117 
f 91//91 109//109 93//93 
f 94//94 89//89 117//117 
f 35//35 36//36 74//74 
f 36//36 95//95 74//74 
f 95//95 36//36 96//96 
f 96//96 97//97 95//95 
f 97//97 96//96 98//98 
f 98//98 96//96 45//45 
f 78//78 95//95 79//79 
f 95//95 97//97 79//79 
f 97//97 99//99 79//79 
f 97//97 98//98 99//99 
f 99//99 98//98 101//101 
f 100//100 99//99 101//101 
f 99//99 100//100 79//79 
f 45//45 102//102 98//98 
f 102//102 101//101 98//98 
f 101//101 102//102 54//54 
f 106//106 103//103 54//54 
f 101//101 54//54 103//103 
f 100//100 101//101 103//103 
f 85//85 79//79 100//100 
f 103//103 108//108 100//100 
f 54//54 104//104 106//106 
f 104//104 105//105 106//106 
f 103//103 107//107 108//108 
f 103//103 106//106 107//107 
f 107//107 106//106 122//122 
f 106//106 105//105 122//122 
f 66//66 115//115 124//124 
f 108//108 85//85 100//100 
f 125//125 85//85 108//108 
f 125//125 108//108 113//113 
f 120//120 93//93 111//111 
f 111//111 93//93 109//109 
f 110//110 111//111 109//109 
f 111//111 110//110 112//112 
f 113//113 107//107 114//114 
f 114//114 107//107 122//122 
f 107//107 113//113 108//108 
f 124//124 115//115 116//116 
f 113//113 110//110 125//125 
f 115//115 112//112 116//116 
f 116//116 112//112 110//110 
f 116//116 113//113 114//114 
f 110//110 113//113 116//116 
f 94//94 117//117 61//61 
f 118//118 61//61 121//121 
f 63//63 118//118 64//64 
f 65//65 64//64 66//66 
f 64//64 118//118 121//121 
f 64//64 121//121 115//115 
f 66//66 64//64 115//115 
f 62//62 118//118 63//63 
f 61//61 117//117 120//120 
f 119//119 121//121 120//120 
f 120//120 121//121 61//61 
f 120//120 111//111 119//119 
f 111//111 112//112 119//119 
f 115//115 121//121 112//112 
f 112//112 121//121 119//119 
f 105//105 123//123 122//122 
f 123//123 124//124 122//122 
f 123//123 66//66 124//124 
f 122//122 124//124 114//114 
f 114//114 124//124 116//116 
f 125//125 109//109 91//91 
f 110//110 109//109 125//125 
