# PIPER geometrical reference model based on a manual segmentation. See the
# documentation for more info.
# Author: CEESAR, SOTON, UCBL-Ifsttar
# Version: 1.0.0
# License: Creative Commons Attribution 4.0 International License.
# (https://creativecommons.org/licenses/by/4.0/)
# 
# This work has received funding from the European Union Seventh Framework
# Program ([FP7/2007-2013]) under grant agreement 605544 [PIPER project]).
# Contributors include Pierre Maillez, Christophe Lecomte (SOTON), Erwan
# Jolivet (CEESAR), Philippe Beillas (UCBL-Ifsttar)
# This work is derived from a CT scan provided by CEESAR under a CCBY-4.0
# License
# 
# wavefront obj file written by the visualization toolkit

mtllib C:/desktop/registration_reference_model/22_REF_LTE635_Assembly_hands_corr/CCTu635_BP106_Pisiform_L.mtl

v -104.093 265.042 -887.437
v -102.591 267.168 -885.328
v -102.48 264.663 -886.598
v -103.9 266.356 -886.363
v -99.7366 265.44 -886.38
v -101.767 261.88 -892.239
v -100.389 261.687 -891.262
v -104.281 263.722 -889.37
v -105.014 265.321 -889.052
v -104.979 264.216 -891.398
v -105.268 265.538 -890.671
v -103.165 263.742 -887.781
v -103.016 262.621 -889.532
v -101.944 262.791 -888.643
v -99.7565 263.888 -887.778
v -100.396 262.143 -890.072
v -103.818 263.086 -891.816
v -96.2729 264.842 -886.563
v -95.5276 265.776 -886.679
v -98.2951 261.675 -891.776
v -97.7097 263.453 -888.409
v -96.0141 263.604 -887.851
v -95.1322 264.311 -887.663
v -96.1082 262.785 -889.78
v -94.8502 266.394 -887.654
v -94.6235 263.431 -889.933
v -94.4967 264.293 -889.528
v -96.3204 262.241 -892.094
v -94.7324 262.975 -891.72
v -94.4429 266.627 -890.728
v -100.077 269.283 -884.502
v -99.5179 270.733 -884.729
v -101.627 269.454 -884.986
v -102.835 269.459 -885.848
v -104.294 267.86 -886.724
v -101.472 266.372 -885.51
v -98.7041 267.434 -885.454
v -101.967 270.592 -885.75
v -100.254 271.708 -886.458
v -99.5169 272.349 -887.902
v -104.679 267.878 -888.808
v -103.781 269.985 -888.805
v -103.749 269.406 -887.469
v -102.641 270.886 -887.895
v -101.544 271.635 -888.696
v -103.315 270.637 -890.125
v -97.6597 270.258 -884.231
v -97.0042 268.412 -885.539
v -95.715 267.854 -886.643
v -95.7815 269.52 -886.591
v -97.2469 271.143 -884.53
v -96.0105 271.85 -885.542
v -96.0963 270.99 -884.921
v -97.4603 272.069 -885.618
v -95.2156 271.898 -887.435
v -95.8366 272.618 -887.261
v -94.8766 268.449 -888.416
v -94.738 268.205 -892.582
v -94.8824 269.181 -890.511
v -97.4272 272.716 -887.516
v -95.1615 272.341 -889.141
v -96.1811 272.887 -889.662
v -97.6999 272.827 -889.352
v -99.5337 272.203 -891.174
v -96.3802 272.549 -891.424
v -99.5368 261.45 -893.23
v -100.405 261.82 -894.768
v -105.351 265.118 -893.301
v -105.168 267.75 -893.427
v -105.192 266.721 -895.279
v -104.483 265.619 -896.257
v -103.847 263.947 -894.726
v -102.691 262.653 -894.061
v -104.499 266.853 -897.283
v -103.409 268.063 -897.935
v -99.8757 262.708 -897.092
v -100.167 264.239 -898.66
v -102.837 265.42 -898.455
v -102.974 266.874 -898.797
v -98.999 265.21 -899.282
v -99.5229 266.864 -899.601
v -101.902 265.819 -899.526
v -100.457 265.681 -899.837
v -101.078 266.822 -899.702
v -97.6452 261.661 -893.306
v -98.3964 261.869 -895.255
v -96.4094 262.555 -894.458
v -94.8834 262.909 -893.395
v -93.8696 264.308 -894.079
v -98.0521 262.533 -896.493
v -95.0487 263.976 -895.331
v -95.6861 265.703 -896.317
v -93.5703 264.079 -892.712
v -94.3012 265.89 -894.98
v -93.689 265.786 -893.692
v -96.9269 263.805 -896.61
v -97.5913 265.396 -898.17
v -97.8836 266.803 -898.724
v -104.547 269.321 -892.418
v -104.155 269.314 -894.251
v -104.928 267.934 -896.129
v -102.698 270.989 -891.609
v -102.456 270.178 -894.94
v -103.888 268.846 -896.293
v -101.927 269.732 -896.59
v -99.1141 271.548 -894.599
v -101.227 268.994 -898.003
v -95.1911 270.285 -891.69
v -96.6081 270.968 -895.046
v -95.5914 271.821 -891.958
v -94.6408 267.468 -894.619
v -95.582 269.88 -894.253
v -95.6987 267.393 -896.214
v -96.3736 269.2 -896.204
v -97.2221 271.684 -894.629
v -98.7946 270.382 -896.711
v -97.5966 270.108 -896.777
v -97.7336 272.364 -892.825
v -98.9802 268.731 -898.365
v -97.8356 268.189 -898.335
v -104.916 266.114 -895.49
vn -0.70462 -0.440842 0.556029
vn -0.381824 -0.17639 0.907247
vn -0.181003 -0.606981 0.773829
vn -0.675038 -0.253316 0.692932
vn 0.0570549 -0.567492 0.8214
vn -0.349489 -0.936768 -0.0179717
vn -0.071274 -0.973208 0.2186
vn -0.734072 -0.624161 0.267509
vn -0.942469 -0.196174 0.270682
vn -0.85092 -0.525009 0.0173217
vn -0.993444 -0.0512567 0.102182
vn -0.412368 -0.697163 0.586444
vn -0.418252 -0.869059 0.2642
vn -0.0506165 -0.848063 0.527473
vn 0.0529206 -0.7457 0.664177
vn 0.0277552 -0.899422 0.4362
vn -0.632659 -0.771591 -0.0662556
vn 0.225826 -0.50597 0.832465
vn 0.651242 -0.138346 0.746153
vn 0.152289 -0.964813 0.214344
vn 0.0055075 -0.832721 0.553665
vn 0.183673 -0.813067 0.552436
vn 0.71286 -0.453189 0.53521
vn 0.257001 -0.908567 0.329326
vn 0.92272 0.0278299 0.384464
vn 0.711695 -0.639284 0.291215
vn 0.954612 -0.123327 0.271121
vn 0.365132 -0.928844 0.0626704
vn 0.565832 -0.81927 0.0928996
vn 0.978216 0.157217 0.135558
vn -0.115391 -0.0795561 0.990129
vn -0.255987 0.535222 0.80499
vn -0.415541 0.210156 0.884964
vn -0.681959 0.351094 0.641611
vn -0.852274 0.178728 0.491615
vn 0.00186167 -0.448843 0.893609
vn 0.132992 -0.389066 0.911559
vn -0.522059 0.643851 0.559384
vn -0.326597 0.867023 0.376305
vn -0.285511 0.948878 0.134587
vn -0.954411 0.256932 0.15194
vn -0.807134 0.567747 0.161861
vn -0.813223 0.502961 0.292744
vn -0.598202 0.772014 0.21482
vn -0.41853 0.905612 0.0685582
vn -0.640392 0.76773 0.0220954
vn 0.161273 -0.0588646 0.985153
vn 0.485807 -0.285008 0.826294
vn 0.775077 0.0612993 0.628887
vn 0.861793 -0.123849 0.491909
vn 0.092529 0.504392 0.858503
vn 0.557116 0.621976 0.550243
vn 0.695292 0.0661744 0.715675
vn -0.0811058 0.861551 0.50115
vn 0.923191 0.291743 0.250209
vn 0.422499 0.868142 0.26043
vn 0.968768 0.0851543 0.232889
vn 0.950045 0.308754 -0.045662
vn 0.988048 0.153244 -0.0166263
vn -0.089394 0.974947 0.203685
vn 0.830635 0.555637 -0.0362381
vn 0.247831 0.963332 -0.10282
vn -0.138992 0.989848 -0.0297103
vn -0.289084 0.948566 -0.129045
vn 0.305824 0.924027 -0.229448
vn -0.0415274 -0.998056 -0.0464782
vn -0.243571 -0.926526 -0.286746
vn -0.935873 -0.327987 -0.128711
vn -0.962192 0.271678 -0.0194449
vn -0.976371 -0.0669503 -0.205469
vn -0.789266 -0.469763 -0.395451
vn -0.662617 -0.672931 -0.32879
vn -0.526647 -0.804744 -0.273918
vn -0.826555 -0.0559496 -0.560068
vn -0.525605 0.536182 -0.660491
vn -0.141894 -0.808897 -0.570572
vn -0.0834067 -0.702532 -0.706747
vn -0.595392 -0.531224 -0.602751
vn -0.58491 0.131012 -0.800448
vn 0.382261 -0.382403 -0.841216
vn 0.249943 0.2485 -0.935829
vn -0.429413 -0.303102 -0.850725
vn -0.0016564 -0.291658 -0.956521
vn -0.167754 0.332314 -0.92813
vn 0.294733 -0.952941 -0.0709597
vn 0.176358 -0.933632 -0.311815
vn 0.45713 -0.822466 -0.338499
vn 0.540056 -0.813567 -0.21552
vn 0.842621 -0.342617 -0.415456
vn 0.356796 -0.751392 -0.555074
vn 0.616556 -0.475664 -0.627377
vn 0.690296 -0.110152 -0.715093
vn 0.947474 -0.319532 0.0138558
vn 0.817044 0.0713464 -0.572145
vn 0.971213 0.190052 -0.143616
vn 0.582557 -0.495898 -0.643982
vn 0.652689 -0.275063 -0.70593
vn 0.611119 0.0480974 -0.790076
vn -0.828844 0.557943 -0.0414489
vn -0.689982 0.700018 -0.184117
vn -0.867314 0.381466 -0.319766
vn -0.483131 0.865441 -0.132651
vn -0.419315 0.860397 -0.289642
vn -0.553095 0.740708 -0.381363
vn -0.323727 0.826679 -0.460221
vn -0.207033 0.907644 -0.36513
vn -0.192788 0.709207 -0.678128
vn 0.966064 0.214459 -0.143969
vn 0.6312 0.590586 -0.502787
vn 0.783376 0.555287 -0.279246
vn 0.867636 0.359897 -0.343046
vn 0.862285 0.382343 -0.332081
vn 0.757964 0.194693 -0.622564
vn 0.725808 0.384056 -0.570704
vn 0.253409 0.853337 -0.455632
vn -0.0209995 0.79544 -0.605668
vn 0.388414 0.633621 -0.669073
vn -0.0504522 0.967304 -0.248552
vn 0.118142 0.608967 -0.784348
vn 0.516505 0.377342 -0.768658
vn -0.900371 -0.299964 -0.315203

g grp1
usemtl mtl1
f 3//3 1//1 12//12 
f 2//2 4//4 3//3 
f 3//3 36//36 2//2 
f 3//3 4//4 1//1 
f 3//3 5//5 36//36 
f 5//5 3//3 15//15 
f 16//16 13//13 7//7 
f 13//13 6//6 7//7 
f 9//9 1//1 4//4 
f 9//9 8//8 1//1 
f 4//4 35//35 9//9 
f 9//9 41//41 11//11 
f 69//69 11//11 41//41 
f 8//8 10//10 17//17 
f 8//8 9//9 10//10 
f 9//9 11//11 10//10 
f 11//11 68//68 10//10 
f 11//11 69//69 68//68 
f 13//13 14//14 12//12 
f 3//3 12//12 14//14 
f 8//8 12//12 1//1 
f 14//14 13//13 16//16 
f 12//12 8//8 13//13 
f 3//3 14//14 15//15 
f 15//15 14//14 16//16 
f 21//21 15//15 16//16 
f 13//13 17//17 6//6 
f 13//13 8//8 17//17 
f 18//18 22//22 23//23 
f 15//15 18//18 5//5 
f 5//5 18//18 37//37 
f 18//18 48//48 37//37 
f 19//19 18//18 23//23 
f 19//19 23//23 25//25 
f 18//18 19//19 48//48 
f 19//19 49//49 48//48 
f 49//49 19//19 25//25 
f 7//7 20//20 16//16 
f 24//24 16//16 20//20 
f 24//24 20//20 28//28 
f 18//18 15//15 21//21 
f 21//21 22//22 18//18 
f 22//22 21//21 24//24 
f 22//22 24//24 26//26 
f 26//26 23//23 22//22 
f 23//23 26//26 27//27 
f 23//23 27//27 25//25 
f 25//25 27//27 30//30 
f 16//16 24//24 21//21 
f 24//24 29//29 26//26 
f 27//27 26//26 93//93 
f 24//24 28//28 29//29 
f 27//27 93//93 30//30 
f 25//25 30//30 57//57 
f 57//57 30//30 59//59 
f 29//29 93//93 26//26 
f 31//31 32//32 33//33 
f 31//31 47//47 32//32 
f 34//34 35//35 2//2 
f 34//34 2//2 33//33 
f 2//2 35//35 4//4 
f 43//43 35//35 34//34 
f 37//37 36//36 5//5 
f 31//31 33//33 2//2 
f 36//36 31//31 2//2 
f 33//33 38//38 34//34 
f 34//34 38//38 43//43 
f 38//38 44//44 43//43 
f 32//32 38//38 33//33 
f 39//39 38//38 32//32 
f 32//32 54//54 39//39 
f 35//35 41//41 9//9 
f 43//43 41//41 35//35 
f 42//42 41//41 43//43 
f 99//99 69//69 41//41 
f 41//41 42//42 99//99 
f 43//43 44//44 42//42 
f 45//45 44//44 39//39 
f 38//38 39//39 44//44 
f 44//44 46//46 42//42 
f 44//44 45//45 46//46 
f 39//39 40//40 45//45 
f 40//40 64//64 45//45 
f 45//45 102//102 46//46 
f 102//102 99//99 46//46 
f 42//42 46//46 99//99 
f 45//45 64//64 102//102 
f 40//40 63//63 64//64 
f 47//47 51//51 32//32 
f 53//53 51//51 47//47 
f 47//47 31//31 37//37 
f 36//36 37//37 31//31 
f 37//37 48//48 47//47 
f 47//47 48//48 53//53 
f 53//53 48//48 50//50 
f 49//49 50//50 48//48 
f 51//51 54//54 32//32 
f 51//51 53//53 52//52 
f 51//51 52//52 54//54 
f 55//55 52//52 53//53 
f 50//50 55//55 53//53 
f 54//54 60//60 39//39 
f 39//39 60//60 40//40 
f 52//52 56//56 54//54 
f 54//54 56//56 60//60 
f 52//52 55//55 56//56 
f 25//25 57//57 49//49 
f 49//49 57//57 50//50 
f 50//50 57//57 55//55 
f 57//57 61//61 55//55 
f 30//30 58//58 59//59 
f 58//58 108//108 59//59 
f 57//57 59//59 61//61 
f 61//61 59//59 108//108 
f 61//61 108//108 110//110 
f 40//40 60//60 63//63 
f 60//60 62//62 63//63 
f 62//62 60//60 56//56 
f 56//56 61//61 62//62 
f 56//56 55//55 61//61 
f 63//63 118//118 64//64 
f 65//65 63//63 62//62 
f 63//63 65//65 118//118 
f 110//110 62//62 61//61 
f 62//62 110//110 65//65 
f 73//73 67//67 6//6 
f 67//67 66//66 6//6 
f 6//6 66//66 7//7 
f 10//10 68//68 17//17 
f 69//69 70//70 68//68 
f 71//71 70//70 74//74 
f 70//70 101//101 74//74 
f 6//6 17//17 73//73 
f 17//17 72//72 73//73 
f 68//68 72//72 17//17 
f 78//78 73//73 72//72 
f 68//68 71//71 72//72 
f 71//71 78//78 72//72 
f 76//76 67//67 73//73 
f 73//73 78//78 76//76 
f 71//71 74//74 78//78 
f 75//75 74//74 101//101 
f 79//79 78//78 74//74 
f 79//79 74//74 75//75 
f 76//76 77//77 80//80 
f 76//76 78//78 77//77 
f 82//82 77//77 78//78 
f 78//78 79//79 82//82 
f 84//84 79//79 75//75 
f 82//82 83//83 77//77 
f 83//83 80//80 77//77 
f 84//84 82//82 79//79 
f 82//82 84//84 83//83 
f 84//84 81//81 83//83 
f 80//80 83//83 81//81 
f 7//7 66//66 20//20 
f 66//66 85//85 20//20 
f 20//20 85//85 28//28 
f 28//28 85//85 87//87 
f 67//67 86//86 66//66 
f 85//85 66//66 86//86 
f 86//86 87//87 85//85 
f 67//67 76//76 86//86 
f 86//86 76//76 90//90 
f 28//28 87//87 88//88 
f 28//28 88//88 29//29 
f 95//95 58//58 30//30 
f 90//90 87//87 86//86 
f 87//87 90//90 96//96 
f 87//87 91//91 88//88 
f 91//91 87//87 96//96 
f 91//91 89//89 88//88 
f 94//94 91//91 92//92 
f 94//94 92//92 113//113 
f 96//96 92//92 91//91 
f 113//113 92//92 98//98 
f 29//29 88//88 93//93 
f 88//88 89//89 93//93 
f 30//30 93//93 95//95 
f 93//93 89//89 95//95 
f 94//94 95//95 89//89 
f 94//94 111//111 95//95 
f 91//91 94//94 89//89 
f 76//76 80//80 90//90 
f 80//80 96//96 90//90 
f 92//92 96//96 97//97 
f 92//92 97//97 98//98 
f 80//80 97//97 96//96 
f 98//98 97//97 80//80 
f 98//98 80//80 81//81 
f 120//120 98//98 81//81 
f 69//69 100//100 101//101 
f 99//99 100//100 69//69 
f 69//69 101//101 70//70 
f 104//104 101//101 100//100 
f 75//75 101//101 104//104 
f 99//99 102//102 100//100 
f 102//102 103//103 100//100 
f 64//64 106//106 102//102 
f 64//64 118//118 106//106 
f 106//106 103//103 102//102 
f 106//106 105//105 103//103 
f 100//100 103//103 104//104 
f 103//103 105//105 104//104 
f 104//104 105//105 75//75 
f 106//106 116//116 105//105 
f 105//105 116//116 107//107 
f 107//107 75//75 105//105 
f 75//75 107//107 84//84 
f 81//81 84//84 119//119 
f 84//84 107//107 119//119 
f 119//119 107//107 116//116 
f 95//95 111//111 58//58 
f 108//108 58//58 112//112 
f 111//111 112//112 58//58 
f 118//118 115//115 106//106 
f 65//65 110//110 115//115 
f 108//108 112//112 110//110 
f 110//110 112//112 109//109 
f 110//110 109//109 115//115 
f 111//111 94//94 113//113 
f 114//114 111//111 113//113 
f 111//111 114//114 112//112 
f 113//113 98//98 120//120 
f 113//113 120//120 114//114 
f 106//106 115//115 116//116 
f 117//117 116//116 115//115 
f 109//109 114//114 117//117 
f 109//109 117//117 115//115 
f 112//112 114//114 109//109 
f 115//115 118//118 65//65 
f 119//119 120//120 81//81 
f 116//116 117//117 119//119 
f 120//120 119//119 117//117 
f 120//120 117//117 114//114 
f 68//68 70//70 121//121 
f 70//70 71//71 121//121 
f 71//71 68//68 121//121 
