# PIPER geometrical reference model based on a manual segmentation. See the
# documentation for more info.
# Author: CEESAR, SOTON, UCBL-Ifsttar
# Version: 1.0.0
# License: Creative Commons Attribution 4.0 International License.
# (https://creativecommons.org/licenses/by/4.0/)
# 
# This work has received funding from the European Union Seventh Framework
# Program ([FP7/2007-2013]) under grant agreement 605544 [PIPER project]).
# Contributors include Pierre Maillez, Christophe Lecomte (SOTON), Erwan
# Jolivet (CEESAR), Philippe Beillas (UCBL-Ifsttar)
# This work is derived from a CT scan provided by CEESAR under a CCBY-4.0
# License
# 
# wavefront obj file written by the visualization toolkit

mtllib C:/desktop/registration_reference_model/22_REF_LTE635_Assembly_hands_corr/CCTu635_BP103_Hamate_R.mtl

v 54.1192 262.394 -916.512
v 55.9369 262.027 -916.032
v 56.5657 262.382 -914.954
v 57.8406 261.965 -914.347
v 57.4932 261.877 -915.648
v 55.816 261.917 -916.957
v 57.9568 263.749 -913.357
v 58.4211 264.939 -913.291
v 54.5499 265.733 -915.339
v 53.4702 263.124 -916.198
v 53.1604 263.608 -917.287
v 54.6847 264.168 -915.408
v 53.7067 264.916 -915.943
v 57.6762 262.63 -913.828
v 55.435 262.673 -915.488
v 56.2628 264.396 -914.074
v 56.7919 265.362 -913.842
v 58.0142 266.427 -914.181
v 53.4669 267.789 -916.628
v 52.8854 266.395 -917.343
v 54.286 267.112 -915.885
v 55.9952 267.946 -916.075
v 54.0771 268.664 -916.724
v 57.1851 266.103 -914.038
v 59.465 267.032 -914.902
v 57.8211 267.544 -915.571
v 59.083 268.122 -916.218
v 56.9672 268.628 -916.755
v 58.0562 268.545 -916.829
v 55.0883 262.167 -918.671
v 53.6361 262.19 -920.386
v 53.7901 261.963 -919.535
v 55.8583 261.981 -920.158
v 55.9156 262.035 -917.892
v 56.7254 261.894 -919.014
v 57.7507 261.738 -917.607
v 55.4148 262.245 -920.963
v 58.6549 261.837 -922.425
v 51.7002 264.676 -918.502
v 51.2452 266.742 -920.096
v 51.166 264.384 -920.001
v 50.8188 264.912 -920.322
v 50.1848 265.562 -921.364
v 51.1879 264.085 -921.332
v 49.2799 265.237 -922.668
v 50.1771 264.66 -921.773
v 49.426 264.679 -923.33
v 48.6629 265.941 -923.523
v 48.5215 264.987 -924.002
v 50.6 268.29 -921.613
v 49.041 266.961 -923.123
v 48.6289 267.353 -924.113
v 53.1341 264.689 -916.808
v 53 263.259 -918.568
v 52.2628 264.036 -918.425
v 54.1954 262.459 -917.211
v 54.0462 262.674 -918.219
v 53.2093 262.402 -919.906
v 52.2819 263.631 -919.453
v 53.073 268.762 -917.469
v 52.2336 267.533 -918.713
v 52.5627 269.145 -918.808
v 55.6498 269.625 -917.471
v 52.3311 263.334 -920.843
v 52.9887 263.262 -921.868
v 55.1698 262.827 -922.027
v 51.7461 263.821 -922.591
v 54.6121 263.534 -923.461
v 53.7411 263.841 -924.046
v 57.3375 261.859 -921.79
v 59.7573 262.922 -912.971
v 60.7621 262.022 -913.433
v 61.8374 262.532 -913.151
v 59.2942 261.666 -914.339
v 58.9115 262.053 -913.633
v 61.329 261.574 -914.366
v 62.5542 261.995 -914.007
v 62.4688 261.513 -915.382
v 59.2514 261.444 -915.3
v 61.2311 261.283 -915.901
v 61.8709 261.316 -917.148
v 63.4245 262.34 -914.477
v 62.8807 261.566 -917.119
v 63.4202 262.019 -915.487
v 63.4361 262.432 -917.277
v 60.9653 262.597 -912.948
v 60.1801 264.147 -913.051
v 61.6646 263.504 -913.128
v 59.3951 265.535 -913.576
v 60.9929 264.806 -913.446
v 62.959 262.923 -913.677
v 62.4219 264.175 -913.735
v 61.6649 265.386 -914.132
v 62.8105 265.273 -914.92
v 63.7425 263.014 -914.689
v 63.4632 263.909 -914.467
v 64.0088 263.316 -915.488
v 63.914 263.369 -916.401
v 63.6503 264.703 -916.786
v 63.534 265.16 -915.731
v 63.4087 265.767 -917.01
v 60.5124 266.009 -914.116
v 61.5657 267.265 -916.116
v 62.4925 266.593 -916.179
v 60.5691 267.882 -916.462
v 59.0895 268.953 -917.778
v 60.0392 261.448 -917.696
v 62.6875 262.249 -919.047
v 59.0131 261.551 -920.745
v 61.1167 261.356 -919.475
v 61.9568 261.498 -918.992
v 60.8672 261.754 -921.604
v 62.3212 262.6 -920.845
v 59.9429 262.149 -923.277
v 63.2923 263.376 -918.227
v 63.2268 264.313 -918.716
v 62.9368 265.445 -919.89
v 62.9453 265.842 -918.658
v 62.731 266.821 -917.452
v 61.8967 267.6 -917.292
v 60.8293 268.607 -918.126
v 61.2963 268.559 -919.16
v 60.3658 269.434 -920.953
v 62.2381 267.195 -919.598
v 62.4286 266.649 -921.159
v 62.5825 265.406 -921.926
v 61.8777 263.463 -923.021
v 61.0708 262.599 -923.302
v 62.4692 264.515 -921.855
v 62.4168 266.677 -923.569
v 61.7883 268.103 -921.559
v 60.986 269.103 -922.251
v 62.5615 268.003 -924.382
v 62.0906 267.872 -922.911
v 61.3699 269.33 -923.415
v 51.934 269.481 -920.055
v 51.317 270.777 -921.59
v 49.8767 270.217 -923.448
v 51.6057 272.833 -922.249
v 50.8117 273.436 -923.972
v 53.4677 269.043 -917.174
v 54.3467 270.237 -917.738
v 54.5526 271.688 -918.518
v 53.0103 270.809 -918.989
v 56.2936 270.731 -918.664
v 57.3383 269.473 -917.819
v 57.9971 270.353 -919.414
v 55.5466 271.619 -918.893
v 59.7656 269.686 -919.569
v 59.0433 270.375 -920.76
v 56.6954 271.623 -919.86
v 56.7089 272.748 -920.965
v 52.569 273.068 -920.58
v 53.4767 274.001 -920.034
v 53.9912 272.168 -918.801
v 55.8574 272.663 -919.779
v 55.1118 274.013 -919.779
v 54.5506 275.18 -920.265
v 55.9866 274.953 -920.8
v 57.7725 271.624 -921.444
v 57.4768 272.421 -922.02
v 58.635 272.023 -923.001
v 57.4796 273.467 -922.365
v 59.8955 272.401 -924.43
v 52.8347 274.699 -921.248
v 53.7318 275.803 -921.084
v 53.3112 276.718 -922.348
v 56.0597 276.154 -921.752
v 54.3933 276.536 -921.34
v 55.131 276.089 -920.985
v 52.2273 274.797 -922.655
v 52.5744 276.299 -923.458
v 56.715 274.867 -921.666
v 57.1086 275.691 -922.365
v 56.4465 276.658 -922.679
v 58.7345 273.373 -923.857
v 58.1268 274.674 -923.292
v 56.485 276.875 -923.985
v 55.1189 277.261 -922.362
v 52.9725 276.979 -923.843
v 54.0586 277.771 -922.936
v 54.8517 277.766 -923.298
v 54.171 277.838 -923.844
v 59.3183 270.777 -922.419
v 60.8872 271.004 -924.067
v 62.6551 270.876 -925.131
v 48.3375 266.901 -925.209
v 49.3387 264.842 -924.676
v 48.7698 265.269 -925.224
v 48.7817 266.128 -926.217
v 51.1001 264.888 -926.474
v 49.6638 267.009 -928.401
v 49.3043 269.774 -924.541
v 48.8849 268.515 -925.693
v 49.0649 267.651 -926.805
v 50.0114 266.153 -928.536
v 50.8105 265.425 -928.129
v 52.3615 266.451 -929.77
v 50.2225 267.272 -929.033
v 51.0958 266.625 -929.451
v 50.9523 268.543 -929.316
v 52.7922 264.069 -924.925
v 52.9922 264.313 -926.415
v 54.9836 263.963 -927.592
v 57.4561 263.193 -926.273
v 57.7699 262.826 -924.804
v 58.0052 263.335 -927.743
v 56.1447 263.53 -926.895
v 51.3394 265.7 -929.285
v 53.5911 264.589 -927.927
v 53.7813 264.881 -929.467
v 53.4337 267.44 -929.813
v 53.711 265.446 -929.997
v 55.1526 264.706 -930.399
v 56.6832 264.261 -930.361
v 56.049 264.034 -929.323
v 58.1141 263.786 -929.23
v 58.9172 264.951 -930.439
v 58.1161 264.354 -930.502
v 55.5714 264.979 -930.863
v 59.4284 266.316 -930.664
v 58.4015 265.399 -931.31
v 57.4068 264.677 -931.172
v 57.8956 265.837 -931.646
v 52.038 267.959 -929.593
v 56.4365 269.437 -930.421
v 56.5431 268.413 -930.763
v 55.2184 267.803 -930.261
v 56.8776 267.336 -931.087
v 59.0342 267.054 -931.722
v 57.656 269.083 -931.294
v 58.3982 267.912 -931.7
v 59.7223 268.659 -932.163
v 59.208 269.509 -932.297
v 59.2553 262.829 -925.516
v 61.054 263.382 -924.975
v 60.3603 262.891 -925.103
v 62.2765 265.701 -923.785
v 61.7587 264.584 -924.756
v 59.4464 263.386 -927.388
v 60.3322 263.748 -927.173
v 61.1005 264.627 -926.542
v 62.4622 267.026 -924.961
v 62.3938 269.213 -924.464
v 62.9172 269.912 -925
v 61.8374 266.616 -926.745
v 62.4316 267.98 -928.031
v 63.1191 268.526 -926.091
v 63.2647 269.075 -925.403
v 64.4684 269.306 -926.661
v 63.6676 268.669 -927.974
v 62.9185 268.48 -929.157
v 64.0023 268.746 -929.612
v 65.9877 269.508 -926.877
v 65.0627 268.972 -928.348
v 59.2424 264.137 -929.118
v 59.9941 265.296 -928.874
v 60.8374 266.2 -928.171
v 61.1513 267.363 -928.676
v 61.8918 268.224 -929.577
v 60.1027 267.098 -930.014
v 60.8904 268.095 -930.136
v 60.1196 268.094 -931.622
v 61.3589 268.648 -930.843
v 62.5994 268.771 -930.648
v 66.5749 268.919 -928.693
v 64.0957 268.897 -931.29
v 65.6724 268.68 -930.325
v 66.9903 269.462 -927.094
v 69.2621 268.769 -929.128
v 69.1214 269.729 -928.453
v 68.4484 268.445 -929.23
v 67.2932 268.444 -930.305
v 68.589 268.045 -931.219
v 69.3067 268.513 -930.627
v 69.8614 269.193 -930.221
v 61.2696 269.006 -931.889
v 60.6302 269.656 -932.679
v 62.6601 269.394 -932.217
v 65.4983 268.648 -932
v 66.4002 268.393 -933.351
v 64.1418 269.139 -932.981
v 66.8626 268.638 -934.343
v 65.5861 268.936 -934.727
v 65.6085 269.393 -935.391
v 67.1802 268.129 -932.079
v 67.8272 268.243 -932.906
v 69.2426 268.783 -931.829
v 67.4496 268.954 -934.325
v 68.4017 269.32 -933.262
v 49.8257 270.987 -925.842
v 50.3135 272.697 -926.247
v 49.8091 270.196 -926.973
v 50.1744 271.611 -926.87
v 50.4662 273.132 -924.73
v 51.5581 275.14 -924.669
v 50.909 274.003 -926.543
v 50.7674 273.264 -927.849
v 50.1526 269.846 -928.211
v 50.7066 270.401 -928.824
v 51.653 270.441 -929.246
v 50.7503 272.565 -928.417
v 51.3897 272.219 -928.908
v 51.2615 273.471 -928.401
v 52.4286 272.143 -928.933
v 55.9371 273.01 -927.596
v 54.5438 273.614 -927.509
v 57.0528 272.643 -928.201
v 52.1574 275.658 -925.63
v 53.2517 277.026 -924.764
v 53.3786 273.892 -927.831
v 54.4013 274.873 -927.271
v 55.4025 274.139 -927.264
v 52.6079 275.953 -926.484
v 51.6453 274.845 -927.474
v 52.141 274.938 -927.611
v 53.6005 276.18 -926.67
v 55.6954 275.217 -927.16
v 54.284 276.868 -925.846
v 56.1571 276.83 -924.867
v 57.8085 276.287 -926.528
v 58.7535 275.817 -924.17
v 58.0379 276.281 -924.133
v 56.8696 274.009 -927.665
v 58.1553 274.305 -928.344
v 56.046 276.128 -926.853
v 57.3147 275.178 -927.642
v 57.6435 276.142 -927.201
v 59.4207 275.787 -926.403
v 59.1759 275.921 -927.951
v 52.6581 270.399 -929.201
v 53.8446 269.545 -929.448
v 55.3539 269.839 -929.71
v 54.8976 271.476 -928.781
v 53.3285 271.909 -928.785
v 58.011 271.598 -930.297
v 58.2245 273.32 -928.674
v 58.1297 272.323 -929.216
v 58.8893 273.751 -929.111
v 57.4804 270.556 -930.862
v 56.3836 270.941 -929.645
v 59.096 272.72 -930.209
v 58.6674 270.434 -931.938
v 58.9665 271.45 -931.553
v 63.6909 271.775 -925.933
v 62.0205 272.394 -925.624
v 64.1559 270.935 -925.718
v 64.0865 270.167 -925.583
v 65.98 271.074 -926.274
v 65.6862 271.79 -926.406
v 65.4219 273.52 -927.82
v 66.4208 272.675 -927.23
v 59.9716 274.831 -925.329
v 61.0009 273.966 -926.126
v 60.0764 275.363 -926.158
v 60.7201 275.075 -927.235
v 64.0833 272.853 -926.808
v 62.1113 273.848 -926.904
v 61.5684 274.836 -927.88
v 59.7428 275.76 -927.75
v 63.3951 273.939 -927.77
v 66.5163 273.204 -929.978
v 59.4784 275.266 -928.629
v 61.7859 274.294 -929.964
v 62.262 274.662 -928.538
v 60.3792 275.365 -928.42
v 60.2518 274.571 -929.592
v 65.0079 273.901 -928.683
v 65.1531 273.869 -930.246
v 63.6405 274.048 -930.472
v 62.8817 273.486 -931.708
v 66.0934 270.224 -926.371
v 68.0121 269.778 -927.393
v 67.9272 270.626 -927.223
v 67.2572 271.742 -927.212
v 69.2612 270.488 -928.884
v 67.7526 272.188 -928.074
v 66.5916 273.249 -928.459
v 67.7887 272.451 -928.98
v 69.8202 269.977 -929.867
v 69.3418 270.684 -930.799
v 68.9677 271.313 -929.564
v 68.3358 271.967 -930.083
v 69.6334 269.768 -931.31
v 66.8201 272.34 -931.236
v 61.4234 270.465 -933.694
v 60.3614 270.48 -932.977
v 61.7956 269.813 -933.057
v 60.3277 272.628 -931.484
v 60.5128 271.29 -932.98
v 61.3024 273.631 -931.05
v 62.9549 269.888 -934.239
v 62.2081 271.214 -934.633
v 61.8356 272.109 -933.519
v 62.7878 272.506 -933.247
v 65.4329 272.2 -932.775
v 65.6748 273.125 -931.591
v 63.2078 270.394 -935.001
v 62.9814 271.77 -934.572
v 65.4338 271.632 -933.597
v 66.575 270.793 -934.639
v 65.1637 271.244 -935.249
v 64.3607 271.871 -933.888
v 64.4443 273.62 -931.48
v 63.4974 270.867 -935.275
v 64.534 270.997 -935.445
v 65.0751 270.272 -935.567
v 66.3929 270.055 -935.512
v 67.3163 270.735 -933.273
v 68.1398 271.205 -931.752
v 68.8561 270.242 -932.171
v 67.577 269.801 -934.207
v 66.8023 269.367 -934.874
vn -0.512472 -0.828088 0.22725
vn -0.250849 -0.909578 0.331274
vn -0.393205 -0.780791 0.485546
vn -0.355469 -0.838427 0.413136
vn -0.225145 -0.963044 0.147835
vn -0.196788 -0.980398 -0.00973787
vn -0.333826 -0.116099 0.935458
vn -0.138407 0.263678 0.954629
vn -0.590708 0.103742 0.800189
vn -0.757489 -0.418552 0.501024
vn -0.847429 -0.45179 0.278837
vn -0.536006 -0.166596 0.827613
vn -0.695795 0.0196959 0.71797
vn -0.441854 -0.444168 0.77941
vn -0.449951 -0.555518 0.699245
vn -0.531412 -0.125193 0.837811
vn -0.383122 0.215531 0.898201
vn -0.0550301 0.66653 0.743445
vn -0.667276 0.226439 0.709555
vn -0.825175 0.104777 0.555075
vn -0.438076 0.341983 0.831347
vn -0.078416 0.651592 0.754506
vn -0.211553 0.493012 0.84391
vn -0.203938 0.541904 0.815321
vn 0.127516 0.743385 0.656596
vn -0.0233673 0.758907 0.650779
vn 0.101559 0.822425 0.559735
vn 0.0870096 0.726238 0.681914
vn 0.0977327 0.803772 0.586855
vn -0.165842 -0.977101 0.133302
vn -0.332892 -0.888232 -0.316586
vn -0.34536 -0.92653 0.149228
vn -0.126704 -0.989623 -0.0677622
vn -0.190075 -0.980675 -0.0463547
vn -0.149684 -0.988609 0.0157261
vn -0.139649 -0.990201 -0.000204244
vn -0.206475 -0.918122 -0.33826
vn -0.0605944 -0.965685 -0.25255
vn -0.826625 -0.213423 0.520712
vn -0.840455 0.177774 0.51189
vn -0.751069 -0.587142 0.301926
vn -0.878408 -0.103449 0.46658
vn -0.832738 -0.00672604 0.553627
vn -0.523239 -0.846429 0.0988896
vn -0.801145 -0.295688 0.520323
vn -0.726636 -0.564401 0.39173
vn -0.479733 -0.863533 0.155454
vn -0.903376 0.0237776 0.42819
vn -0.802434 -0.589265 0.0941567
vn -0.798827 0.212694 0.562704
vn -0.826388 0.171154 0.53646
vn -0.930527 0.214006 0.29719
vn -0.843229 -0.0458215 0.535597
vn -0.661307 -0.694513 0.283416
vn -0.696785 -0.597785 0.396413
vn -0.503944 -0.86107 -0.0678101
vn -0.456421 -0.879524 0.134601
vn -0.673328 -0.737383 0.0538106
vn -0.672665 -0.705033 0.224613
vn -0.805717 0.254578 0.534799
vn -0.854734 0.178274 0.487492
vn -0.861376 0.241616 0.446826
vn 0.138644 0.616671 0.774916
vn -0.588431 -0.807128 -0.0478923
vn -0.297003 -0.894902 -0.333075
vn -0.277484 -0.884561 -0.374905
vn -0.302105 -0.943192 -0.138277
vn -0.249516 -0.93323 -0.258504
vn -0.1757 -0.973161 -0.148621
vn -0.218198 -0.95072 -0.220277
vn -0.139446 -0.225187 0.964285
vn -0.000442944 -0.772021 0.635597
vn 0.314705 -0.376048 0.871521
vn -0.122954 -0.940159 0.317778
vn -0.224336 -0.688911 0.689257
vn 0.0823248 -0.937837 0.33717
vn 0.399348 -0.748829 0.528939
vn 0.311466 -0.934479 0.172446
vn -0.152553 -0.980878 0.120851
vn 0.0241428 -0.997288 0.0695227
vn 0.116035 -0.992943 -0.0245103
vn 0.735996 -0.538705 0.410008
vn 0.570367 -0.813588 -0.112942
vn 0.73903 -0.667883 0.088136
vn 0.889335 -0.389869 -0.238925
vn 0.0486287 -0.319681 0.946277
vn 0.0486423 0.232794 0.971309
vn 0.295524 0.195974 0.935019
vn 0.0653324 0.5201 0.851603
vn 0.247967 0.447631 0.85915
vn 0.617327 -0.0943304 0.781031
vn 0.49117 0.399748 0.773921
vn 0.412378 0.587551 0.696225
vn 0.578514 0.574869 0.57866
vn 0.911653 -0.120577 0.392874
vn 0.766136 0.311431 0.562181
vn 0.992438 -0.0652972 0.103941
vn 0.979394 -0.100887 -0.174957
vn 0.975127 0.167942 -0.144647
vn 0.851187 0.443403 0.280846
vn 0.915593 0.400056 -0.0405535
vn 0.238533 0.646388 0.724765
vn 0.423673 0.757844 0.496159
vn 0.630641 0.665525 0.399209
vn 0.298157 0.819213 0.489891
vn 0.234646 0.842328 0.485205
vn -0.0976228 -0.995092 -0.0162069
vn 0.812067 -0.506669 -0.289541
vn -0.0713043 -0.99366 -0.0869241
vn 0.0943469 -0.989396 -0.110428
vn 0.454313 -0.865838 -0.209581
vn 0.319283 -0.905958 -0.278027
vn 0.806353 -0.503955 -0.309556
vn 0.172535 -0.934617 -0.311004
vn 0.948945 -0.130786 -0.287051
vn 0.977431 0.0369589 -0.207999
vn 0.974156 0.183779 -0.131319
vn 0.940713 0.303599 -0.151285
vn 0.806095 0.589919 0.0469607
vn 0.582798 0.763331 0.278697
vn 0.430752 0.837923 0.33517
vn 0.678416 0.727984 0.0989506
vn 0.644934 0.753672 0.126643
vn 0.870851 0.489867 -0.0405932
vn 0.950743 0.307167 -0.04167
vn 0.986962 -0.00799431 -0.160754
vn 0.856312 -0.41733 -0.304246
vn 0.56306 -0.754832 -0.33644
vn 0.951623 -0.185008 -0.245328
vn 0.99974 0.00467179 0.0223366
vn 0.81568 0.574183 0.0705694
vn 0.717918 0.656896 0.230395
vn 0.924046 0.0285012 0.381217
vn 0.895909 0.401831 0.189416
vn 0.720732 0.48045 0.499713
vn -0.827044 0.22492 0.515179
vn -0.816509 0.245554 0.522509
vn -0.845268 0.286483 0.451054
vn -0.825946 0.311262 0.470032
vn -0.851693 0.388795 0.351365
vn -0.508439 0.437702 0.741557
vn -0.0210422 0.490537 0.871166
vn 0.130443 0.479658 0.867705
vn -0.757277 0.321462 0.568502
vn 0.388723 0.628828 0.673402
vn 0.234737 0.751244 0.616872
vn 0.414258 0.77529 0.476777
vn 0.444392 0.469951 0.762668
vn 0.455397 0.846841 0.274725
vn 0.531131 0.796305 0.28948
vn 0.590369 0.582484 0.558728
vn 0.777385 0.33516 0.532297
vn -0.78539 0.298922 0.542041
vn -0.54567 0.420189 0.725042
vn -0.322322 0.441812 0.837204
vn 0.667286 0.36946 0.646707
vn 0.339629 0.40405 0.84935
vn -0.058958 0.524242 0.849526
vn 0.616279 0.377344 0.691239
vn 0.642069 0.636661 0.427095
vn 0.738174 0.392646 0.548569
vn 0.642365 0.475301 0.601212
vn 0.770481 0.173363 0.613436
vn 0.549545 0.452761 0.702145
vn -0.766385 0.398628 0.503736
vn -0.513077 0.534966 0.67124
vn -0.667033 0.580539 0.466949
vn 0.54138 0.567267 0.620578
vn -0.164113 0.705381 0.689569
vn 0.28098 0.617812 0.73441
vn -0.821131 0.388404 0.418195
vn -0.811947 0.510637 0.28283
vn 0.739781 0.249175 0.625009
vn 0.660212 0.383982 0.645506
vn 0.515914 0.749509 0.414811
vn 0.709584 0.222478 0.668576
vn 0.745627 0.0995318 0.658888
vn 0.3965 0.917532 -0.0303718
vn 0.294634 0.808855 0.508866
vn -0.712934 0.699915 0.0429534
vn -0.287906 0.897155 0.334999
vn 0.308156 0.948704 0.0707128
vn -0.144588 0.970075 -0.195061
vn 0.618874 0.650762 0.439891
vn 0.546856 0.457231 0.701348
vn 0.417887 0.331428 0.845888
vn -0.993209 0.0570982 -0.101364
vn -0.30887 -0.92244 -0.231743
vn -0.70642 -0.630781 -0.321069
vn -0.892124 -0.24602 -0.378931
vn -0.27618 -0.921618 -0.272663
vn -0.841875 -0.039145 -0.538251
vn -0.932427 0.328438 0.150694
vn -0.94091 0.289764 -0.175286
vn -0.919751 0.145121 -0.364688
vn -0.660565 -0.478752 -0.578316
vn -0.385818 -0.859476 -0.335328
vn -0.21574 -0.0433273 -0.975489
vn -0.625947 -0.00885577 -0.779815
vn -0.391404 -0.128098 -0.911259
vn -0.383418 0.111774 -0.916786
vn -0.200552 -0.967138 -0.156276
vn -0.268795 -0.934618 -0.232891
vn -0.29069 -0.933519 -0.209862
vn -0.182204 -0.971152 -0.153833
vn -0.216627 -0.939755 -0.264449
vn -0.047792 -0.970889 -0.234715
vn -0.21501 -0.966333 -0.141323
vn -0.405859 -0.589706 -0.69823
vn -0.303765 -0.91927 -0.25034
vn -0.352159 -0.834509 -0.423767
vn -0.177367 0.125461 -0.976115
vn -0.36061 -0.313101 -0.878594
vn -0.365984 -0.749416 -0.551754
vn -0.141519 -0.884457 -0.444643
vn -0.225668 -0.936423 -0.268676
vn 0.103386 -0.929578 -0.35383
vn 0.662478 -0.507378 -0.55108
vn 0.284709 -0.796774 -0.533003
vn -0.349029 -0.348543 -0.869883
vn 0.76399 -0.41818 -0.49137
vn 0.460209 -0.468369 -0.754214
vn 0.00394415 -0.639297 -0.76895
vn -0.0500984 -0.186451 -0.981186
vn -0.149102 0.109371 -0.982755
vn -0.50559 0.276291 -0.817338
vn -0.462176 0.179287 -0.868475
vn -0.353548 0.180304 -0.917875
vn -0.404224 0.108411 -0.908213
vn 0.296902 -0.329281 -0.896339
vn -0.529718 0.094117 -0.842936
vn -0.327526 -0.0448224 -0.943779
vn 0.0436232 -0.401433 -0.914849
vn -0.398333 -0.132262 -0.907655
vn 0.0311682 -0.961084 -0.274493
vn 0.729891 -0.596153 -0.334455
vn 0.392471 -0.859495 -0.327466
vn 0.966831 -0.196347 -0.163357
vn 0.894102 -0.347657 -0.28234
vn 0.274222 -0.899503 -0.340141
vn 0.65643 -0.625 -0.422463
vn 0.83169 -0.393218 -0.39201
vn 0.953935 -0.29282 -0.0652997
vn 0.678618 0.189932 0.709509
vn 0.530642 0.0880963 0.843005
vn 0.833594 -0.443621 -0.329122
vn 0.581164 -0.782316 -0.224121
vn 0.769011 -0.632286 0.0940036
vn 0.761272 -0.311885 0.568501
vn 0.403599 -0.805298 0.434285
vn 0.379561 -0.923369 0.0576462
vn 0.301376 -0.936645 -0.178517
vn 0.0916348 -0.995152 -0.0357114
vn 0.133077 -0.800692 0.584109
vn 0.118081 -0.973935 0.193669
vn 0.568794 -0.674555 -0.470584
vn 0.793055 -0.374744 -0.48024
vn 0.793172 -0.380581 -0.475433
vn 0.649589 -0.613243 -0.449408
vn 0.350759 -0.868242 -0.35089
vn 0.778633 -0.477286 -0.407344
vn 0.540824 -0.740487 -0.398984
vn 0.538146 -0.597876 -0.59409
vn 0.337736 -0.876558 -0.342899
vn 0.117077 -0.950113 -0.2891
vn -0.0733649 -0.961988 0.263053
vn -0.125823 -0.982723 -0.135733
vn -0.11531 -0.988237 0.10046
vn 0.20483 -0.71897 0.664174
vn 0.645065 -0.629558 0.433068
vn 0.788342 -0.105452 0.606132
vn 0.108744 -0.938615 0.327379
vn -0.161711 -0.967822 0.192794
vn 0.275948 -0.960663 -0.0312885
vn 0.644857 -0.764243 0.00964613
vn 0.954597 -0.293289 0.0522029
vn 0.230341 -0.821066 -0.522297
vn -0.130602 -0.58455 -0.800778
vn -0.0810719 -0.945096 -0.316577
vn -0.266156 -0.963782 -0.016867
vn -0.191695 -0.967818 -0.163037
vn -0.295329 -0.9401 -0.170269
vn 0.159393 -0.827049 -0.539059
vn -0.234494 -0.879376 -0.414379
vn -0.0696594 -0.576605 -0.814048
vn -0.138566 -0.990319 -0.00828816
vn 0.30791 -0.887962 -0.341637
vn 0.793649 -0.457539 -0.400973
vn 0.599982 -0.429398 -0.675011
vn 0.807091 -0.0310931 -0.589608
vn -0.946369 0.300862 -0.117766
vn -0.946265 0.310611 -0.0900185
vn -0.92953 0.258688 -0.262783
vn -0.950511 0.246073 -0.189675
vn -0.915136 0.384802 0.120227
vn -0.829419 0.555648 0.0576237
vn -0.860343 0.501652 -0.0903092
vn -0.867231 0.38738 -0.312804
vn -0.871189 0.187399 -0.453776
vn -0.623772 0.151252 -0.766832
vn -0.170984 0.151865 -0.9735
vn -0.772979 0.264628 -0.576608
vn -0.261452 0.251404 -0.931901
vn -0.387017 0.483578 -0.785092
vn 0.129334 0.305557 -0.943349
vn -0.11884 0.43994 -0.890129
vn 0.206895 0.349535 -0.913794
vn -0.374599 0.508528 -0.775291
vn -0.739617 0.660899 -0.127194
vn -0.525191 0.801807 -0.285097
vn 0.247278 0.366352 -0.897017
vn 0.104786 0.309044 -0.945258
vn -0.0374748 0.191133 -0.980849
vn -0.496515 0.787217 -0.365736
vn -0.601117 0.669677 -0.436109
vn -0.0985211 0.611871 -0.784798
vn -0.121401 0.708286 -0.695408
vn -0.119635 0.252072 -0.960285
vn -0.0710652 0.87884 -0.471795
vn 0.259054 0.945614 -0.196735
vn 0.159158 0.978024 -0.134673
vn 0.697795 0.535497 0.475736
vn 0.440645 0.882242 0.165774
vn -0.376581 0.206381 -0.903102
vn -0.486719 0.288293 -0.824616
vn -0.0740592 0.65792 -0.749438
vn -0.345025 0.334128 -0.877107
vn -0.146123 0.829404 -0.5392
vn 0.42143 0.903631 0.0764657
vn 0.043724 0.900243 -0.433188
vn 0.0234542 0.192993 -0.98092
vn -0.128929 0.263089 -0.956118
vn -0.327277 0.354109 -0.876069
vn -0.057689 0.498923 -0.864724
vn 0.169879 0.365036 -0.915363
vn -0.565704 0.652685 -0.503965
vn -0.588993 0.327436 -0.738832
vn -0.579251 0.590084 -0.562378
vn -0.593898 0.428064 -0.681209
vn -0.599665 0.386395 -0.700786
vn -0.411857 0.545083 -0.730246
vn -0.611246 0.574854 -0.543986
vn -0.585979 0.218656 -0.780268
vn -0.568579 0.547872 -0.613641
vn 0.28058 0.458018 0.843502
vn 0.397686 0.511311 0.761844
vn 0.297645 0.256807 0.919488
vn 0.470224 -0.185491 0.862834
vn 0.384833 0.152333 0.910329
vn 0.291928 0.427054 0.855805
vn 0.269683 0.835459 0.478831
vn 0.405706 0.635518 0.656901
vn 0.756515 0.32173 0.569363
vn 0.593435 0.513575 0.619738
vn 0.664196 0.70307 0.254039
vn 0.559476 0.767325 0.313367
vn 0.234288 0.640211 0.7316
vn 0.404273 0.678632 0.613206
vn 0.432034 0.856825 0.281422
vn 0.392135 0.919443 -0.0292423
vn 0.286624 0.812842 0.507084
vn 0.502416 0.844797 -0.184108
vn -0.220125 0.629837 -0.744882
vn 0.0549984 0.904507 -0.422898
vn 0.305603 0.952126 -0.00791954
vn 0.254657 0.901112 -0.350924
vn -0.258739 0.718619 -0.645477
vn 0.303248 0.941558 0.146663
vn 0.330445 0.928277 -0.170609
vn 0.0773904 0.948225 -0.308027
vn -0.0557063 0.869421 -0.490921
vn 0.336196 -0.317618 0.886618
vn 0.526987 -0.351528 0.773765
vn 0.620773 0.138797 0.771606
vn 0.557097 0.403929 0.725592
vn 0.840064 0.333354 0.42798
vn 0.675932 0.59668 0.432538
vn 0.482052 0.855492 0.189101
vn 0.639674 0.763428 0.0894129
vn 0.965779 0.202652 0.161872
vn 0.783324 0.567043 -0.254689
vn 0.790844 0.602366 0.108266
vn 0.63182 0.749747 -0.196682
vn 0.916237 0.15832 -0.368028
vn 0.520795 0.731634 -0.439869
vn -0.540071 -0.435227 -0.720348
vn -0.491144 -0.123744 -0.862244
vn -0.18595 -0.837049 -0.51456
vn -0.50523 0.632058 -0.587576
vn -0.593565 0.348706 -0.725317
vn -0.237883 0.786157 -0.570411
vn -0.388409 -0.796149 -0.463989
vn -0.550161 0.176354 -0.816224
vn -0.413131 0.6969 -0.58622
vn -0.0302713 0.845487 -0.533137
vn 0.360681 0.750327 -0.554003
vn 0.440095 0.753831 -0.48791
vn -0.434529 -0.46758 -0.769775
vn -0.144672 0.745113 -0.651058
vn 0.381083 0.834969 -0.396993
vn 0.566606 0.704032 -0.42813
vn 0.232556 0.71156 -0.663024
vn 0.19539 0.89564 -0.399566
vn 0.162141 0.866493 -0.472124
vn -0.313418 0.100551 -0.944277
vn -0.0594255 0.387936 -0.919769
vn -0.0879568 -0.0488119 -0.994928
vn 0.447477 0.0727563 -0.891331
vn 0.54577 0.717111 -0.433459
vn 0.544907 0.706406 -0.451738
vn 0.708187 0.485307 -0.512785
vn 0.752 0.285905 -0.593932
vn 0.326358 -0.530109 -0.782608

g grp1
usemtl mtl1
f 71//71 14//14 75//75 
f 15//15 10//10 1//1 
f 2//2 15//15 1//1 
f 56//56 6//6 1//1 
f 1//1 6//6 2//2 
f 14//14 3//3 4//4 
f 4//4 3//3 5//5 
f 75//75 4//4 74//74 
f 4//4 75//75 14//14 
f 74//74 5//5 79//79 
f 74//74 4//4 5//5 
f 3//3 15//15 2//2 
f 3//3 2//2 5//5 
f 2//2 6//6 5//5 
f 36//36 79//79 5//5 
f 5//5 6//6 36//36 
f 34//34 36//36 6//6 
f 14//14 71//71 7//7 
f 16//16 7//7 17//17 
f 8//8 7//7 71//71 
f 7//7 8//8 17//17 
f 16//16 12//12 15//15 
f 16//16 9//9 12//12 
f 16//16 17//17 9//9 
f 21//21 9//9 17//17 
f 53//53 10//10 13//13 
f 11//11 1//1 10//10 
f 53//53 11//11 10//10 
f 15//15 12//12 10//10 
f 12//12 13//13 10//10 
f 13//13 20//20 53//53 
f 9//9 13//13 12//12 
f 14//14 15//15 3//3 
f 14//14 16//16 15//15 
f 14//14 7//7 16//16 
f 8//8 24//24 17//17 
f 8//8 18//18 24//24 
f 89//89 18//18 8//8 
f 19//19 20//20 13//13 
f 19//19 60//60 20//20 
f 13//13 9//9 21//21 
f 19//19 13//13 21//21 
f 21//21 23//23 19//19 
f 21//21 22//22 23//23 
f 19//19 141//141 60//60 
f 141//141 19//19 23//23 
f 23//23 22//22 63//63 
f 22//22 28//28 63//63 
f 23//23 63//63 142//142 
f 17//17 24//24 21//21 
f 24//24 22//22 21//21 
f 24//24 26//26 22//22 
f 25//25 18//18 89//89 
f 26//26 24//24 18//18 
f 25//25 26//26 18//18 
f 27//27 26//26 25//25 
f 22//22 26//26 28//28 
f 29//29 28//28 26//26 
f 27//27 29//29 26//26 
f 106//106 29//29 27//27 
f 57//57 54//54 32//32 
f 56//56 57//57 30//30 
f 30//30 57//57 32//32 
f 58//58 32//32 54//54 
f 32//32 58//58 31//31 
f 32//32 33//33 30//30 
f 35//35 30//30 33//33 
f 32//32 31//31 33//33 
f 33//33 31//31 37//37 
f 56//56 34//34 6//6 
f 30//30 34//34 56//56 
f 30//30 35//35 34//34 
f 34//34 35//35 36//36 
f 109//109 36//36 35//35 
f 35//35 33//33 109//109 
f 70//70 109//109 33//33 
f 33//33 37//37 70//70 
f 109//109 70//70 38//38 
f 66//66 70//70 37//37 
f 206//206 70//70 66//66 
f 41//41 55//55 39//39 
f 61//61 40//40 39//39 
f 55//55 41//41 59//59 
f 59//59 44//44 64//64 
f 59//59 41//41 44//44 
f 42//42 41//41 39//39 
f 40//40 42//42 39//39 
f 40//40 43//43 42//42 
f 136//136 40//40 61//61 
f 40//40 50//50 43//43 
f 40//40 136//136 50//50 
f 41//41 46//46 44//44 
f 64//64 44//44 67//67 
f 46//46 47//47 44//44 
f 44//44 47//47 67//67 
f 45//45 47//47 46//46 
f 45//45 46//46 43//43 
f 43//43 51//51 45//45 
f 42//42 46//46 41//41 
f 42//42 43//43 46//46 
f 47//47 188//188 67//67 
f 67//67 188//188 202//202 
f 48//48 49//49 45//45 
f 45//45 49//49 47//47 
f 51//51 48//48 45//45 
f 47//47 49//49 188//188 
f 187//187 49//49 48//48 
f 51//51 43//43 50//50 
f 137//137 50//50 136//136 
f 48//48 52//52 187//187 
f 51//51 52//52 48//48 
f 138//138 52//52 51//51 
f 138//138 193//193 52//52 
f 50//50 138//138 51//51 
f 137//137 138//138 50//50 
f 54//54 56//56 11//11 
f 1//1 11//11 56//56 
f 56//56 54//54 57//57 
f 53//53 39//39 55//55 
f 11//11 53//53 55//55 
f 11//11 55//55 54//54 
f 54//54 55//55 59//59 
f 20//20 39//39 53//53 
f 61//61 39//39 20//20 
f 54//54 59//59 58//58 
f 58//58 59//59 64//64 
f 58//58 64//64 31//31 
f 60//60 61//61 20//20 
f 60//60 62//62 61//61 
f 141//141 23//23 142//142 
f 61//61 62//62 136//136 
f 146//146 63//63 28//28 
f 63//63 146//146 145//145 
f 29//29 146//146 28//28 
f 106//106 146//146 29//29 
f 64//64 67//67 65//65 
f 64//64 65//65 31//31 
f 31//31 65//65 37//37 
f 37//37 65//65 66//66 
f 68//68 66//66 65//65 
f 69//69 68//68 67//67 
f 67//67 68//68 65//65 
f 202//202 69//69 67//67 
f 68//68 206//206 66//66 
f 86//86 71//71 72//72 
f 75//75 72//72 71//71 
f 72//72 73//73 86//86 
f 73//73 72//72 77//77 
f 73//73 77//77 91//91 
f 75//75 74//74 72//72 
f 72//72 74//74 76//76 
f 76//76 77//77 72//72 
f 77//77 76//76 78//78 
f 74//74 79//79 76//76 
f 76//76 79//79 80//80 
f 76//76 80//80 78//78 
f 81//81 78//78 80//80 
f 84//84 78//78 83//83 
f 81//81 83//83 78//78 
f 91//91 77//77 82//82 
f 78//78 84//84 77//77 
f 77//77 84//84 82//82 
f 84//84 83//83 85//85 
f 86//86 87//87 71//71 
f 71//71 87//87 8//8 
f 86//86 73//73 88//88 
f 88//88 73//73 91//91 
f 92//92 88//88 91//91 
f 86//86 88//88 87//87 
f 90//90 87//87 88//88 
f 92//92 90//90 88//88 
f 87//87 89//89 8//8 
f 87//87 90//90 89//89 
f 102//102 89//89 90//90 
f 93//93 102//102 90//90 
f 92//92 93//93 90//90 
f 92//92 94//94 93//93 
f 93//93 94//94 103//103 
f 94//94 104//104 103//103 
f 82//82 95//95 91//91 
f 92//92 91//91 96//96 
f 96//96 94//94 92//92 
f 91//91 95//95 96//96 
f 84//84 95//95 82//82 
f 95//95 84//84 97//97 
f 96//96 95//95 97//97 
f 100//100 94//94 96//96 
f 96//96 97//97 100//100 
f 97//97 84//84 98//98 
f 84//84 85//85 98//98 
f 98//98 85//85 115//115 
f 98//98 115//115 99//99 
f 98//98 99//99 97//97 
f 97//97 99//99 100//100 
f 100//100 104//104 94//94 
f 100//100 99//99 101//101 
f 100//100 101//101 119//119 
f 89//89 102//102 25//25 
f 102//102 93//93 103//103 
f 103//103 25//25 102//102 
f 27//27 25//25 105//105 
f 105//105 25//25 103//103 
f 119//119 120//120 104//104 
f 120//120 105//105 103//103 
f 103//103 104//104 120//120 
f 105//105 106//106 27//27 
f 106//106 105//105 121//121 
f 105//105 120//120 121//121 
f 119//119 104//104 100//100 
f 36//36 107//107 79//79 
f 80//80 79//79 107//107 
f 36//36 109//109 107//107 
f 107//107 81//81 80//80 
f 111//111 81//81 110//110 
f 83//83 81//81 111//111 
f 81//81 107//107 110//110 
f 83//83 111//111 108//108 
f 109//109 110//110 107//107 
f 113//113 108//108 111//111 
f 112//112 113//113 111//111 
f 83//83 108//108 85//85 
f 109//109 38//38 110//110 
f 38//38 112//112 110//110 
f 112//112 111//111 110//110 
f 38//38 114//114 112//112 
f 114//114 128//128 112//112 
f 128//128 114//114 237//237 
f 118//118 117//117 125//125 
f 115//115 116//116 99//99 
f 99//99 116//116 118//118 
f 85//85 108//108 115//115 
f 99//99 118//118 101//101 
f 116//116 117//117 118//118 
f 113//113 115//115 108//108 
f 129//129 115//115 113//113 
f 115//115 129//129 116//116 
f 116//116 129//129 126//126 
f 116//116 126//126 117//117 
f 120//120 119//119 122//122 
f 119//119 118//118 124//124 
f 119//119 124//124 122//122 
f 121//121 122//122 149//149 
f 106//106 121//121 149//149 
f 121//121 120//120 122//122 
f 124//124 118//118 125//125 
f 124//124 125//125 131//131 
f 131//131 123//123 122//122 
f 149//149 122//122 123//123 
f 122//122 124//124 131//131 
f 101//101 118//118 119//119 
f 127//127 129//129 113//113 
f 126//126 125//125 117//117 
f 128//128 237//237 236//236 
f 112//112 128//128 113//113 
f 113//113 128//128 127//127 
f 236//236 127//127 128//128 
f 239//239 129//129 127//127 
f 129//129 130//130 126//126 
f 238//238 129//129 239//239 
f 130//130 129//129 238//238 
f 131//131 125//125 134//134 
f 123//123 131//131 132//132 
f 132//132 184//184 123//123 
f 134//134 132//132 131//131 
f 126//126 130//130 125//125 
f 134//134 125//125 130//130 
f 130//130 238//238 243//243 
f 134//134 130//130 133//133 
f 130//130 243//243 133//133 
f 132//132 134//134 135//135 
f 133//133 135//135 134//134 
f 137//137 136//136 153//153 
f 153//153 139//139 137//137 
f 139//139 138//138 137//137 
f 139//139 140//140 138//138 
f 138//138 140//140 193//193 
f 295//295 193//193 140//140 
f 140//140 139//139 171//171 
f 140//140 296//296 295//295 
f 171//171 172//172 140//140 
f 140//140 172//172 296//296 
f 144//144 60//60 141//141 
f 60//60 144//144 62//62 
f 141//141 155//155 144//144 
f 143//143 142//142 63//63 
f 145//145 143//143 63//63 
f 141//141 142//142 155//155 
f 143//143 155//155 142//142 
f 143//143 145//145 148//148 
f 143//143 157//157 155//155 
f 143//143 148//148 157//157 
f 136//136 62//62 144//144 
f 153//153 136//136 144//144 
f 144//144 155//155 154//154 
f 153//153 144//144 154//154 
f 156//156 157//157 148//148 
f 146//146 147//147 145//145 
f 151//151 148//148 145//145 
f 106//106 147//147 146//146 
f 145//145 147//147 151//151 
f 147//147 160//160 151//151 
f 149//149 147//147 106//106 
f 147//147 149//149 150//150 
f 147//147 150//150 160//160 
f 148//148 151//151 156//156 
f 160//160 152//152 151//151 
f 156//156 151//151 152//152 
f 152//152 173//173 156//156 
f 155//155 158//158 154//154 
f 165//165 153//153 154//154 
f 166//166 165//165 154//154 
f 166//166 154//154 158//158 
f 157//157 158//158 155//155 
f 170//170 158//158 157//157 
f 170//170 157//157 159//159 
f 156//156 173//173 159//159 
f 157//157 156//156 159//159 
f 160//160 150//150 184//184 
f 161//161 152//152 160//160 
f 163//163 152//152 161//161 
f 173//173 152//152 163//163 
f 162//162 161//161 160//160 
f 161//161 162//162 163//163 
f 184//184 162//162 160//160 
f 162//162 176//176 163//163 
f 162//162 164//164 176//176 
f 165//165 139//139 153//153 
f 165//165 171//171 139//139 
f 167//167 165//165 166//166 
f 165//165 167//167 171//171 
f 167//167 166//166 169//169 
f 158//158 169//169 166//166 
f 158//158 170//170 169//169 
f 159//159 168//168 170//170 
f 170//170 179//179 169//169 
f 168//168 179//179 170//170 
f 175//175 179//179 168//168 
f 171//171 167//167 172//172 
f 180//180 172//172 167//167 
f 180//180 296//296 172//172 
f 173//173 163//163 177//177 
f 159//159 173//173 168//168 
f 173//173 174//174 168//168 
f 173//173 177//177 174//174 
f 168//168 174//174 175//175 
f 163//163 176//176 177//177 
f 177//177 176//176 353//353 
f 322//322 175//175 174//174 
f 175//175 178//178 182//182 
f 322//322 323//323 175//175 
f 175//175 323//323 178//178 
f 174//174 177//177 322//322 
f 181//181 167//167 169//169 
f 169//169 179//179 181//181 
f 167//167 181//181 180//180 
f 183//183 180//180 181//181 
f 180//180 183//183 310//310 
f 182//182 181//181 179//179 
f 179//179 175//175 182//182 
f 182//182 183//183 181//181 
f 178//178 183//183 182//182 
f 123//123 150//150 149//149 
f 150//150 123//123 184//184 
f 135//135 184//184 132//132 
f 135//135 185//185 184//184 
f 185//185 162//162 184//184 
f 185//185 186//186 346//346 
f 244//244 185//185 135//135 
f 186//186 185//185 244//244 
f 164//164 162//162 185//185 
f 164//164 185//185 346//346 
f 203//203 202//202 188//188 
f 49//49 189//189 188//188 
f 49//49 187//187 189//189 
f 189//189 191//191 188//188 
f 187//187 190//190 189//189 
f 188//188 191//191 203//203 
f 197//197 191//191 189//189 
f 189//189 190//190 196//196 
f 192//192 196//196 190//190 
f 189//189 196//196 197//197 
f 191//191 197//197 210//210 
f 193//193 187//187 52//52 
f 195//195 190//190 187//187 
f 187//187 194//194 195//195 
f 187//187 193//193 194//194 
f 291//291 194//194 193//193 
f 293//293 194//194 291//291 
f 192//192 190//190 195//195 
f 293//293 195//195 194//194 
f 299//299 195//195 293//293 
f 192//192 195//195 299//299 
f 197//197 196//196 209//209 
f 209//209 196//196 200//200 
f 198//198 209//209 200//200 
f 199//199 196//196 192//192 
f 300//300 199//199 192//192 
f 196//196 199//199 200//200 
f 198//198 200//200 225//225 
f 300//300 201//201 199//199 
f 200//200 199//199 201//201 
f 201//201 225//225 200//200 
f 192//192 299//299 300//300 
f 225//225 201//201 301//301 
f 69//69 202//202 208//208 
f 69//69 205//205 68//68 
f 69//69 208//208 205//205 
f 203//203 208//208 202//202 
f 203//203 204//204 208//208 
f 203//203 210//210 204//204 
f 191//191 210//210 203//203 
f 68//68 205//205 206//206 
f 70//70 206//206 38//38 
f 38//38 206//206 235//235 
f 206//206 205//205 235//235 
f 205//205 208//208 207//207 
f 208//208 204//204 216//216 
f 208//208 216//216 207//207 
f 235//235 205//205 207//207 
f 204//204 210//210 216//216 
f 211//211 210//210 197//197 
f 209//209 211//211 197//197 
f 213//213 211//211 209//209 
f 213//213 209//209 198//198 
f 210//210 211//211 216//216 
f 213//213 198//198 212//212 
f 211//211 213//213 214//214 
f 220//220 214//214 213//213 
f 216//216 211//211 214//214 
f 216//216 214//214 215//215 
f 220//220 215//215 214//214 
f 212//212 228//228 213//213 
f 220//220 213//213 228//228 
f 207//207 216//216 217//217 
f 207//207 217//217 240//240 
f 240//240 217//217 256//256 
f 215//215 217//217 216//216 
f 217//217 219//219 256//256 
f 256//256 219//219 218//218 
f 217//217 215//215 219//219 
f 219//219 215//215 223//223 
f 224//224 223//223 220//220 
f 220//220 223//223 215//215 
f 228//228 229//229 220//220 
f 220//220 229//229 224//224 
f 224//224 229//229 232//232 
f 223//223 222//222 219//219 
f 224//224 222//222 223//223 
f 222//222 218//218 219//219 
f 218//218 222//222 221//221 
f 212//212 198//198 225//225 
f 225//225 332//332 212//212 
f 228//228 212//212 332//332 
f 301//301 331//331 225//225 
f 331//331 332//332 225//225 
f 333//333 228//228 332//332 
f 333//333 226//226 228//228 
f 227//227 228//228 226//226 
f 228//228 227//227 229//229 
f 222//222 224//224 230//230 
f 222//222 230//230 221//221 
f 226//226 231//231 227//227 
f 231//231 229//229 227//227 
f 231//231 232//232 229//229 
f 232//232 230//230 224//224 
f 233//233 230//230 232//232 
f 233//233 232//232 234//234 
f 232//232 231//231 234//234 
f 235//235 114//114 38//38 
f 114//114 235//235 237//237 
f 237//237 235//235 240//240 
f 240//240 241//241 237//237 
f 241//241 236//236 237//237 
f 236//236 241//241 242//242 
f 239//239 127//127 236//236 
f 236//236 242//242 239//239 
f 235//235 207//207 240//240 
f 257//257 242//242 241//241 
f 257//257 258//258 242//242 
f 243//243 238//238 239//239 
f 133//133 243//243 249//249 
f 243//243 239//239 246//246 
f 249//249 243//243 248//248 
f 246//246 248//248 243//243 
f 133//133 244//244 135//135 
f 249//249 244//244 133//133 
f 239//239 242//242 246//246 
f 248//248 246//246 247//247 
f 242//242 258//258 246//246 
f 258//258 259//259 246//246 
f 246//246 259//259 247//247 
f 251//251 247//247 252//252 
f 244//244 249//249 245//245 
f 249//249 248//248 250//250 
f 248//248 247//247 251//251 
f 250//250 248//248 251//251 
f 250//250 251//251 255//255 
f 251//251 252//252 253//253 
f 255//255 251//251 253//253 
f 254//254 250//250 255//255 
f 255//255 266//266 254//254 
f 266//266 269//269 254//254 
f 256//256 241//241 240//240 
f 256//256 257//257 241//241 
f 257//257 261//261 258//258 
f 218//218 257//257 256//256 
f 221//221 261//261 257//257 
f 218//218 221//221 257//257 
f 261//261 259//259 258//258 
f 259//259 261//261 262//262 
f 247//247 259//259 260//260 
f 262//262 260//260 259//259 
f 247//247 260//260 252//252 
f 262//262 261//261 263//263 
f 261//261 221//221 263//263 
f 230//230 263//263 221//221 
f 262//262 264//264 260//260 
f 260//260 264//264 265//265 
f 262//262 263//263 264//264 
f 252//252 260//260 265//265 
f 252//252 265//265 253//253 
f 255//255 253//253 268//268 
f 255//255 268//268 266//266 
f 253//253 265//265 267//267 
f 267//267 268//268 253//253 
f 279//279 267//267 265//265 
f 268//268 267//267 280//280 
f 373//373 269//269 270//270 
f 272//272 266//266 273//273 
f 269//269 266//266 272//272 
f 269//269 272//272 270//270 
f 273//273 266//266 268//268 
f 373//373 270//270 271//271 
f 271//271 270//270 380//380 
f 276//276 380//380 270//270 
f 272//272 273//273 274//274 
f 273//273 286//286 274//274 
f 274//274 275//275 272//272 
f 270//270 272//272 275//275 
f 275//275 276//276 270//270 
f 275//275 274//274 288//288 
f 276//276 275//275 288//288 
f 276//276 288//288 384//384 
f 230//230 233//233 263//263 
f 277//277 263//263 233//233 
f 277//277 264//264 263//263 
f 234//234 278//278 233//233 
f 277//277 233//233 278//278 
f 264//264 277//277 265//265 
f 277//277 279//279 265//265 
f 388//388 277//277 278//278 
f 388//388 279//279 277//277 
f 388//388 282//282 279//279 
f 279//279 282//282 267//267 
f 282//282 280//280 267//267 
f 268//268 286//286 273//273 
f 268//268 280//280 286//286 
f 280//280 282//282 281//281 
f 286//286 280//280 281//281 
f 284//284 283//283 281//281 
f 281//281 282//282 284//284 
f 392//392 284//284 282//282 
f 392//392 285//285 284//284 
f 283//283 284//284 285//285 
f 274//274 286//286 287//287 
f 286//286 281//281 287//287 
f 288//288 287//287 289//289 
f 288//288 289//289 290//290 
f 287//287 288//288 274//274 
f 384//384 288//288 290//290 
f 281//281 283//283 287//287 
f 287//287 283//283 289//289 
f 289//289 412//412 290//290 
f 285//285 289//289 283//283 
f 408//408 412//412 289//289 
f 295//295 291//291 193//193 
f 291//291 294//294 293//293 
f 292//292 294//294 291//291 
f 295//295 292//292 291//291 
f 292//292 295//295 297//297 
f 302//302 299//299 293//293 
f 294//294 302//302 293//293 
f 292//292 302//302 294//294 
f 297//297 298//298 292//292 
f 292//292 298//298 302//302 
f 296//296 297//297 295//295 
f 296//296 309//309 297//297 
f 315//315 297//297 309//309 
f 297//297 315//315 298//298 
f 314//314 315//315 309//309 
f 299//299 302//302 300//300 
f 302//302 303//303 300//300 
f 300//300 301//301 201//201 
f 301//301 300//300 303//303 
f 303//303 305//305 301//301 
f 303//303 302//302 304//304 
f 298//298 304//304 302//302 
f 303//303 304//304 305//305 
f 298//298 315//315 304//304 
f 315//315 316//316 304//304 
f 305//305 304//304 316//316 
f 324//324 308//308 306//306 
f 180//180 309//309 296//296 
f 180//180 310//310 309//309 
f 183//183 319//319 310//310 
f 310//310 314//314 309//309 
f 319//319 314//314 310//310 
f 321//321 319//319 320//320 
f 311//311 312//312 307//307 
f 311//311 316//316 312//312 
f 307//307 312//312 313//313 
f 306//306 307//307 313//313 
f 313//313 312//312 318//318 
f 315//315 314//314 316//316 
f 316//316 314//314 317//317 
f 312//312 316//316 317//317 
f 314//314 319//319 317//317 
f 317//317 326//326 312//312 
f 326//326 317//317 319//319 
f 321//321 326//326 319//319 
f 318//318 312//312 326//326 
f 178//178 323//323 320//320 
f 321//321 320//320 323//323 
f 353//353 322//322 177//177 
f 323//323 322//322 329//329 
f 322//322 355//355 329//329 
f 321//321 323//323 329//329 
f 313//313 324//324 306//306 
f 324//324 313//313 318//318 
f 327//327 324//324 318//318 
f 324//324 327//327 325//325 
f 321//321 328//328 326//326 
f 327//327 318//318 326//326 
f 363//363 327//327 328//328 
f 326//326 328//328 327//327 
f 363//363 325//325 327//327 
f 321//321 329//329 360//360 
f 328//328 330//330 363//363 
f 328//328 321//321 330//330 
f 321//321 360//360 330//330 
f 301//301 305//305 331//331 
f 332//332 331//331 335//335 
f 226//226 333//333 341//341 
f 332//332 335//335 334//334 
f 333//333 332//332 334//334 
f 341//341 333//333 334//334 
f 335//335 305//305 307//307 
f 305//305 335//335 331//331 
f 334//334 307//307 306//306 
f 334//334 335//335 307//307 
f 341//341 306//306 308//308 
f 341//341 334//334 306//306 
f 308//308 338//338 341//341 
f 324//324 337//337 308//308 
f 338//338 308//308 337//337 
f 341//341 338//338 336//336 
f 340//340 231//231 226//226 
f 340//340 226//226 341//341 
f 340//340 341//341 336//336 
f 231//231 340//340 343//343 
f 344//344 343//343 340//340 
f 336//336 344//344 340//340 
f 342//342 336//336 338//338 
f 339//339 342//342 338//338 
f 342//342 344//344 336//336 
f 316//316 311//311 305//305 
f 305//305 311//311 307//307 
f 324//324 325//325 337//337 
f 337//337 325//325 339//339 
f 325//325 363//363 339//339 
f 338//338 337//337 339//339 
f 183//183 320//320 319//319 
f 183//183 178//178 320//320 
f 231//231 343//343 234//234 
f 234//234 343//343 387//387 
f 344//344 390//390 343//343 
f 245//245 186//186 244//244 
f 347//347 186//186 245//245 
f 347//347 345//345 186//186 
f 176//176 164//164 354//354 
f 164//164 346//346 354//354 
f 345//345 346//346 186//186 
f 345//345 357//357 346//346 
f 245//245 249//249 348//348 
f 245//245 348//348 347//347 
f 250//250 348//348 249//249 
f 347//347 348//348 349//349 
f 347//347 349//349 350//350 
f 348//348 250//250 372//372 
f 348//348 372//372 349//349 
f 345//345 347//347 350//350 
f 350//350 357//357 345//345 
f 372//372 250//250 254//254 
f 269//269 372//372 254//254 
f 350//350 352//352 357//357 
f 352//352 351//351 357//357 
f 353//353 176//176 354//354 
f 353//353 355//355 322//322 
f 353//353 354//354 355//355 
f 355//355 354//354 356//356 
f 346//346 358//358 354//354 
f 346//346 357//357 358//358 
f 354//354 358//358 356//356 
f 358//358 357//357 361//361 
f 356//356 358//358 359//359 
f 356//356 359//359 360//360 
f 358//358 361//361 359//359 
f 356//356 329//329 355//355 
f 329//329 356//356 360//360 
f 351//351 361//361 357//357 
f 342//342 389//389 344//344 
f 389//389 342//342 367//367 
f 391//391 389//389 367//367 
f 339//339 363//363 367//367 
f 366//366 367//367 363//363 
f 364//364 367//367 366//366 
f 365//365 366//366 359//359 
f 360//360 359//359 366//366 
f 361//361 365//365 359//359 
f 365//365 364//364 366//366 
f 360//360 366//366 330//330 
f 330//330 366//366 363//363 
f 339//339 367//367 342//342 
f 391//391 367//367 364//364 
f 371//371 391//391 364//364 
f 364//364 370//370 371//371 
f 351//351 368//368 361//361 
f 361//361 368//368 365//365 
f 368//368 369//369 365//365 
f 352//352 378//378 351//351 
f 351//351 378//378 368//368 
f 378//378 362//362 368//368 
f 362//362 369//369 368//368 
f 365//365 370//370 364//364 
f 365//365 369//369 370//370 
f 370//370 404//404 371//371 
f 370//370 369//369 404//404 
f 369//369 397//397 404//404 
f 369//369 362//362 397//397 
f 269//269 373//373 372//372 
f 373//373 374//374 372//372 
f 372//372 374//374 349//349 
f 350//350 349//349 375//375 
f 349//349 374//374 375//375 
f 350//350 375//375 352//352 
f 375//375 374//374 377//377 
f 352//352 375//375 377//377 
f 373//373 271//271 374//374 
f 374//374 271//271 376//376 
f 374//374 376//376 377//377 
f 380//380 376//376 271//271 
f 376//376 382//382 377//377 
f 376//376 380//380 382//382 
f 352//352 377//377 378//378 
f 379//379 378//378 377//377 
f 377//377 382//382 379//379 
f 379//379 382//382 383//383 
f 378//378 379//379 362//362 
f 383//383 362//362 379//379 
f 380//380 276//276 384//384 
f 384//384 381//381 380//380 
f 381//381 383//383 382//382 
f 382//382 380//380 381//381 
f 383//383 381//381 410//410 
f 383//383 385//385 362//362 
f 397//397 362//362 385//385 
f 383//383 410//410 385//385 
f 343//343 390//390 387//387 
f 234//234 387//387 278//278 
f 278//278 387//387 386//386 
f 387//387 390//390 386//386 
f 278//278 386//386 388//388 
f 390//390 344//344 389//389 
f 371//371 395//395 391//391 
f 394//394 389//389 391//391 
f 391//391 395//395 394//394 
f 392//392 388//388 386//386 
f 398//398 392//392 386//386 
f 392//392 282//282 388//388 
f 393//393 386//386 390//390 
f 386//386 393//393 398//398 
f 398//398 393//393 405//405 
f 389//389 394//394 390//390 
f 394//394 393//393 390//390 
f 395//395 399//399 394//394 
f 394//394 399//399 393//393 
f 410//410 409//409 400//400 
f 404//404 395//395 371//371 
f 395//395 396//396 403//403 
f 404//404 396//396 395//395 
f 400//400 396//396 410//410 
f 404//404 397//397 396//396 
f 392//392 398//398 285//285 
f 393//393 399//399 405//405 
f 400//400 409//409 401//401 
f 400//400 401//401 402//402 
f 395//395 403//403 399//399 
f 396//396 400//400 403//403 
f 402//402 403//403 400//400 
f 403//403 402//402 399//399 
f 407//407 285//285 398//398 
f 398//398 405//405 407//407 
f 407//407 405//405 406//406 
f 405//405 399//399 406//406 
f 399//399 402//402 406//406 
f 285//285 407//407 408//408 
f 408//408 407//407 402//402 
f 406//406 402//402 407//407 
f 408//408 402//402 401//401 
f 290//290 411//411 384//384 
f 411//411 381//381 384//384 
f 410//410 381//381 411//411 
f 410//410 411//411 409//409 
f 411//411 290//290 412//412 
f 409//409 411//411 412//412 
f 385//385 410//410 396//396 
f 396//396 397//397 385//385 
f 412//412 401//401 409//409 
f 412//412 408//408 401//401 
f 289//289 285//285 413//413 
f 285//285 408//408 413//413 
f 408//408 289//289 413//413 
