# PIPER geometrical reference model based on a manual segmentation. See the
# documentation for more info.
# Author: CEESAR, SOTON, UCBL-Ifsttar
# Version: 1.0.0
# License: Creative Commons Attribution 4.0 International License.
# (https://creativecommons.org/licenses/by/4.0/)
# 
# This work has received funding from the European Union Seventh Framework
# Program ([FP7/2007-2013]) under grant agreement 605544 [PIPER project]).
# Contributors include Pierre Maillez, Christophe Lecomte (SOTON), Erwan
# Jolivet (CEESAR), Philippe Beillas (UCBL-Ifsttar)
# This work is derived from a CT scan provided by CEESAR under a CCBY-4.0
# License
# 
# wavefront obj file written by the visualization toolkit

mtllib C:/desktop/registration_reference_model/22_REF_LTE635_Assembly_hands_corr/CCTu635_BP171_Cuneiform2_R.mtl

v -18.578 156.841 -1696.76
v -19.131 156.997 -1697.93
v -11.998 153.842 -1694.06
v -10.599 154.998 -1693.49
v -15.064 156.172 -1694
v -13.839 156.47 -1693.52
v -12.996 155.431 -1693.35
v -9.66701 156.347 -1694.11
v -12.838 157.442 -1693.72
v -16.041 153.971 -1697.78
v -12.787 152.115 -1697.84
v -13.563 153.632 -1696.08
v -10.29 152.606 -1694.83
v -14.847 155.428 -1694.21
v -16.419 156.783 -1695.14
v -16.698 155.625 -1695.86
v -18.732 149.584 -1704.92
v -17.708 148.664 -1705.47
v -19.04 150.549 -1704.73
v -13.849 150.633 -1700.62
v -10.991 150.466 -1699.5
v -8.87101 151.174 -1696.22
v -9.38501 151.62 -1700.23
v -12.833 149.606 -1701.58
v -14.541 148.714 -1702.99
v -17.639 149.008 -1704.56
v -15.747 148.153 -1704.63
v -14.114 147.871 -1704.4
v -11.312 150.513 -1701.85
v -12.925 149.09 -1703.05
v -11.694 150.247 -1704.13
v -11.781 150.004 -1705.71
v -18.759 155.663 -1697.81
v -18.217 152.185 -1701.75
v -19.519 154.198 -1701.22
v -19.28 155.108 -1699.42
v -19.239 156.117 -1699.38
v -19.064 155.263 -1701.8
v -19.099 152.429 -1702.29
v -19.261 153.087 -1703.1
v -18.998 152.836 -1705
v -17.903 155.106 -1705.8
v -17.865 158.038 -1700.64
v -17.303 157.276 -1703.39
v -18.53 154.465 -1699.25
v -15.909 152.324 -1699.87
v -16.031 150.573 -1701.96
v -10.046 152.05 -1702.62
v -11.129 151.364 -1704.72
v -16.87 157.81 -1704.55
v -9.58601 153.294 -1693.63
v -8.90201 154.295 -1693.81
v -8.41601 152.067 -1694.46
v -7.27801 152.196 -1694.61
v -7.44501 151.089 -1696.04
v -9.22401 150.84 -1698.16
v -6.37501 151.854 -1696.91
v -5.85401 155.004 -1696.55
v -6.24101 151.918 -1695.7
v -4.76701 153.967 -1697.97
v -10.058 157.843 -1694.62
v -6.68801 157.408 -1696.2
v -7.35901 152.543 -1699.05
v -4.43401 155.097 -1699.74
v -7.37701 153.306 -1700.2
v -4.55301 155.545 -1697.99
v -3.55701 156.138 -1699.17
v -8.87401 152.99 -1702.8
v -7.63701 153.81 -1703.15
v -10.436 152.793 -1705.24
v -7.49701 154.41 -1704.28
v -4.65101 155.924 -1702.56
v -2.77401 156.621 -1700.64
v -3.13201 157.581 -1702.78
v -14.436 159.289 -1694.72
v -15.202 162.072 -1696.24
v -13.965 163.458 -1696.24
v -17.172 159.457 -1696.44
v -17.462 159.85 -1697.22
v -13.368 160.938 -1695.33
v -11.189 161.249 -1696.02
v -15.118 162.739 -1697.1
v -12.785 165.243 -1696.64
v -13.467 165.836 -1697.57
v -12.924 163.033 -1696.1
v -11.247 163.181 -1696.66
v -17.411 159.91 -1698.35
v -15.592 162.456 -1699.7
v -16.461 160.724 -1700.7
v -15.494 162.479 -1698.25
v -13.601 165.928 -1699.35
v -16.45 159.976 -1702.95
v -16.164 160.438 -1705.48
v -15.497 162.304 -1704.06
v -14.995 163.234 -1701.86
v -15.6 162.792 -1705.99
v -14.283 165.075 -1704.02
v -12.66 167.332 -1706.17
v -13.088 166.166 -1702.21
v -12.363 167.12 -1698.33
v -11.738 166.97 -1697.6
v -9.84001 166.473 -1698.07
v -11.492 167.592 -1698.44
v -11.322 168.333 -1701.62
v -9.79002 169.866 -1702.41
v -9.77902 169.033 -1700.61
v -11.238 168.258 -1704.22
v -10.113 168.618 -1704.68
v -8.09601 157.718 -1695.37
v -9.14501 162.028 -1697.07
v -4.51201 157.951 -1698.22
v -2.28401 160.657 -1701.13
v -2.38601 158.295 -1700.36
v -10.204 164.341 -1697.43
v -5.19302 164.185 -1700.12
v -6.13601 160.895 -1698.26
v -3.81201 162.325 -1700.36
v -3.65001 160.744 -1699.98
v -2.38001 158.029 -1701.74
v -4.58201 158.638 -1705.32
v -3.87401 161.134 -1706.87
v -2.58401 163.898 -1701.46
v -1.51501 161.878 -1701.95
v -1.62401 160.597 -1702.1
v -0.908014 161.426 -1702.92
v -1.97001 159.855 -1702.58
v -2.68001 159.798 -1703.93
v -0.720014 165.212 -1702.33
v -0.387014 163.744 -1702.4
v 0.322986 165.087 -1704.23
v 0.335986 164.129 -1703.61
v -8.85802 168.251 -1699.58
v -8.01501 164.767 -1698.69
v -6.74801 167.175 -1700.31
v -7.19501 168.291 -1700.91
v -5.68602 167.352 -1701.43
v -8.89501 169.855 -1702.02
v -7.86601 169.559 -1703.11
v -5.89002 168.424 -1703.73
v -3.88901 166.021 -1701.61
v -4.91401 167.917 -1702.88
v -1.38701 166.394 -1702.74
v -4.17402 167.689 -1704.1
v -2.62702 167.011 -1704.65
v -2.16802 167.291 -1703.91
v -0.274015 165.806 -1703.18
v -0.712015 166.461 -1704.64
v -18.838 149.726 -1705.97
v -17.861 150.153 -1707.82
v -16.926 149.243 -1709.44
v -17.864 150.084 -1709.87
v -15.397 147.417 -1706.41
v -12.972 148.462 -1706.82
v -14.64 147.588 -1706.75
v -16.786 148.686 -1707.83
v -15.501 148.742 -1708.95
v -14.225 149.646 -1708.65
v -12.252 150.009 -1706.57
v -13.534 151.359 -1707.86
v -14.101 151.068 -1709.4
v -16.853 150.402 -1711.22
v -18.426 152.256 -1707.45
v -18.415 153.962 -1707.49
v -18.113 156.019 -1709.02
v -18.598 151.612 -1710.36
v -17.771 150.923 -1711.24
v -18.637 153.59 -1710.16
v -17.94 156.013 -1711.09
v -17.522 155.423 -1713.66
v -11.689 151.728 -1705.88
v -12.258 152.782 -1707.66
v -16.743 158.525 -1707.95
v -13.906 152.291 -1710.53
v -16.033 152.393 -1713.32
v -16.018 150.922 -1711.74
v -14.74 150.976 -1710.55
v -14.126 152.46 -1711.94
v -17.197 157.643 -1710.97
v -10.797 155.185 -1709.56
v -11.151 156.298 -1712.4
v -9.35101 158.182 -1711.41
v -17.411 152.674 -1712.75
v -13.616 153.366 -1713.49
v -15.302 151.7 -1712.62
v -13.066 153.964 -1712.53
v -17.002 156.84 -1714.14
v -15.091 159.328 -1714.81
v -17.015 155.194 -1714.59
v -14.017 154.77 -1715.93
v -15.087 155.198 -1715.9
v -15.235 157.292 -1716.16
v -13.506 154.362 -1715.22
v -9.41401 158.803 -1714
v -12.538 155.398 -1714.3
v -13.017 155.759 -1716.14
v -13.707 157.032 -1717.16
v -13.704 158.393 -1717.23
v -12.695 157.748 -1717.45
v -9.25301 154.978 -1706.97
v -7.00101 155.737 -1705.44
v -7.83701 157.089 -1707.7
v -8.97501 156.828 -1708.94
v -9.27401 157.909 -1710.91
v -15.83 161.217 -1707.38
v -14.157 165.476 -1706.04
v -15.095 163.315 -1708
v -13.945 165.352 -1707.63
v -16.314 158.951 -1710.96
v -15.554 161.013 -1709.45
v -13.437 163.779 -1712.55
v -14.266 163.337 -1710.16
v -12.488 165.83 -1711.03
v -9.61301 164.215 -1710.94
v -12.997 163.71 -1713.04
v -10.633 162.907 -1712.57
v -11.297 168.04 -1705.93
v -10.225 165.722 -1709.32
v -12.075 166.744 -1708.88
v -11.004 167.442 -1707.07
v -8.58202 166.238 -1707.6
v -15.079 160.73 -1712.27
v -13.889 161.859 -1713.79
v -13.943 160.312 -1715.73
v -13.157 161.413 -1714.71
v -9.04601 160.963 -1713.35
v -9.71101 159.472 -1714.58
v -11.17 160.692 -1714.55
v -12.772 159.27 -1716.91
v -10.878 158.637 -1716
v -11.989 162.18 -1713.71
v -6.23701 158.93 -1707.57
v -1.62201 163.22 -1706.77
v -3.12502 165.418 -1706.33
v -2.05501 164.054 -1707.15
v -4.61302 164.435 -1708.08
v -3.69101 163.406 -1708.64
v -7.76201 158.944 -1709.6
v -6.39801 162.019 -1710.54
v -7.89301 160.862 -1712
v -9.02801 159.036 -1712.46
v -7.58801 163.862 -1710.39
v -7.13101 162.756 -1711.38
v -5.34901 163.485 -1710.08
v -1.92701 161.917 -1705.32
v -0.555014 164.003 -1706.11
v -0.461014 165.202 -1705.9
v -8.22101 167.778 -1705.34
v -5.87102 166.387 -1705.88
v -9.21601 159.415 -1714
vn -0.775787 -0.0350914 0.630018
vn -0.962199 0.208839 0.174811
vn -0.356775 -0.694032 0.625325
vn 0.153448 0.117301 0.98117
vn -0.551204 -0.0803705 0.830491
vn -0.235815 0.138508 0.961877
vn -0.16806 -0.197959 0.965696
vn 0.318906 0.310679 0.89542
vn 0.0519474 0.33472 0.940885
vn -0.44239 -0.736643 0.511515
vn -0.381167 -0.783662 0.490496
vn -0.438142 -0.773623 0.457754
vn -0.350316 -0.782125 0.515325
vn -0.504176 -0.560704 0.656824
vn -0.605754 0.000674289 0.795652
vn -0.553425 -0.560588 0.616005
vn -0.76325 -0.5857 0.272772
vn -0.534951 -0.841895 0.0709982
vn -0.969734 -0.21231 0.120582
vn -0.309961 -0.745694 0.5898
vn 0.110246 -0.976969 0.182696
vn -0.204173 -0.907191 0.367856
vn 0.568422 -0.766495 -0.298968
vn 0.16222 -0.887236 0.431853
vn -0.200925 -0.793578 0.574337
vn -0.448141 -0.74768 0.490045
vn -0.2982 -0.864355 0.404928
vn 0.227059 -0.932078 0.282266
vn 0.627255 -0.775447 -0.0723351
vn 0.614277 -0.772528 0.160823
vn 0.783718 -0.620835 -0.0186863
vn 0.892108 -0.39046 -0.227341
vn -0.722507 -0.488052 0.489682
vn -0.484786 -0.663759 0.569566
vn -0.997838 -0.0574565 0.031899
vn -0.897806 -0.307667 0.315097
vn -0.959988 0.265517 -0.0890191
vn -0.89531 0.374319 -0.241466
vn -0.805911 -0.489166 0.333504
vn -0.996832 0.00741414 -0.0791893
vn -0.972494 0.145659 -0.181764
vn -0.920456 0.387137 -0.0537196
vn -0.864083 0.446889 -0.231626
vn -0.877996 0.416211 -0.236413
vn -0.536724 -0.667153 0.51656
vn -0.416037 -0.709693 0.56855
vn -0.39691 -0.668531 0.628911
vn 0.674539 -0.693781 -0.252318
vn 0.843636 -0.444464 -0.301216
vn -0.941451 0.32776 -0.0790189
vn -0.00023642 -0.401376 0.915913
vn 0.405217 0.117833 0.906595
vn -0.0401895 -0.707198 0.705873
vn 0.484797 -0.362288 0.796065
vn 0.262259 -0.94157 0.211345
vn 0.304203 -0.944272 -0.125742
vn 0.60936 -0.760034 -0.225896
vn 0.703479 0.110493 0.702074
vn 0.749157 -0.494498 0.440722
vn 0.885303 -0.454049 0.100391
vn 0.288867 0.412454 0.863966
vn 0.595884 0.250059 0.763146
vn 0.52317 -0.724721 -0.448411
vn 0.655277 -0.716602 -0.238943
vn 0.559594 -0.750461 -0.351657
vn 0.764882 -0.0132244 0.644034
vn 0.847638 -0.35975 0.389987
vn 0.537121 -0.807612 -0.243442
vn 0.549392 -0.794985 -0.25723
vn 0.647579 -0.639878 -0.41376
vn 0.573576 -0.705948 -0.41551
vn 0.604387 -0.709055 -0.36326
vn 0.841819 -0.539576 -0.0140567
vn 0.719828 -0.516338 -0.463942
vn -0.313919 0.342084 0.885682
vn -0.594816 0.480755 0.644258
vn -0.388713 0.425717 0.817109
vn -0.661104 0.352605 0.662277
vn -0.8187 0.510235 0.263421
vn 0.0972347 0.367143 0.925068
vn 0.278047 0.368626 0.88702
vn -0.770644 0.559379 0.305292
vn -0.0929927 0.43088 0.897605
vn -0.674368 0.611036 0.414563
vn 0.142428 0.284369 0.948076
vn 0.323141 0.278462 0.904455
vn -0.845987 0.525596 -0.0897451
vn -0.855755 0.516449 -0.0310383
vn -0.869127 0.470776 -0.151617
vn -0.825538 0.557778 0.0858489
vn -0.803178 0.59567 0.00913046
vn -0.922188 0.36713 -0.121593
vn -0.959433 0.28142 -0.0170685
vn -0.928245 0.366173 0.0654101
vn -0.880845 0.473213 -0.0134717
vn -0.936957 0.349304 -0.00989721
vn -0.828195 0.549459 0.110395
vn -0.62985 0.771077 -0.0934319
vn -0.781452 0.623964 -0.0013607
vn -0.561865 0.775718 0.28735
vn -0.0469069 0.633648 0.772198
vn 0.422077 0.340664 0.840118
vn -0.227276 0.865932 0.445541
vn -0.710224 0.703419 0.0279812
vn -0.314681 0.947724 -0.0528774
vn -0.0660444 0.867227 0.493514
vn -0.589202 0.803418 -0.0857956
vn -0.0987353 0.891023 -0.443091
vn 0.450012 0.351655 0.82087
vn 0.38937 0.352924 0.850785
vn 0.653854 0.189878 0.732407
vn 0.731466 0.111589 0.672685
vn 0.899435 -0.0502819 0.434153
vn 0.389772 0.257905 0.88406
vn 0.486654 0.30353 0.819169
vn 0.516632 0.335224 0.787855
vn 0.543927 0.234946 0.805571
vn 0.593789 0.254764 0.763223
vn 0.917823 -0.346815 -0.193184
vn 0.662536 -0.505695 -0.552556
vn 0.634885 -0.540965 -0.551613
vn 0.429718 0.170725 0.886677
vn 0.683003 -0.0720019 0.726858
vn 0.89364 -0.269245 0.359047
vn 0.881206 -0.465516 0.0822836
vn 0.868874 -0.444676 -0.217535
vn 0.727517 -0.49397 -0.476143
vn 0.561138 0.276736 0.78009
vn 0.707005 -0.0677362 0.703957
vn 0.967416 0.234379 -0.0957777
vn 0.980451 -0.145783 0.132153
vn 0.322965 0.648689 0.689127
vn 0.473233 0.299082 0.828614
vn 0.507988 0.440548 0.74018
vn 0.4901 0.6863 0.537396
vn 0.544327 0.616405 0.568993
vn 0.161232 0.956726 0.24224
vn 0.287174 0.925119 -0.248368
vn 0.361423 0.857123 -0.367035
vn 0.399197 0.468122 0.788355
vn 0.436943 0.837794 0.327388
vn 0.430312 0.687796 0.58461
vn 0.204686 0.90091 -0.382707
vn 0.185135 0.784935 -0.591272
vn 0.361052 0.93206 -0.0300863
vn 0.752604 0.532408 0.387466
vn 0.558128 0.77833 -0.287568
vn -0.877786 -0.416545 -0.236606
vn -0.864935 -0.436803 -0.247165
vn -0.437053 -0.825074 -0.358104
vn -0.717543 -0.656975 -0.231333
vn -0.164696 -0.983723 -0.0718694
vn 0.678705 -0.647545 -0.346476
vn 0.274328 -0.921848 -0.273753
vn -0.616925 -0.745951 -0.250918
vn 0.193847 -0.793363 -0.57706
vn 0.695253 -0.389496 -0.604083
vn 0.798851 -0.141937 -0.584543
vn 0.808264 -0.30276 -0.50502
vn 0.870856 -0.348809 -0.346326
vn -0.18705 -0.75602 -0.627253
vn -0.990876 -0.0694027 -0.115537
vn -0.985016 0.171587 0.0173459
vn -0.938901 0.342016 0.0385929
vn -0.946125 -0.249622 -0.206241
vn -0.609843 -0.552364 -0.568318
vn -0.991667 0.0839092 -0.0977575
vn -0.938593 0.314522 -0.141842
vn -0.927151 0.0693027 -0.368222
vn 0.77404 -0.324414 -0.543708
vn 0.67226 -0.614485 -0.412886
vn -0.921513 0.388335 -0.00320369
vn 0.779965 -0.566182 -0.266633
vn -0.227523 -0.648294 -0.7266
vn 0.212538 -0.767345 -0.604987
vn 0.675947 -0.580321 -0.454228
vn 0.72223 -0.649535 -0.237671
vn -0.860879 0.497334 -0.107453
vn 0.682807 -0.628489 -0.372526
vn 0.738592 -0.606646 -0.294046
vn 0.650225 -0.663154 -0.370722
vn -0.653553 -0.391995 -0.647463
vn 0.706918 -0.658378 -0.258468
vn 0.295344 -0.782037 -0.548808
vn 0.78828 -0.588908 -0.17833
vn -0.849085 0.344115 -0.400799
vn -0.778349 0.474039 -0.411656
vn -0.731684 -0.156335 -0.663474
vn 0.0872367 -0.618477 -0.780946
vn -0.407862 -0.38828 -0.82637
vn -0.67857 0.14101 -0.720874
vn 0.572236 -0.661503 -0.484727
vn 0.806842 -0.453157 -0.37902
vn 0.788064 -0.549132 -0.278225
vn 0.612721 -0.558541 -0.559111
vn -0.247059 -0.274826 -0.929211
vn -0.391229 0.276699 -0.877711
vn 0.322417 -0.129351 -0.937719
vn 0.598704 -0.641632 -0.479439
vn 0.610618 -0.595037 -0.522568
vn 0.644835 -0.557909 -0.522423
vn 0.680893 -0.574611 -0.4541
vn 0.73814 -0.552245 -0.387524
vn -0.948919 0.29341 -0.116029
vn -0.826412 0.561747 -0.0385289
vn -0.88335 0.416165 -0.215639
vn -0.785277 0.578401 -0.220889
vn -0.860494 0.494119 -0.124085
vn -0.904752 0.386344 -0.179336
vn -0.719783 0.554853 -0.417194
vn -0.849486 0.461843 -0.255097
vn -0.228502 0.814107 -0.53387
vn 0.325995 0.693566 -0.642412
vn -0.136045 0.644448 -0.752448
vn 0.323967 0.592284 -0.73773
vn -0.218847 0.931289 -0.291217
vn 0.344389 0.783785 -0.516795
vn -0.189807 0.89721 -0.398733
vn 0.203951 0.850793 -0.484308
vn 0.299493 0.77922 -0.550564
vn -0.850415 0.47207 -0.23226
vn -0.688005 0.535277 -0.490028
vn -0.475651 0.614134 -0.629758
vn -0.024017 0.700507 -0.713242
vn 0.552832 0.370802 -0.746246
vn 0.669809 0.19441 -0.716631
vn 0.366531 0.586014 -0.722664
vn 0.158739 0.54068 -0.826115
vn 0.728272 -0.0325432 -0.684515
vn 0.308222 0.568337 -0.762884
vn 0.661552 -0.517999 -0.542241
vn 0.654364 -0.400744 -0.641258
vn 0.200687 0.696066 -0.689359
vn 0.492308 0.324122 -0.807823
vn 0.31039 0.753424 -0.579664
vn 0.641606 0.0976142 -0.760797
vn 0.71498 -0.512844 -0.475178
vn 0.697942 -0.331062 -0.63504
vn 0.806376 -0.269994 -0.526176
vn 0.855954 -0.479484 -0.193488
vn 0.274143 0.748061 -0.604359
vn 0.51624 0.34071 -0.785756
vn 0.522845 0.39582 -0.754957
vn 0.66789 -0.595462 -0.446484
vn 0.775033 -0.229821 -0.588648
vn 0.630928 0.40707 -0.660473
vn 0.234265 0.768343 -0.595625
vn 0.22865 0.750494 -0.620062
vn 0.853123 -0.125038 -0.506505

g grp1
usemtl mtl1
f 33//33 10//10 16//16 
f 1//1 16//16 15//15 
f 33//33 16//16 1//1 
f 1//1 2//2 33//33 
f 15//15 78//78 1//1 
f 1//1 78//78 2//2 
f 78//78 79//79 2//2 
f 7//7 51//51 4//4 
f 3//3 51//51 7//7 
f 5//5 14//14 7//7 
f 6//6 5//5 7//7 
f 6//6 75//75 5//5 
f 3//3 7//7 14//14 
f 7//7 9//9 6//6 
f 9//9 7//7 4//4 
f 9//9 4//4 8//8 
f 6//6 9//9 75//75 
f 9//9 8//8 61//61 
f 3//3 16//16 12//12 
f 16//16 10//10 12//12 
f 10//10 11//11 12//12 
f 51//51 3//3 13//13 
f 12//12 13//13 3//3 
f 11//11 13//13 12//12 
f 15//15 14//14 5//5 
f 14//14 15//15 16//16 
f 3//3 14//14 16//16 
f 5//5 75//75 15//15 
f 75//75 9//9 80//80 
f 9//9 61//61 80//80 
f 19//19 17//17 34//34 
f 34//34 17//17 26//26 
f 26//26 17//17 18//18 
f 20//20 47//47 25//25 
f 11//11 20//20 21//21 
f 22//22 11//11 21//21 
f 24//24 21//21 20//20 
f 21//21 24//24 29//29 
f 29//29 23//23 21//21 
f 30//30 24//24 28//28 
f 25//25 28//28 24//24 
f 26//26 25//25 47//47 
f 25//25 26//26 27//27 
f 26//26 18//18 27//27 
f 27//27 18//18 152//152 
f 28//28 27//27 152//152 
f 27//27 28//28 25//25 
f 25//25 24//24 20//20 
f 30//30 29//29 24//24 
f 29//29 30//30 31//31 
f 30//30 28//28 153//153 
f 31//31 30//30 153//153 
f 153//153 32//32 31//31 
f 31//31 32//32 49//49 
f 33//33 36//36 45//45 
f 45//45 10//10 33//33 
f 36//36 35//35 39//39 
f 34//34 46//46 45//45 
f 36//36 39//39 45//45 
f 39//39 34//34 45//45 
f 2//2 37//37 36//36 
f 33//33 2//2 36//36 
f 43//43 37//37 2//2 
f 87//87 43//43 2//2 
f 43//43 38//38 37//37 
f 36//36 37//37 35//35 
f 38//38 35//35 37//37 
f 92//92 43//43 89//89 
f 26//26 47//47 34//34 
f 19//19 34//34 39//39 
f 40//40 19//19 39//39 
f 35//35 40//40 39//39 
f 35//35 38//38 40//40 
f 40//40 41//41 19//19 
f 40//40 38//38 41//41 
f 42//42 41//41 38//38 
f 43//43 44//44 38//38 
f 38//38 44//44 42//42 
f 44//44 50//50 42//42 
f 10//10 45//45 46//46 
f 46//46 11//11 10//10 
f 47//47 20//20 46//46 
f 34//34 47//47 46//46 
f 11//11 46//46 20//20 
f 13//13 11//11 22//22 
f 29//29 48//48 23//23 
f 29//29 31//31 48//48 
f 48//48 31//31 49//49 
f 48//48 49//49 70//70 
f 48//48 70//70 68//68 
f 32//32 170//170 49//49 
f 43//43 92//92 44//44 
f 44//44 92//92 50//50 
f 22//22 21//21 56//56 
f 52//52 4//4 51//51 
f 4//4 52//52 8//8 
f 53//53 22//22 55//55 
f 13//13 53//53 51//51 
f 13//13 22//22 53//53 
f 53//53 54//54 51//51 
f 55//55 54//54 53//53 
f 54//54 55//55 59//59 
f 54//54 59//59 58//58 
f 52//52 51//51 54//54 
f 58//58 59//59 66//66 
f 22//22 56//56 55//55 
f 55//55 56//56 57//57 
f 59//59 55//55 57//57 
f 59//59 57//57 60//60 
f 66//66 59//59 60//60 
f 52//52 54//54 62//62 
f 58//58 62//62 54//54 
f 109//109 8//8 52//52 
f 62//62 109//109 52//52 
f 8//8 109//109 61//61 
f 116//116 109//109 62//62 
f 111//111 62//62 58//58 
f 62//62 111//111 116//116 
f 66//66 111//111 58//58 
f 56//56 21//21 23//23 
f 56//56 63//63 57//57 
f 23//23 63//63 56//56 
f 57//57 63//63 64//64 
f 64//64 63//63 65//65 
f 63//63 23//23 65//65 
f 23//23 48//48 65//65 
f 65//65 48//48 68//68 
f 64//64 60//60 57//57 
f 66//66 60//60 67//67 
f 64//64 67//67 60//60 
f 113//113 66//66 67//67 
f 113//113 111//111 66//66 
f 64//64 65//65 72//72 
f 67//67 64//64 73//73 
f 73//73 113//113 67//67 
f 113//113 73//73 119//119 
f 73//73 74//74 119//119 
f 68//68 69//69 65//65 
f 65//65 69//69 72//72 
f 72//72 69//69 71//71 
f 68//68 70//70 69//69 
f 70//70 71//71 69//69 
f 70//70 199//199 71//71 
f 72//72 71//71 200//200 
f 72//72 73//73 64//64 
f 73//73 72//72 74//74 
f 74//74 72//72 200//200 
f 74//74 200//200 120//120 
f 200//200 231//231 120//120 
f 79//79 87//87 2//2 
f 75//75 78//78 15//15 
f 76//76 78//78 75//75 
f 77//77 76//76 75//75 
f 75//75 80//80 77//77 
f 80//80 85//85 77//77 
f 78//78 76//76 79//79 
f 82//82 79//79 76//76 
f 82//82 90//90 79//79 
f 76//76 77//77 82//82 
f 80//80 61//61 81//81 
f 80//80 81//81 85//85 
f 86//86 85//85 81//81 
f 85//85 83//83 77//77 
f 77//77 84//84 82//82 
f 77//77 83//83 84//84 
f 82//82 84//84 90//90 
f 83//83 85//85 86//86 
f 86//86 114//114 83//83 
f 84//84 83//83 101//101 
f 102//102 83//83 114//114 
f 84//84 101//101 100//100 
f 83//83 102//102 101//101 
f 89//89 43//43 87//87 
f 79//79 90//90 87//87 
f 88//88 89//89 87//87 
f 87//87 90//90 88//88 
f 84//84 91//91 90//90 
f 90//90 91//91 88//88 
f 95//95 88//88 91//91 
f 88//88 95//95 89//89 
f 89//89 95//95 92//92 
f 95//95 94//94 92//92 
f 92//92 93//93 50//50 
f 94//94 93//93 92//92 
f 91//91 99//99 95//95 
f 95//95 99//99 97//97 
f 99//99 107//107 97//97 
f 95//95 97//97 94//94 
f 96//96 94//94 97//97 
f 97//97 98//98 205//205 
f 101//101 103//103 100//100 
f 91//91 84//84 100//100 
f 103//103 101//101 132//132 
f 101//101 102//102 132//132 
f 103//103 132//132 106//106 
f 104//104 91//91 100//100 
f 100//100 103//103 104//104 
f 103//103 105//105 104//104 
f 103//103 106//106 105//105 
f 105//105 106//106 137//137 
f 91//91 104//104 99//99 
f 104//104 107//107 99//99 
f 105//105 107//107 104//104 
f 137//137 138//138 105//105 
f 105//105 108//108 107//107 
f 105//105 138//138 108//108 
f 98//98 97//97 107//107 
f 216//216 98//98 107//107 
f 107//107 108//108 216//216 
f 61//61 109//109 81//81 
f 81//81 109//109 110//110 
f 109//109 116//116 110//110 
f 81//81 110//110 86//86 
f 133//133 110//110 116//116 
f 118//118 116//116 111//111 
f 111//111 113//113 112//112 
f 112//112 118//118 111//111 
f 112//112 123//123 118//118 
f 114//114 86//86 110//110 
f 133//133 114//114 110//110 
f 102//102 114//114 133//133 
f 116//116 115//115 133//133 
f 117//117 116//116 118//118 
f 116//116 117//117 115//115 
f 118//118 123//123 117//117 
f 122//122 117//117 123//123 
f 117//117 122//122 115//115 
f 115//115 122//122 140//140 
f 113//113 119//119 126//126 
f 74//74 127//127 119//119 
f 127//127 126//126 119//119 
f 127//127 74//74 120//120 
f 231//231 121//121 120//120 
f 121//121 127//127 120//120 
f 244//244 127//127 121//121 
f 122//122 128//128 140//140 
f 142//142 140//140 128//128 
f 112//112 113//113 124//124 
f 113//113 126//126 124//124 
f 124//124 123//123 112//112 
f 124//124 125//125 123//123 
f 129//129 123//123 125//125 
f 124//124 126//126 125//125 
f 126//126 127//127 125//125 
f 127//127 244//244 125//125 
f 129//129 122//122 123//123 
f 129//129 128//128 122//122 
f 129//129 125//125 131//131 
f 146//146 128//128 129//129 
f 129//129 131//131 146//146 
f 131//131 125//125 245//245 
f 131//131 245//245 130//130 
f 147//147 130//130 246//246 
f 146//146 131//131 130//130 
f 102//102 133//133 132//132 
f 134//134 132//132 133//133 
f 132//132 134//134 135//135 
f 115//115 134//134 133//133 
f 136//136 135//135 134//134 
f 106//106 132//132 137//137 
f 132//132 135//135 137//137 
f 115//115 140//140 134//134 
f 136//136 134//134 140//140 
f 135//135 136//136 141//141 
f 135//135 141//141 137//137 
f 137//137 141//141 138//138 
f 139//139 248//248 247//247 
f 138//138 247//247 108//108 
f 138//138 139//139 247//247 
f 136//136 140//140 141//141 
f 140//140 142//142 141//141 
f 142//142 145//145 141//141 
f 138//138 141//141 139//139 
f 139//139 141//141 143//143 
f 139//139 143//143 248//248 
f 248//248 143//143 144//144 
f 145//145 143//143 141//141 
f 144//144 143//143 145//145 
f 146//146 145//145 142//142 
f 142//142 128//128 146//146 
f 147//147 145//145 146//146 
f 146//146 130//130 147//147 
f 147//147 144//144 145//145 
f 246//246 144//144 147//147 
f 18//18 17//17 148//148 
f 18//18 148//148 155//155 
f 149//149 155//155 148//148 
f 17//17 19//19 148//148 
f 41//41 148//148 19//19 
f 149//149 151//151 150//150 
f 162//162 165//165 149//149 
f 149//149 165//165 151//151 
f 151//151 165//165 166//166 
f 155//155 152//152 18//18 
f 154//154 28//28 152//152 
f 28//28 154//154 153//153 
f 155//155 150//150 152//152 
f 152//152 150//150 156//156 
f 152//152 156//156 154//154 
f 153//153 154//154 156//156 
f 156//156 157//157 153//153 
f 149//149 150//150 155//155 
f 159//159 157//157 160//160 
f 32//32 153//153 158//158 
f 157//157 158//158 153//153 
f 157//157 159//159 158//158 
f 150//150 161//161 156//156 
f 150//150 151//151 161//161 
f 151//151 166//166 161//161 
f 175//175 156//156 161//161 
f 160//160 157//157 176//176 
f 157//157 156//156 176//176 
f 156//156 175//175 176//176 
f 175//175 184//184 176//176 
f 162//162 148//148 41//41 
f 41//41 163//163 162//162 
f 162//162 149//149 148//148 
f 41//41 42//42 163//163 
f 167//167 165//165 162//162 
f 167//167 162//162 163//163 
f 163//163 164//164 167//167 
f 172//172 164//164 42//42 
f 42//42 164//164 163//163 
f 165//165 182//182 166//166 
f 167//167 169//169 165//165 
f 165//165 169//169 182//182 
f 168//168 167//167 164//164 
f 178//178 168//168 164//164 
f 168//168 169//169 167//167 
f 186//186 169//169 168//168 
f 168//168 178//178 186//186 
f 158//158 170//170 32//32 
f 159//159 170//170 158//158 
f 159//159 171//171 170//170 
f 171//171 70//70 170//170 
f 170//170 70//70 49//49 
f 199//199 70//70 171//171 
f 42//42 50//50 172//172 
f 93//93 172//172 50//50 
f 199//199 171//171 179//179 
f 199//199 179//179 202//202 
f 202//202 179//179 203//203 
f 171//171 159//159 173//173 
f 159//159 160//160 173//173 
f 176//176 173//173 160//160 
f 174//174 161//161 166//166 
f 174//174 175//175 161//161 
f 166//166 182//182 174//174 
f 176//176 184//184 177//177 
f 173//173 176//176 177//177 
f 177//177 184//184 183//183 
f 171//171 173//173 179//179 
f 177//177 185//185 173//173 
f 185//185 177//177 183//183 
f 164//164 172//172 178//178 
f 208//208 186//186 178//178 
f 173//173 180//180 179//179 
f 179//179 180//180 203//203 
f 173//173 185//185 180//180 
f 180//180 181//181 203//203 
f 181//181 180//180 193//193 
f 182//182 169//169 188//188 
f 188//188 169//169 186//186 
f 174//174 184//184 175//175 
f 190//190 182//182 188//188 
f 190//190 174//174 182//182 
f 184//184 192//192 183//183 
f 184//184 174//174 189//189 
f 189//189 192//192 184//184 
f 174//174 190//190 189//189 
f 183//183 194//194 185//185 
f 194//194 183//183 192//192 
f 190//190 188//188 191//191 
f 188//188 186//186 191//191 
f 192//192 189//189 195//195 
f 196//196 189//189 190//190 
f 190//190 191//191 196//196 
f 196//196 198//198 189//189 
f 195//195 189//189 198//198 
f 191//191 186//186 187//187 
f 180//180 185//185 194//194 
f 195//195 194//194 192//192 
f 194//194 195//195 229//229 
f 229//229 195//195 198//198 
f 194//194 229//229 180//180 
f 193//193 180//180 229//229 
f 191//191 197//197 196//196 
f 198//198 196//196 197//197 
f 71//71 199//199 200//200 
f 200//200 199//199 201//201 
f 202//202 237//237 201//201 
f 202//202 201//201 199//199 
f 201//201 231//231 200//200 
f 204//204 172//172 93//93 
f 94//94 96//96 93//93 
f 96//96 204//204 93//93 
f 209//209 172//172 204//204 
f 96//96 206//206 204//204 
f 205//205 96//96 97//97 
f 96//96 205//205 206//206 
f 205//205 207//207 206//206 
f 98//98 207//207 205//205 
f 207//207 212//212 211//211 
f 172//172 208//208 178//178 
f 172//172 209//209 208//208 
f 204//204 206//206 209//209 
f 221//221 208//208 209//209 
f 211//211 221//221 209//209 
f 225//225 227//227 215//215 
f 225//225 215//215 242//242 
f 206//206 211//211 209//209 
f 206//206 207//207 211//211 
f 211//211 210//210 221//221 
f 211//211 212//212 210//210 
f 217//217 213//213 212//212 
f 212//212 213//213 215//215 
f 215//215 230//230 214//214 
f 242//242 215//215 213//213 
f 215//215 227//227 230//230 
f 212//212 214//214 210//210 
f 215//215 214//214 212//212 
f 218//218 207//207 98//98 
f 216//216 218//218 98//98 
f 247//247 219//219 108//108 
f 216//216 108//108 219//219 
f 220//220 219//219 247//247 
f 217//217 218//218 219//219 
f 216//216 219//219 218//218 
f 207//207 218//218 212//212 
f 219//219 220//220 217//217 
f 212//212 218//218 217//217 
f 221//221 186//186 208//208 
f 187//187 186//186 221//221 
f 187//187 221//221 222//222 
f 222//222 223//223 187//187 
f 214//214 224//224 222//222 
f 223//223 191//191 187//187 
f 197//197 191//191 223//223 
f 228//228 197//197 223//223 
f 228//228 223//223 224//224 
f 222//222 224//224 223//223 
f 229//229 226//226 193//193 
f 249//249 193//193 226//226 
f 230//230 227//227 224//224 
f 226//226 227//227 225//225 
f 229//229 228//228 227//227 
f 227//227 226//226 229//229 
f 228//228 224//224 227//227 
f 222//222 221//221 210//210 
f 214//214 222//222 210//210 
f 230//230 224//224 214//214 
f 198//198 197//197 228//228 
f 198//198 228//228 229//229 
f 201//201 237//237 231//231 
f 238//238 231//231 237//237 
f 241//241 220//220 248//248 
f 244//244 121//121 232//232 
f 233//233 248//248 144//144 
f 246//246 233//233 144//144 
f 121//121 231//231 238//238 
f 121//121 238//238 236//236 
f 238//238 243//243 236//236 
f 241//241 235//235 243//243 
f 236//236 243//243 235//235 
f 236//236 232//232 121//121 
f 234//234 236//236 235//235 
f 232//232 236//236 234//234 
f 235//235 241//241 248//248 
f 233//233 235//235 248//248 
f 234//234 235//235 233//233 
f 202//202 203//203 237//237 
f 239//239 237//237 203//203 
f 237//237 239//239 238//238 
f 203//203 181//181 240//240 
f 239//239 203//203 240//240 
f 193//193 240//240 181//181 
f 240//240 193//193 249//249 
f 249//249 239//239 240//240 
f 249//249 225//225 239//239 
f 225//225 242//242 239//239 
f 239//239 242//242 238//238 
f 242//242 213//213 241//241 
f 241//241 243//243 242//242 
f 243//243 238//238 242//242 
f 217//217 220//220 241//241 
f 213//213 217//217 241//241 
f 244//244 232//232 245//245 
f 245//245 125//125 244//244 
f 245//245 232//232 234//234 
f 130//130 245//245 246//246 
f 234//234 233//233 246//246 
f 245//245 234//234 246//246 
f 247//247 248//248 220//220 
f 226//226 225//225 249//249 
