# PIPER geometrical reference model based on a manual segmentation. See the
# documentation for more info.
# Author: CEESAR, SOTON, UCBL-Ifsttar
# Version: 1.0.0
# License: Creative Commons Attribution 4.0 International License.
# (https://creativecommons.org/licenses/by/4.0/)
# 
# This work has received funding from the European Union Seventh Framework
# Program ([FP7/2007-2013]) under grant agreement 605544 [PIPER project]).
# Contributors include Pierre Maillez, Christophe Lecomte (SOTON), Erwan
# Jolivet (CEESAR), Philippe Beillas (UCBL-Ifsttar)
# This work is derived from a CT scan provided by CEESAR under a CCBY-4.0
# License
# 
####
#
# OBJ File Generated by Meshlab
#
####
# Object Skin_of_head.obj
#
# Vertices: 1066
# Faces: 2097
#
####
v 81.477852 201.854507 -376.286285
v 54.643879 210.299805 -373.769409
v 44.431000 209.865097 -373.691406
v 65.278587 210.748001 -372.402802
v 92.298950 192.512802 -367.263611
v 90.210007 193.506897 -375.370514
v 85.079063 200.035797 -371.023804
v 17.469959 203.586105 -370.430511
v 26.289410 207.175095 -371.611298
v 35.829929 209.754700 -370.044586
v 46.868919 213.552094 -367.049896
v 106.140404 173.897598 -370.917297
v 108.367996 167.953094 -365.024902
v 73.657257 208.055603 -373.749512
v 85.979057 201.449005 -364.770599
v 80.805931 205.816498 -368.595886
v 35.148270 212.276398 -365.215912
v 56.981651 218.351501 -362.455811
v 58.756908 213.310104 -369.050293
v 7.698877 198.420898 -362.156189
v 2.689997 191.106506 -365.320099
v 10.168040 198.979004 -367.680115
v 27.085819 212.223007 -360.450989
v 26.191469 208.168198 -367.279694
v 98.925812 183.313004 -373.936401
v 103.822701 147.056107 -360.881012
v 107.910797 157.253296 -365.602295
v 100.736603 181.902100 -367.119110
v 84.532890 207.229599 -358.788208
v 66.798958 215.395599 -364.351593
v 74.691933 217.118607 -356.317810
v 76.115356 211.191299 -364.408813
v 104.412003 153.834396 -355.138489
v 107.737198 174.225494 -354.408905
v 91.803192 199.239807 -355.885803
v 20.272711 211.949493 -353.253601
v 46.778400 220.759903 -357.712189
v 10.246190 203.274200 -355.742188
v 16.269690 205.157806 -362.873413
v 97.986053 125.407303 -358.917999
v 102.209702 138.815506 -361.024994
v 100.152901 139.088303 -353.218903
v 105.063599 183.384293 -351.304596
v 28.236090 215.806702 -354.808990
v 47.067200 227.868301 -349.937195
v 105.556396 176.926102 -362.074707
v 28.527901 218.608093 -349.063812
v 37.369629 224.776505 -348.277405
v 36.275810 217.096298 -357.945892
v -1.006444 172.204895 -347.798401
v -4.776728 171.757095 -353.094788
v 107.057999 164.919907 -356.736389
v 13.612110 208.450195 -348.224701
v 6.721838 199.877396 -347.639404
v 80.870003 219.480698 -347.039398
v 73.286270 223.379898 -349.766998
v 99.230331 187.195602 -359.417389
v 65.422020 223.044098 -355.197296
v -0.458527 151.645096 -343.720215
v -0.132053 180.726196 -348.553986
v -1.913260 183.417603 -356.979095
v 3.476015 194.538193 -356.952301
v 81.951447 213.065308 -354.052704
v 55.332771 225.926697 -353.753387
v 62.156052 231.221893 -347.800201
v 68.778351 229.669205 -346.651703
v 90.408096 116.363800 -352.206085
v 94.333733 125.487999 -348.741486
v 99.544701 135.892502 -342.127502
v 106.637398 164.032104 -345.653198
v 107.873100 172.525406 -346.899506
v 19.776680 215.282593 -342.065094
v 99.626472 193.003998 -349.016815
v 58.122711 99.012222 -340.685486
v 59.984772 97.328537 -347.254791
v 79.725899 104.328201 -348.177795
v 85.593872 109.464104 -350.351105
v 0.264447 156.030594 -341.417999
v -2.581992 161.262497 -347.337311
v 95.323128 126.052399 -340.070801
v 1.618123 190.223297 -350.752289
v 43.527760 234.497192 -342.011200
v -2.414344 145.744995 -347.644592
v -0.157612 134.126907 -347.061005
v 3.207147 190.091797 -340.203003
v 26.425289 223.962204 -339.501587
v 33.782860 231.826797 -339.368988
v 11.665390 115.937103 -342.348999
v 38.635460 100.784302 -338.854004
v 47.998341 99.094658 -338.024200
v 44.986629 98.287849 -344.845612
v 72.731377 103.186302 -335.273712
v 79.963707 107.504799 -340.756287
v 1.909348 144.831894 -340.775085
v 109.383003 175.531494 -335.433807
v 54.629181 234.343994 -344.704987
v 22.419081 108.884697 -337.524994
v 19.166800 108.359901 -343.201904
v 29.312639 103.373398 -342.273010
v 71.017151 99.729317 -346.825012
v 5.020118 134.796707 -340.244293
v 5.720958 126.175400 -343.137207
v 2.786738 151.351593 -335.810791
v 109.022499 163.986694 -332.789001
v 103.952904 150.645004 -342.687805
v 95.519249 202.886703 -343.686493
v 99.585838 206.271805 -333.767700
v 76.450180 229.082306 -341.715210
v 86.721657 225.885406 -336.463593
v 88.884399 211.907593 -345.461700
v 107.673500 190.594193 -332.514008
v 108.299004 182.550507 -340.037292
v 79.474564 107.898399 -331.336609
v 87.587624 115.437897 -341.104797
v 106.777298 151.936005 -332.695099
v 14.426200 214.707596 -331.072815
v 66.812492 237.571396 -339.307404
v 104.827698 190.764099 -340.369812
v 100.638100 197.936401 -339.837799
v 40.805210 100.918404 -330.781494
v 1.622105 175.291397 -339.429291
v 2.643224 186.266800 -328.640808
v 9.420280 205.772797 -330.111298
v 79.946518 237.338394 -333.068787
v 55.091480 99.145309 -331.213104
v 87.548492 115.036400 -329.586212
v 93.948090 122.512001 -333.825989
v 31.033409 103.968803 -335.928894
v 107.239304 146.757202 -328.650787
v 12.041140 208.180695 -337.981812
v 100.278198 221.074905 -325.875092
v 95.022789 211.958099 -336.609894
v 18.784840 113.408997 -333.957397
v 64.643707 100.266899 -336.012787
v 10.726250 131.785004 -331.438599
v 12.762720 122.436600 -335.015686
v 11.748590 136.330902 -323.049713
v 6.508433 141.485794 -332.788300
v 6.791304 149.181595 -326.137604
v 2.401078 161.465103 -335.391693
v 19.001579 219.297394 -333.928589
v 93.007187 219.755707 -334.360291
v 38.692291 241.850006 -333.512909
v 49.001640 99.308006 -324.239410
v 3.625155 171.522705 -327.753815
v 2.655751 179.567596 -328.928497
v 19.064360 226.519608 -330.126312
v 105.734901 205.116501 -324.352112
v 53.947899 242.857300 -335.984894
v 79.428841 253.925598 -322.269592
v 104.692001 197.293396 -331.689087
v 28.488701 107.716904 -318.105103
v 74.122643 103.578003 -322.798798
v 4.446456 155.738007 -329.503998
v 3.192445 179.889496 -318.319794
v 107.239899 141.076004 -324.475586
v 14.352350 220.368195 -327.264008
v 19.683750 238.109802 -324.301788
v 26.827259 234.008102 -332.868805
v 29.239691 243.035797 -328.057587
v 38.537540 251.361893 -325.507385
v 27.622829 107.001999 -328.995392
v 57.109661 98.799873 -316.736206
v 64.861107 100.518600 -326.422394
v 88.661118 114.239403 -322.355286
v 97.074257 120.021202 -318.100708
v 104.203003 142.787994 -333.646515
v 7.131755 200.785599 -334.474304
v 12.498710 228.096405 -322.413300
v 28.583099 249.733994 -320.954712
v 85.641251 244.130600 -325.723511
v 89.600937 235.548798 -328.745789
v 67.882263 100.476097 -316.910187
v 104.648300 131.100098 -318.933014
v 110.430298 153.863800 -324.082092
v 111.214104 188.304398 -323.392212
v 111.931900 176.520599 -325.954102
v 51.366619 252.229599 -328.163300
v 48.432991 263.097687 -319.892090
v 91.949028 248.538605 -319.214386
v 69.025620 249.147095 -328.778290
v 22.924770 114.463402 -315.739014
v 20.563580 115.340103 -325.455292
v 15.197290 125.428596 -326.644897
v 17.595921 123.881302 -318.575592
v 81.610268 107.220100 -319.063507
v 88.900360 110.171402 -315.204315
v 100.851402 131.943695 -331.199402
v 96.197678 123.282303 -325.942993
v 113.792099 179.269806 -319.938812
v 93.821358 228.822693 -329.014709
v 96.622452 237.656494 -322.571808
v 38.213150 258.456512 -318.465698
v 42.895390 100.571404 -322.182312
v 40.969761 101.465897 -317.270599
v 81.273247 108.733299 -324.223389
v 9.584352 146.541595 -316.212585
v 4.279291 195.536102 -324.272186
v 97.979431 112.883598 -308.544312
v 5.769877 159.677200 -322.544189
v 2.863866 192.515305 -311.467194
v 10.137140 218.901001 -321.473907
v 71.657829 264.765411 -317.809509
v 62.749889 273.297302 -314.499603
v 70.090523 258.112305 -322.960297
v 60.722710 262.497498 -321.904907
v 113.710403 199.376801 -313.846710
v 78.453033 102.846497 -312.951691
v 2.619413 186.482300 -309.799988
v 115.867699 176.730606 -312.985687
v 113.218399 169.393799 -321.476715
v 2.494922 185.177307 -320.626892
v 7.839963 229.209595 -313.855194
v 102.409203 242.886795 -314.649994
v 27.472090 109.107597 -307.277496
v 35.949089 102.958099 -321.146515
v 37.656811 102.370399 -311.695313
v 4.791594 207.376694 -306.645599
v 80.302757 264.562714 -312.891205
v 104.385696 233.661499 -317.611603
v 19.359890 120.706200 -308.946594
v 14.120300 132.793304 -312.404602
v 112.260597 144.313202 -313.706390
v 6.624758 204.505402 -320.139191
v 9.986174 210.569199 -325.302887
v 10.502200 241.093704 -310.375702
v 12.296020 237.330307 -317.879608
v 83.926819 257.634705 -317.196411
v 42.640202 266.564606 -313.737091
v 58.503429 277.899506 -310.007507
v 49.501701 273.415497 -311.100311
v 55.818371 271.532196 -316.917786
v 46.395359 99.904617 -316.123993
v 109.766403 131.170898 -308.247009
v 109.121902 213.287506 -316.925690
v 107.570297 225.341904 -316.322113
v 58.882969 96.178146 -305.055786
v 4.939667 170.999405 -313.916412
v 119.196800 153.250107 -303.016510
v 114.896004 160.959396 -313.917603
v 6.790133 236.251495 -303.080902
v 98.307266 254.629105 -305.060394
v 116.852699 207.455505 -306.758209
v 69.553307 98.222443 -307.778595
v 116.473000 140.163193 -302.837585
v 19.383450 247.975006 -314.561615
v 32.371590 259.446411 -313.147003
v 39.181862 268.376404 -308.597290
v 93.706596 254.244598 -312.181091
v 85.482338 264.644104 -305.655212
v 71.987923 272.529907 -309.125000
v 110.941597 233.642700 -308.309906
v 7.685943 157.638199 -308.220795
v 103.344803 123.437202 -312.064697
v 6.490756 215.573700 -312.900787
v 5.086360 225.509201 -303.483002
v 38.736301 269.895905 -299.732788
v 54.360168 278.607391 -299.137085
v 66.639168 278.495789 -300.373688
v 81.407944 99.766678 -305.292114
v 89.870354 98.594643 -299.671814
v 5.641128 169.650101 -302.508606
v 4.223625 200.209396 -310.125000
v 68.540947 92.839371 -299.084595
v 96.468063 103.623199 -300.750702
v 117.848198 166.840698 -306.531311
v 121.770798 163.843796 -300.153412
v 123.367104 179.969299 -300.949493
v 118.773102 186.850906 -307.350708
v 123.105598 203.399597 -296.096893
v 119.015701 219.948807 -297.332214
v 112.947998 219.996704 -309.819885
v 112.756203 241.516800 -297.347595
v 105.685600 245.886307 -307.477814
v 47.760712 97.400558 -305.731293
v 11.400030 141.159500 -305.975403
v 95.187866 260.583801 -293.477295
v 105.629997 249.917099 -300.351990
v 15.141240 128.649002 -304.160095
v 56.361179 91.212799 -296.808014
v 43.828690 93.092438 -295.757690
v 114.103699 127.352097 -297.328400
v 120.024696 175.328400 -303.610596
v 128.228500 176.841400 -298.779388
v 78.394478 272.837891 -295.149200
v 121.410103 195.146500 -302.258514
v 36.429550 99.990860 -301.729797
v 33.884048 96.009583 -293.043304
v 28.161230 104.772301 -298.372101
v 80.381897 94.871971 -299.446899
v 5.311661 169.793503 -292.712708
v 2.172012 189.384094 -296.288605
v 3.596827 180.178604 -302.242706
v 106.385002 119.421097 -303.120514
v 121.010201 144.966995 -297.846100
v 136.065002 164.949905 -295.873291
v 130.995499 166.530197 -298.021606
v 4.368661 214.915604 -301.663696
v 27.228840 259.491913 -306.327087
v 67.304619 281.066315 -278.619202
v 62.092499 280.517700 -298.739410
v 108.491302 250.492798 -287.444794
v 85.569130 88.415489 -291.873810
v 89.194130 104.378700 -307.170013
v 103.214897 107.633698 -297.251190
v 12.534060 134.756897 -297.737305
v 6.988158 162.692001 -299.341187
v 127.737999 159.950897 -295.745514
v 125.047798 170.406403 -299.316895
v 134.006897 156.504501 -293.621796
v 133.229904 174.855606 -296.451385
v 16.104630 249.724304 -305.881897
v 11.342300 245.640198 -299.521606
v 28.928780 262.914215 -283.607788
v 74.070641 278.567688 -277.247986
v 130.652298 187.020294 -290.163910
v 125.878403 186.265503 -297.845795
v 11.718910 130.442993 -290.595795
v 18.518511 118.041901 -296.876190
v 8.715425 142.768494 -289.240509
v 138.691696 164.580902 -291.600891
v 128.275696 194.056107 -289.181396
v 115.826103 233.048203 -298.714203
v 49.391972 87.472618 -290.683411
v 57.515968 84.005302 -288.421387
v 69.360939 83.796967 -288.794586
v 119.884102 122.374397 -283.821808
v 124.852203 154.975494 -295.066589
v 131.290207 150.040604 -287.362305
v 138.220596 170.699799 -287.308502
v 21.715620 256.589905 -296.787201
v 61.973839 280.928894 -287.541290
v 126.922401 208.192993 -283.689789
v 90.010681 92.691406 -293.869293
v 8.734541 152.147903 -296.970215
v 2.261225 181.328506 -287.787689
v 107.540001 102.661400 -287.491089
v 110.711998 113.873596 -291.761200
v 139.166595 154.660599 -289.933899
v 130.456207 182.281204 -295.243896
v -1.126940 185.485306 -280.800415
v 120.091103 231.426605 -285.587585
v 30.769800 91.554321 -284.497986
v 78.124352 88.435638 -293.376190
v 126.146004 145.533493 -289.181213
v 127.140900 134.367401 -280.403687
v 136.899902 173.568100 -291.805603
v 134.057800 181.835297 -289.618103
v 3.885381 220.358505 -291.961212
v 5.302656 232.278702 -290.092102
v 24.427601 102.368401 -289.257690
v 12.041350 120.291603 -282.340515
v 8.042554 134.070908 -282.649414
v 114.482697 107.129700 -280.959106
v 121.199402 136.506805 -292.307495
v 137.672394 147.768494 -284.981110
v 4.312840 226.367493 -279.340912
v 24.973989 92.634453 -278.687286
v 17.661449 111.425003 -287.613586
v 137.596207 160.925705 -280.537811
v 139.718506 157.771805 -286.300110
v 138.437698 164.517502 -286.435791
v 85.656517 271.247986 -275.855408
v 2.902368 171.676804 -283.575500
v 130.244705 139.959793 -278.524994
v 137.264297 168.776794 -279.609589
v 8.301058 241.251602 -291.697296
v 123.060600 220.594803 -285.452087
v 74.598053 74.990059 -278.518188
v 5.838191 158.087906 -286.227600
v -0.980465 168.625397 -280.204803
v 2.898252 203.084396 -292.010406
v 105.882797 83.946960 -273.780609
v 99.451462 78.399879 -274.988495
v 94.108887 84.266342 -283.989014
v 4.394521 144.317200 -277.356995
v 2.096258 158.895203 -278.997986
v -4.523195 164.569595 -279.120789
v 99.819183 95.379082 -289.672089
v 110.326302 94.993652 -278.043610
v 141.683701 142.721603 -275.405701
v 140.340500 155.203705 -277.211487
v 136.956604 177.986298 -282.414886
v 45.007252 274.497406 -283.411407
v -8.319714 157.923492 -275.204193
v -3.086288 156.354599 -275.859711
v -0.299684 177.860397 -281.380493
v 128.346802 124.112297 -270.838501
v 133.465103 134.154099 -268.008087
v 142.711700 150.198898 -280.073608
v 136.454193 163.426300 -274.123810
v 126.221603 227.652496 -269.730103
v 112.449898 250.381897 -266.582703
v 117.673698 241.790100 -278.060211
v 39.409569 86.624947 -284.900299
v 38.165131 77.305946 -271.612488
v 48.958672 80.356323 -281.496185
v -6.959641 150.980392 -272.829590
v -10.009450 170.613205 -273.132904
v -6.922723 177.188293 -274.872894
v -5.947031 171.408295 -278.172302
v 118.482803 100.799500 -270.463501
v 142.623795 145.969894 -280.252594
v 137.788605 174.686905 -273.952301
v 56.681240 279.781586 -281.246094
v 57.444462 279.848694 -267.106293
v 61.848911 75.488373 -277.808990
v 83.524109 80.162468 -283.553314
v 3.632428 216.368896 -279.210297
v 5.459857 232.866806 -278.136993
v 15.210150 250.286407 -285.978607
v 45.546028 274.894409 -270.980408
v 51.289841 278.002594 -273.283813
v 132.366302 197.455795 -277.121094
v 134.191299 187.942398 -280.596588
v 9.049718 113.768700 -267.007996
v 103.520302 74.110802 -263.857788
v -0.738375 145.773697 -267.430389
v -10.325090 147.664795 -267.988586
v 93.400162 75.282494 -274.487488
v -12.365960 153.412796 -268.729095
v 122.246002 113.066902 -273.067291
v 137.538101 142.921494 -273.797394
v 137.729996 159.070404 -273.449707
v 0.285544 193.598404 -270.330200
v 1.750486 199.822906 -263.517487
v 63.415020 281.104889 -270.339905
v 126.702797 219.204300 -275.911102
v 79.777489 68.013908 -266.077789
v -5.890579 145.891403 -267.326691
v -10.958980 162.955505 -272.474701
v -10.231610 166.909500 -266.168488
v -8.809932 175.014603 -268.850189
v 132.727905 142.563507 -276.348297
v 22.000059 250.370895 -248.313904
v 67.603088 281.925415 -258.393799
v 137.453705 183.336502 -272.195587
v 83.284500 71.627632 -272.838989
v 13.292870 98.303307 -261.882904
v 17.391850 103.122101 -276.920685
v 5.728046 127.817398 -270.502411
v 116.777000 89.055054 -264.365509
v 138.688004 140.033005 -260.763092
v 145.286896 145.557800 -273.559113
v 144.979706 147.554596 -272.361206
v 9.206754 240.367401 -276.227905
v 135.814606 195.120697 -269.361389
v 131.688705 222.105392 -256.973389
v 120.232101 242.912796 -261.448486
v 99.846977 260.866486 -271.711395
v 104.143402 258.642609 -253.348694
v -12.939940 145.837494 -259.431885
v 72.302750 70.186234 -271.375702
v -8.361900 173.120605 -262.912689
v 143.576797 150.789200 -270.366394
v 137.983994 161.686600 -268.365204
v 50.525341 276.569214 -261.715088
v 125.263298 234.497192 -261.228790
v 131.104095 217.067596 -265.411713
v -12.417650 152.727997 -263.186798
v -2.970553 183.123795 -259.573792
v -4.433278 182.493500 -269.667603
v 140.530304 161.898697 -262.788696
v 2.827416 206.438904 -272.158600
v 2.243834 205.317001 -256.054413
v 19.356600 252.217102 -268.451904
v 72.674889 282.060211 -250.807404
v 138.562393 190.826202 -260.739105
v 132.239197 206.992096 -270.350098
v 92.008789 69.865807 -266.013000
v 30.473700 83.938026 -274.182892
v 36.176769 70.778328 -258.247314
v 28.267611 77.109329 -261.146606
v 48.342388 72.240921 -269.252197
v -11.825070 158.655106 -266.727997
v -9.247717 159.019501 -259.529694
v -6.694554 174.080994 -259.191101
v 128.722305 114.736702 -262.905487
v 138.700302 132.843506 -254.570999
v 143.269302 141.660797 -265.238800
v 146.240204 143.557800 -267.329712
v 148.829498 148.476196 -256.075714
v 141.034698 156.555405 -266.601990
v 138.265106 167.523193 -268.597198
v 89.198700 271.163086 -255.466705
v 79.444458 277.953796 -258.469208
v 122.062798 235.307205 -274.460388
v 63.578838 67.351334 -262.660309
v 1.412541 135.458298 -262.388794
v -1.885765 137.050507 -247.044403
v 140.404297 141.009399 -263.707794
v 146.384399 147.293900 -264.581604
v 144.374603 152.009705 -261.725006
v 139.622406 175.536606 -263.796906
v 4.115171 216.822601 -253.204300
v 4.666722 223.162094 -266.738892
v 3.747652 214.944107 -266.395203
v 6.298921 231.790894 -267.169891
v 61.433441 280.703613 -253.427994
v 138.907593 202.319397 -250.208893
v 135.608307 207.570206 -259.524994
v 61.127140 64.786873 -255.391403
v 85.712700 66.727867 -257.693787
v 21.284090 87.515053 -265.679108
v 5.761987 120.992897 -264.460297
v 0.403377 128.367493 -250.848495
v -4.788768 175.238205 -254.925705
v -10.126260 141.347107 -257.884705
v 69.619820 64.179550 -249.430298
v -7.576949 156.173401 -252.701599
v -5.495600 162.673706 -250.422699
v -6.655124 168.782303 -256.924591
v -6.405653 177.684402 -262.569214
v 97.649078 69.266853 -260.342987
v 112.736801 72.817368 -247.115707
v 146.693497 151.757797 -256.451202
v 36.416191 266.559387 -263.237305
v 68.205383 283.017303 -245.040802
v 47.319939 67.530998 -259.638489
v 7.282277 108.100403 -255.234100
v 3.939424 121.963699 -259.152802
v -8.768980 139.094406 -244.705399
v -2.548717 179.070999 -248.162994
v 124.684303 96.931664 -256.507385
v 124.182800 106.960999 -265.181793
v 128.064606 106.451500 -257.397186
v 143.468506 143.449097 -256.351013
v 147.698303 145.348694 -256.087891
v 81.181419 278.283691 -238.853394
v 140.628006 190.621902 -249.412598
v 15.558540 88.562477 -254.510895
v 20.429211 80.256142 -251.158798
v -5.101408 140.439697 -255.895798
v 143.818207 157.380096 -257.890289
v 142.180695 165.148102 -258.933105
v 101.049301 68.481323 -250.584595
v -3.852841 170.363205 -246.919998
v 143.548096 147.470795 -247.336197
v 146.385406 150.273895 -249.597794
v 144.259995 165.760803 -249.214005
v 146.604797 158.120499 -252.130707
v 142.938202 168.832108 -254.940903
v 6.182570 225.973495 -251.783600
v 97.295692 264.652802 -254.990402
v 141.227493 178.430405 -253.300201
v 54.328140 64.880089 -252.444595
v 41.282551 66.751472 -251.369598
v -10.956780 150.903793 -255.879395
v 149.015594 151.481201 -250.362900
v -0.320034 191.406906 -254.239594
v 122.650101 240.043396 -243.935104
v 117.989799 246.286606 -254.976196
v 14.846570 85.651779 -241.732605
v -12.685370 140.672699 -247.735596
v 146.852402 156.981094 -248.120193
v 144.712494 158.824799 -245.710907
v -5.847200 158.821594 -246.412903
v -4.829514 163.158798 -238.753098
v 130.408600 101.196198 -248.071701
v 141.192398 196.776901 -240.970200
v 136.275894 214.009598 -244.394897
v -11.487240 145.543793 -246.900894
v -12.246520 142.424805 -239.263000
v -8.276727 149.361603 -239.669403
v -7.968753 152.997101 -246.265503
v -5.884516 158.175095 -242.041107
v 115.188599 79.462479 -256.010406
v 141.767700 129.622604 -242.518997
v 135.460007 123.094398 -255.304199
v 64.659927 282.072113 -235.439804
v 38.855579 66.086998 -242.342300
v 11.443070 91.741470 -240.596603
v 10.665790 96.080940 -248.841995
v 6.365532 104.889999 -245.536301
v 4.634405 106.206398 -237.828903
v 2.802586 115.653503 -246.259995
v -11.709880 140.567993 -237.733200
v -4.757185 138.731003 -246.306595
v 123.639099 84.952454 -247.461899
v 130.526505 92.014236 -237.885300
v 105.602997 257.180115 -240.300598
v 112.767700 250.857101 -247.808701
v 87.671944 64.816040 -245.464096
v 120.702599 75.153648 -234.893494
v 141.692703 182.394699 -246.592407
v 143.347198 172.453705 -243.554306
v 11.077340 236.983795 -250.216202
v 131.382202 226.879593 -242.358200
v 46.946812 64.711548 -244.817596
v 58.619362 63.118980 -239.479401
v 78.744072 62.731960 -232.638199
v 32.290161 68.682663 -244.467896
v -8.693974 141.713303 -233.617798
v -6.466021 155.317200 -237.732697
v -7.053362 156.466599 -232.091400
v 139.884598 115.820602 -236.750702
v 135.545700 102.853203 -236.770401
v 133.166397 110.503304 -250.045898
v 141.865402 138.322495 -247.819702
v 145.032196 175.076996 -233.067001
v 0.300663 195.982300 -243.199402
v 1.404968 193.044098 -227.164200
v 2.200633 206.229996 -240.106796
v 122.519096 237.723694 -222.772400
v 128.941498 231.798706 -232.973099
v 26.194300 73.121292 -247.219193
v 2.386937 111.448402 -233.969101
v 0.025562 123.511803 -236.931503
v -1.212054 132.897598 -231.781097
v -5.059052 140.479599 -237.266800
v -9.990220 145.806107 -237.043304
v 15.821170 241.166306 -239.232803
v 111.313499 250.800995 -232.431396
v 20.689461 76.330551 -235.304901
v 0.016885 181.822296 -229.169998
v -1.039015 185.251495 -240.099197
v 145.811707 142.293594 -233.963699
v 142.840805 194.090393 -225.041794
v -6.615229 159.142197 -229.894196
v 3.515395 207.429306 -227.839203
v 6.786810 221.168304 -233.826294
v 4.364445 216.473694 -240.134903
v 44.621361 263.392487 -225.186905
v 36.678612 261.527191 -240.013000
v 60.117950 62.047150 -223.504700
v 97.655884 64.964417 -235.345703
v 109.543404 68.356560 -236.672195
v 16.663179 81.075562 -225.363495
v 12.428840 88.530807 -232.763596
v -8.076876 150.492996 -232.753998
v -9.762747 146.044495 -230.950394
v 115.962799 71.098442 -235.715302
v 131.352707 86.544777 -218.894394
v 127.366997 82.031631 -232.574097
v 137.028503 98.064034 -223.320999
v 140.473297 107.222504 -225.288605
v 51.350540 274.917114 -245.469894
v 70.824387 283.983704 -234.075104
v 135.200500 218.210602 -231.088104
v 5.661340 101.606697 -226.059006
v -5.745062 147.544601 -228.396103
v 148.106705 152.416794 -226.730499
v 145.177399 182.878693 -225.326599
v 142.884506 185.583298 -237.846893
v 139.881897 204.067703 -237.088593
v 140.674194 201.845505 -227.428299
v 45.902451 63.866611 -234.175598
v 106.415298 65.319153 -224.876999
v -8.586372 152.831696 -228.556702
v -7.790857 152.978302 -227.272705
v -4.645687 157.943604 -227.511993
v 138.443207 208.389496 -227.034500
v -0.508409 165.069504 -222.614502
v -3.313823 165.375198 -230.706802
v 147.183701 173.236496 -221.505005
v 149.134796 160.046906 -213.996201
v 6.136856 210.128204 -219.980606
v 9.587500 228.201996 -233.061203
v 58.658489 278.740906 -233.686401
v 50.908680 272.172913 -232.867294
v 26.834471 70.031853 -232.095993
v 79.966782 62.050121 -216.648499
v -0.775697 136.521194 -219.459198
v -2.449630 141.399200 -230.682297
v -2.211515 161.995605 -226.879395
v 145.920898 160.322006 -234.659698
v 71.490227 282.134613 -221.585602
v 141.140503 200.143707 -218.454300
v 135.798401 214.826096 -216.692001
v 24.819389 71.280586 -215.807800
v 43.093090 62.832600 -220.048401
v 34.606739 65.839043 -230.473099
v 119.224297 70.285408 -214.298706
v -1.800433 173.622101 -235.354202
v 13.234730 232.847702 -230.140106
v 98.495934 260.257690 -213.027695
v 127.406998 230.343002 -212.616898
v 8.706966 96.851143 -236.088699
v 11.402690 90.045486 -220.191406
v 26.247339 245.332397 -225.574097
v 96.154800 265.155090 -234.827499
v 2.628269 110.870399 -219.868393
v 2.166491 115.719498 -208.677597
v 124.967300 76.449829 -210.524902
v 149.021805 144.821701 -218.266296
v 131.730896 225.446793 -222.868103
v 7.478987 98.899010 -210.508301
v -1.868107 151.836304 -222.768799
v 0.679303 174.540604 -222.400803
v 146.850296 124.115700 -214.123703
v 145.039307 127.005203 -227.731903
v 61.350361 275.516815 -220.954407
v 52.638618 62.067719 -209.278702
v 114.681099 68.500938 -225.062897
v 0.104541 123.565002 -221.625305
v 2.137823 181.030807 -216.397003
v 138.073395 98.554352 -211.275101
v 146.219101 184.298096 -212.399796
v 75.694397 282.307800 -227.161804
v 79.149178 276.910889 -213.249405
v 139.375000 204.691803 -211.000595
v 30.186239 66.393402 -219.926300
v 35.184589 63.730850 -216.370605
v 67.099037 61.874691 -211.758408
v 95.416481 63.159931 -220.383301
v 93.598953 63.262169 -204.887100
v 125.485100 76.868340 -222.286301
v 142.944305 110.046700 -212.324005
v 9.075949 207.953705 -211.170395
v 17.059641 226.682098 -212.729004
v 40.173050 241.673004 -195.158295
v 47.497589 255.422104 -206.780396
v 108.532097 65.132317 -211.024399
v 3.897888 178.443100 -206.086700
v 2.538208 167.864899 -207.351105
v 143.835907 116.031799 -221.924301
v 147.867798 135.049896 -220.573700
v 10.023910 219.564407 -219.935593
v 84.554588 274.890686 -220.353302
v 143.074600 194.037399 -203.359802
v 78.019287 62.420738 -206.407104
v -0.562310 144.552597 -214.245499
v 148.930496 134.023697 -210.151901
v 72.762733 274.455994 -209.638596
v 108.238998 251.759201 -219.272202
v 64.670326 62.600182 -201.503799
v 0.545897 152.484497 -209.483795
v 149.331497 159.435196 -196.557999
v 11.456010 201.501999 -202.027100
v 5.627450 199.723206 -213.670303
v 13.965060 213.417007 -205.425400
v 130.723801 222.893005 -204.925095
v 117.797699 239.393997 -206.002396
v 63.622822 266.277100 -203.960205
v 4.226585 119.000801 -195.368896
v 2.341916 155.717194 -200.345200
v 140.524002 106.921402 -199.672195
v 146.746506 123.633301 -201.201706
v 99.605957 249.598907 -193.753693
v 106.421501 249.156403 -200.304596
v 90.814339 265.343994 -206.937897
v 138.777496 204.028503 -197.143402
v 12.900660 89.936180 -205.544296
v 18.981770 85.259857 -194.475098
v 123.628502 78.498528 -197.446396
v 136.396103 211.624695 -205.406601
v 125.356003 228.962097 -196.817596
v 40.782459 62.899132 -205.742706
v 11.027080 97.602013 -195.730606
v 5.487406 107.353699 -201.287796
v 2.357059 146.415100 -197.626801
v 5.792312 175.923004 -198.168396
v 135.891693 98.573387 -197.031693
v 149.414398 142.324295 -201.316498
v 7.769557 194.647400 -204.641998
v 4.909635 187.705505 -208.198700
v 83.555542 265.067108 -202.317993
v 33.011391 64.905907 -207.616898
v 0.926503 124.994698 -209.255493
v 1.176598 136.063995 -203.978104
v 9.673302 188.742004 -196.403503
v 130.846802 90.148438 -196.880997
v 129.064804 83.969368 -206.015198
v 146.843994 183.517395 -198.636002
v 148.468796 175.283997 -208.388702
v 119.544601 234.163696 -193.685303
v 18.165430 80.591202 -209.772598
v 4.714004 157.889893 -193.070007
v 115.834198 71.658737 -191.390793
v 119.963997 71.312286 -202.585999
v 134.738205 93.940483 -204.674500
v 96.772041 246.918198 -189.191803
v 134.454803 214.020096 -197.735794
v 25.316561 73.740417 -200.024307
v 30.838390 67.505920 -200.836700
v 16.155121 96.492317 -181.400208
v 142.399399 118.708504 -189.077103
v 135.354294 101.707802 -190.742798
v 146.893799 181.554306 -191.527695
v 17.146170 206.868393 -193.892700
v 21.610580 208.412506 -184.357605
v 19.901430 218.477600 -197.059692
v 29.093620 234.091095 -201.163605
v 140.407898 196.475693 -188.232101
v 9.183279 107.061798 -187.154297
v 147.556900 131.119507 -192.607300
v 148.132294 140.943207 -189.739899
v 148.790405 172.654907 -198.009094
v 13.132670 186.117294 -186.043198
v 14.533100 197.137405 -192.330093
v 17.350010 196.430405 -184.584503
v 25.098360 220.878098 -188.917694
v 62.611061 256.150085 -192.835205
v 136.912704 203.030197 -185.651703
v 40.011318 66.298027 -190.104797
v 66.604042 63.817829 -190.980698
v 79.945007 63.578751 -195.932602
v 105.708504 65.073334 -197.383896
v 114.001404 67.414528 -199.703903
v 33.589298 229.731506 -187.496597
v 120.196297 228.452103 -185.054703
v 112.804802 239.263306 -191.133896
v 52.745628 67.074089 -177.976501
v 26.536190 77.307388 -188.578003
v 5.261287 136.289307 -188.088898
v 7.229257 153.928299 -184.515503
v 148.414398 151.653397 -189.485306
v 56.627338 244.796997 -183.674606
v 52.186451 63.600639 -193.750702
v 95.440781 65.211891 -190.325607
v 8.810583 171.931396 -187.384903
v 118.240303 79.337967 -184.189301
v 147.275696 155.819702 -184.394302
v 145.755798 165.003006 -182.860703
v 72.316803 261.867096 -197.865204
v 134.650604 210.381805 -190.317398
v 128.357605 221.232895 -190.311295
v 148.415802 168.564804 -191.088699
v 32.108398 71.110069 -188.733505
v 23.503401 85.111542 -181.677094
v 132.886597 107.207397 -180.442505
v 145.321899 133.994095 -184.763000
v 44.820702 240.842102 -188.702301
v 36.942020 226.632202 -180.145798
v 97.554283 237.623306 -181.257996
v 124.666199 219.101700 -179.714493
v 95.635109 67.588623 -180.455795
v 106.468597 68.235077 -186.441498
v 38.359489 74.326134 -171.840805
v 9.500214 144.854996 -178.450104
v 73.771538 235.884293 -175.856705
v 111.569099 234.034195 -183.522598
v 12.318730 138.113800 -172.610504
v 10.290040 161.739899 -179.363495
v 127.047897 89.599983 -187.596802
v 140.657501 182.075394 -176.678406
v 146.204697 177.113495 -186.963806
v 47.212650 230.756195 -176.133301
v 55.035351 251.526794 -192.055099
v 81.175278 65.797272 -182.879700
v 88.405586 68.858910 -173.896698
v 8.866410 131.106003 -178.882706
v 107.609299 74.621521 -176.670105
v 111.480103 83.442970 -170.738297
v 121.865601 91.548691 -176.490494
v 140.265900 124.625702 -180.348999
v 28.356501 217.164597 -180.575104
v 66.379303 247.714706 -185.480103
v 85.046028 250.160400 -189.875305
v 143.305496 187.991806 -186.920105
v 109.573601 227.711105 -175.524200
v 64.323288 65.610367 -181.058807
v 12.534180 108.022697 -175.447006
v 14.300390 156.702301 -171.527802
v 13.504520 169.632507 -175.103699
v 11.895120 174.630707 -180.568100
v 140.845200 136.851593 -176.020096
v 20.275881 192.337402 -175.180298
v 8.732231 118.899101 -180.739594
v 12.972510 145.836304 -172.385406
v 15.439000 182.331497 -177.756607
v 123.498100 209.824600 -169.725296
v 134.866806 134.952499 -168.366501
v 137.940598 146.677994 -169.253998
v 137.781097 173.462997 -169.098404
v 101.233803 227.178696 -171.938202
v 88.168602 229.535004 -171.519699
v 117.621201 222.347107 -175.300705
v 116.102898 216.055099 -167.774200
v 46.421249 70.326637 -172.242294
v 23.409401 91.121918 -168.625702
v 30.048731 79.214073 -176.644394
v 144.902206 150.712799 -180.066895
v 142.479706 162.987701 -174.565094
v 134.115295 187.165604 -167.734406
v 135.240601 196.933197 -175.954697
v 131.069901 210.422699 -181.102905
v 75.716919 68.880592 -170.599594
v 16.956329 101.657997 -167.737106
v 11.813290 127.196503 -172.056198
v 138.879898 159.895294 -168.837601
v 26.211321 187.774200 -164.319107
v 39.483311 212.371796 -166.633194
v 34.334499 217.819901 -174.900101
v 27.488720 204.926193 -172.984695
v 57.816280 236.437897 -176.156296
v 54.615341 72.952316 -160.624298
v 20.313330 98.236366 -160.839294
v 98.075943 70.940590 -174.091095
v 114.579803 95.623581 -163.487106
v 133.203094 121.407204 -171.879501
v 93.525208 222.967804 -165.690308
v 14.824700 111.599701 -163.995193
v 12.309310 117.284599 -170.874893
v 63.273529 69.146652 -168.733200
v 21.929159 159.106003 -161.273102
v 122.325302 110.216301 -163.798004
v 133.769302 154.401398 -162.786102
v 66.078056 218.096695 -158.931793
v 59.034271 227.110397 -168.136093
v 75.628113 225.297501 -165.774994
v 127.529701 196.311096 -164.009506
v 108.485497 220.374695 -167.705200
v 19.162310 173.712006 -167.872101
v 128.158005 124.419296 -164.286804
v 132.163193 167.918793 -161.046997
v 68.520523 75.474419 -152.571594
v 85.976044 73.036201 -163.671707
v 96.786087 75.231377 -166.554504
v 25.373381 169.075699 -158.633102
v 99.953148 81.210487 -160.934296
v 125.474800 104.651100 -170.958206
v 16.938219 115.276199 -154.431793
v 33.150131 199.703705 -163.453094
v 119.256798 202.204102 -159.555206
v 128.161407 138.396301 -160.494400
v 34.984402 191.134003 -157.130203
v 48.648640 211.011200 -158.649902
v 51.201328 219.067307 -163.709198
v 99.330933 216.918106 -160.529602
v 120.522003 194.000595 -156.217300
v 25.283230 94.934097 -153.821793
v 31.914560 84.370277 -161.255707
v 40.173100 80.890747 -154.125000
v 90.569717 77.747810 -157.930496
v 16.107389 135.869293 -163.794998
v 22.727711 142.023193 -154.330093
v 24.713480 176.499496 -160.851807
v 118.673302 117.016197 -156.757401
v 32.302380 178.207001 -154.747604
v 84.427490 218.349396 -159.033798
v 89.504578 83.168243 -147.543503
v 17.669029 146.704102 -164.800201
v 105.322403 88.456047 -158.305695
v 113.113800 103.910599 -155.843201
v 117.505203 128.241806 -152.916000
v 93.346527 211.700699 -154.226196
v 15.247420 123.792198 -161.295898
v 45.775681 75.208893 -160.709198
v 32.787441 152.568802 -146.426498
v 32.410660 162.510101 -150.802902
v 97.543694 88.981812 -147.943497
v 114.902199 186.222397 -150.040298
v 56.882839 213.118393 -156.353806
v 84.486214 205.438293 -148.712097
v 109.749702 210.212997 -159.418793
v 68.220963 208.068100 -150.762497
v 78.955254 212.909302 -153.467697
v 127.690598 183.652603 -159.444702
v 119.967003 144.792999 -152.403107
v 127.091904 157.588806 -156.507996
v 123.069000 173.589493 -153.517197
v 43.434490 200.767700 -156.021698
v 34.531509 88.495842 -147.518799
v 112.519798 117.437103 -149.831894
v 111.795601 134.182404 -146.800293
v 113.737701 175.197906 -147.455597
v 117.850899 161.908401 -149.756302
v 41.509480 188.024597 -151.245697
v 48.901051 78.814667 -149.289001
v 44.596642 84.533028 -141.989304
v 18.901470 105.193604 -155.204498
v 26.055380 151.052597 -153.933701
v 110.706398 148.501099 -145.645706
v 92.172493 88.783119 -140.899597
v 20.245199 132.264099 -152.733902
v 42.285839 163.665207 -144.292801
v 108.971199 108.443901 -147.911804
v 55.379082 204.839294 -151.799805
v 98.331779 204.149704 -150.433807
v 108.997101 197.761200 -151.192093
v 103.302002 189.735596 -145.031906
v 24.493481 102.403099 -145.295502
v 18.698620 122.579498 -150.738495
v 21.698771 113.251198 -145.356903
v 82.103203 77.608597 -151.873398
v 29.648640 146.237106 -146.825302
v 43.728310 175.989807 -146.816498
v 53.657600 168.714294 -141.097107
v 52.319271 191.405396 -147.202499
v 104.253799 136.582306 -140.212494
v 101.406601 149.801498 -140.124893
v 76.536034 199.306503 -145.268707
v 64.805580 197.414200 -145.645004
v 56.498859 77.139633 -148.852097
v 93.237007 94.883919 -135.985107
v 38.161331 156.430893 -143.797699
v 110.896004 123.911400 -146.847107
v 91.287956 194.517197 -144.317001
v 104.753502 180.705093 -143.721207
v 30.285320 95.239700 -143.657501
v 104.407799 97.346123 -148.552002
v 62.435951 176.414505 -140.070496
v 73.861107 178.826797 -138.945099
v 106.061203 165.258606 -143.474701
v 105.749001 125.759804 -140.428207
v 94.715790 174.458298 -140.102600
v 27.280491 107.039001 -139.239502
v 77.812119 81.968102 -140.383698
v 80.260963 85.712463 -133.786102
v 86.337173 87.077087 -137.034607
v 29.267120 137.448502 -142.909393
v 47.759281 157.183197 -139.234299
v 97.035454 161.364700 -139.566696
v 54.647861 179.988693 -142.897202
v 75.614273 190.073303 -141.695099
v 85.796608 183.339096 -139.927505
v 95.935768 185.302597 -141.590302
v 63.525051 186.191803 -141.987595
v 24.467661 125.229500 -143.037399
v 56.416698 153.748306 -134.673096
v 88.150703 164.862305 -137.610504
v 78.899849 170.383102 -137.453903
v 79.220871 161.587402 -135.608200
v 84.283730 174.989807 -138.380600
v 86.938164 155.223297 -135.169006
v 93.616577 152.103104 -136.795303
v 102.279404 118.133797 -135.370697
v 106.714996 116.311501 -142.265594
v 30.800430 115.639999 -135.963898
v 32.560799 127.769897 -135.940903
v 74.530838 87.496536 -131.130295
v 37.887550 148.097198 -140.125305
v 68.289543 167.849792 -137.515900
v 59.523800 160.900696 -137.160995
v 41.067020 122.913803 -130.705002
v 55.527020 80.890511 -141.474106
v 53.184650 86.706352 -133.932999
v 53.025429 94.050568 -129.445404
v 41.491940 137.393600 -133.612106
v 47.770489 148.545105 -134.814194
v 81.503220 150.467804 -132.447601
v 90.142509 143.956696 -132.938095
v 97.200539 139.091202 -135.364807
v 68.564102 154.390198 -133.151596
v 40.859280 91.944481 -136.815399
v 34.186050 105.778297 -134.234894
v 32.337189 99.798698 -137.900803
v 42.305222 110.136902 -130.056305
v 97.832619 117.015198 -130.809296
v 101.173500 107.487900 -136.954697
v 50.119572 130.595596 -128.822601
v 94.219887 129.880096 -130.751205
v 63.238010 89.594177 -129.236298
v 65.052788 82.979317 -136.306900
v 100.202599 126.979202 -134.319595
v 55.959911 143.403595 -130.812805
v 67.186150 142.158600 -129.051102
v 84.925240 135.594193 -129.070206
v 83.537987 89.611366 -131.732605
v 42.610378 99.892380 -131.543900
v 87.441040 106.549004 -126.842697
v 83.637993 96.276207 -128.559799
v 90.682213 118.623901 -127.681198
v 93.584389 106.013901 -129.626694
v 61.624260 130.358307 -127.267601
v 75.687233 144.461594 -129.766006
v 65.057793 98.662079 -126.412498
v 72.400368 93.723183 -127.233902
v 54.474548 104.602501 -127.216599
v 77.722702 102.701897 -126.082901
v 83.197853 112.807404 -126.052803
v 73.997581 132.426498 -127.246101
v 81.870819 123.233597 -126.560799
v 53.191078 118.079002 -127.201599
v 69.664467 114.687500 -125.876099
# 1066 vertices, 0 vertices normals

f 7 6 1
f 11 2 3
f 4 2 19
f 5 25 6
f 7 5 6
f 1 14 16
f 16 7 1
f 8 24 9
f 24 10 9
f 11 3 10
f 19 2 11
f 28 12 25
f 46 13 12
f 28 46 12
f 24 8 39
f 11 10 17
f 4 30 32
f 32 14 4
f 15 5 7
f 15 7 16
f 32 16 14
f 24 17 10
f 19 18 30
f 30 4 19
f 57 46 28
f 20 22 21
f 20 39 22
f 22 39 8
f 23 24 39
f 23 17 24
f 28 25 5
f 37 18 11
f 19 11 18
f 33 26 27
f 52 27 13
f 57 28 5
f 35 5 15
f 16 29 15
f 32 29 16
f 58 30 18
f 31 32 30
f 52 33 27
f 34 13 46
f 17 23 49
f 17 49 11
f 37 11 49
f 35 57 5
f 15 29 35
f 34 52 13
f 21 61 62
f 39 36 23
f 18 37 64
f 58 31 30
f 32 31 63
f 21 62 20
f 20 62 38
f 38 39 20
f 64 58 18
f 42 40 41
f 42 68 40
f 42 41 26
f 42 26 33
f 43 46 57
f 38 36 39
f 23 36 44
f 44 49 23
f 32 63 29
f 64 37 45
f 31 58 56
f 68 67 40
f 52 70 33
f 43 34 46
f 62 54 38
f 47 49 44
f 49 47 48
f 48 37 49
f 48 45 37
f 50 60 51
f 60 61 51
f 71 52 34
f 81 62 61
f 53 38 54
f 53 36 38
f 73 57 35
f 110 35 29
f 55 31 56
f 55 63 31
f 73 43 57
f 51 79 50
f 42 69 68
f 33 105 42
f 112 34 43
f 47 44 36
f 106 73 35
f 58 66 56
f 58 64 65
f 59 79 83
f 60 81 61
f 81 54 62
f 72 47 36
f 86 48 47
f 110 29 63
f 110 106 35
f 64 45 96
f 65 64 96
f 66 58 65
f 67 114 77
f 67 68 114
f 69 42 105
f 105 33 70
f 70 52 71
f 36 53 72
f 119 73 106
f 110 63 55
f 118 43 73
f 100 74 75
f 76 77 93
f 80 114 68
f 59 83 94
f 78 79 59
f 68 69 80
f 34 112 71
f 81 60 85
f 45 48 82
f 96 45 82
f 117 66 65
f 108 55 56
f 112 43 118
f 74 91 75
f 114 93 77
f 101 83 84
f 79 78 140
f 121 50 79
f 121 60 50
f 95 70 71
f 85 54 81
f 54 130 53
f 130 72 53
f 48 86 87
f 56 66 108
f 66 117 108
f 65 96 117
f 118 73 119
f 136 102 88
f 89 99 91
f 91 74 90
f 89 91 90
f 100 76 92
f 92 76 93
f 127 114 80
f 102 101 84
f 94 83 101
f 94 103 59
f 140 121 79
f 95 71 112
f 168 130 54
f 86 47 72
f 149 96 82
f 110 55 109
f 97 99 128
f 97 88 98
f 97 98 99
f 89 128 99
f 74 100 134
f 136 101 102
f 103 78 59
f 85 60 121
f 80 69 188
f 70 104 105
f 95 104 70
f 54 85 168
f 106 107 119
f 55 108 109
f 109 142 110
f 111 112 118
f 133 136 88
f 97 133 88
f 100 92 134
f 113 93 114
f 167 69 105
f 115 167 105
f 116 72 130
f 72 141 86
f 48 87 82
f 106 110 132
f 132 110 142
f 96 149 117
f 151 118 119
f 90 120 89
f 90 74 125
f 138 94 101
f 103 140 78
f 138 103 94
f 121 140 145
f 69 167 188
f 115 105 104
f 85 121 122
f 130 168 123
f 159 87 86
f 107 106 132
f 124 109 108
f 108 117 124
f 149 82 143
f 151 111 118
f 151 119 107
f 128 89 120
f 125 120 90
f 134 125 74
f 113 92 93
f 126 113 114
f 126 114 127
f 101 136 135
f 101 135 138
f 145 146 121
f 198 168 85
f 116 141 72
f 141 147 86
f 86 147 159
f 159 143 87
f 87 143 82
f 178 149 143
f 128 162 97
f 133 97 162
f 120 162 128
f 92 164 134
f 121 146 122
f 188 127 80
f 115 129 167
f 176 95 112
f 85 122 198
f 123 225 130
f 130 225 116
f 131 132 142
f 109 191 142
f 124 117 181
f 162 183 133
f 133 183 136
f 134 164 125
f 184 135 136
f 137 138 135
f 137 139 138
f 103 138 139
f 154 140 103
f 104 95 177
f 147 141 157
f 107 132 131
f 191 131 142
f 124 171 172
f 172 109 124
f 178 143 161
f 149 181 117
f 124 181 171
f 184 136 183
f 125 144 120
f 153 164 92
f 153 92 113
f 189 126 127
f 137 135 184
f 139 154 103
f 200 145 140
f 146 212 122
f 188 189 127
f 129 115 175
f 115 104 175
f 104 211 175
f 211 104 177
f 141 116 157
f 147 169 158
f 147 158 159
f 107 131 148
f 172 191 109
f 159 160 143
f 149 178 181
f 171 181 150
f 112 111 176
f 107 148 151
f 152 183 162
f 120 144 194
f 113 196 153
f 113 126 196
f 154 200 140
f 145 155 146
f 156 167 129
f 176 177 95
f 116 202 157
f 158 160 159
f 160 161 143
f 151 176 111
f 162 120 216
f 194 216 120
f 163 144 125
f 163 125 164
f 196 126 165
f 189 165 126
f 189 166 165
f 212 146 155
f 188 167 156
f 224 123 168
f 123 224 225
f 202 116 225
f 147 157 169
f 172 192 191
f 160 170 161
f 181 178 206
f 171 192 172
f 171 180 192
f 216 152 162
f 153 173 164
f 166 189 174
f 156 129 175
f 176 190 177
f 170 160 158
f 179 178 161
f 206 178 179
f 205 181 206
f 171 150 180
f 205 150 181
f 176 151 148
f 182 183 152
f 185 184 183
f 182 185 183
f 194 233 195
f 233 194 144
f 173 163 164
f 165 186 196
f 187 165 166
f 184 185 137
f 139 200 154
f 188 174 189
f 190 211 177
f 224 168 198
f 202 169 157
f 131 191 192
f 193 161 170
f 161 193 179
f 148 131 235
f 235 131 236
f 194 195 216
f 163 233 144
f 186 153 196
f 187 186 165
f 137 197 139
f 175 223 156
f 212 201 122
f 201 198 122
f 263 224 198
f 169 227 158
f 220 131 192
f 170 158 246
f 150 228 180
f 150 205 203
f 148 207 176
f 220 236 131
f 199 187 166
f 197 200 139
f 200 238 145
f 188 156 174
f 175 211 240
f 201 263 198
f 225 255 202
f 202 213 169
f 227 246 158
f 247 193 170
f 232 206 179
f 203 206 204
f 205 206 203
f 203 228 150
f 176 210 190
f 148 235 207
f 208 153 186
f 137 185 222
f 197 137 222
f 197 253 200
f 238 200 253
f 212 155 209
f 174 156 223
f 210 240 211
f 211 190 210
f 201 212 209
f 255 213 202
f 227 169 213
f 170 246 247
f 214 192 180
f 215 182 152
f 216 217 152
f 195 217 216
f 233 217 195
f 153 208 173
f 208 186 187
f 155 145 238
f 199 166 254
f 174 254 166
f 240 223 175
f 218 224 263
f 226 246 227
f 180 249 214
f 180 228 249
f 203 219 228
f 206 232 204
f 207 269 176
f 214 220 192
f 182 221 185
f 163 275 233
f 197 276 253
f 197 222 276
f 223 240 239
f 218 255 224
f 225 224 255
f 226 227 213
f 312 246 226
f 179 193 229
f 249 228 219
f 179 229 231
f 232 179 231
f 230 232 231
f 204 232 230
f 204 251 203
f 203 251 219
f 217 215 152
f 221 182 215
f 233 275 217
f 254 174 234
f 234 174 223
f 229 193 247
f 176 269 210
f 243 207 235
f 236 272 235
f 220 252 236
f 220 214 252
f 274 214 249
f 275 163 237
f 244 163 173
f 163 244 237
f 244 173 208
f 187 304 208
f 199 304 187
f 222 185 221
f 238 253 262
f 155 238 293
f 155 293 209
f 266 239 240
f 266 240 210
f 256 213 255
f 241 213 256
f 213 241 226
f 312 299 246
f 242 274 249
f 251 250 219
f 250 249 219
f 272 243 235
f 286 207 243
f 287 217 275
f 208 260 244
f 304 260 208
f 254 234 294
f 223 245 234
f 223 239 245
f 210 269 283
f 299 247 246
f 247 299 248
f 247 248 229
f 242 249 250
f 231 229 248
f 204 230 259
f 259 251 204
f 286 269 207
f 236 252 272
f 252 214 274
f 215 217 287
f 279 222 221
f 253 276 335
f 253 307 262
f 254 294 199
f 210 283 266
f 255 218 298
f 255 298 256
f 313 312 226
f 299 257 248
f 231 248 257
f 257 258 231
f 231 258 230
f 301 230 258
f 301 259 230
f 237 244 264
f 244 260 290
f 304 261 260
f 222 279 276
f 238 262 293
f 239 266 267
f 209 292 201
f 372 263 201
f 271 272 252
f 273 252 274
f 289 215 287
f 319 279 221
f 221 215 319
f 244 290 264
f 290 260 261
f 199 265 304
f 294 305 199
f 234 282 294
f 295 245 239
f 266 283 267
f 269 317 268
f 268 283 269
f 293 292 209
f 292 372 201
f 313 226 241
f 286 243 270
f 271 243 272
f 323 271 252
f 323 252 273
f 278 273 274
f 278 274 242
f 319 215 289
f 237 280 275
f 237 264 280
f 265 199 305
f 276 279 306
f 276 306 335
f 253 335 307
f 311 297 284
f 218 263 372
f 241 256 350
f 312 331 299
f 242 277 278
f 285 250 251
f 317 269 286
f 243 271 270
f 279 319 306
f 275 280 281
f 293 291 336
f 294 282 338
f 282 245 355
f 245 282 234
f 284 297 309
f 267 283 309
f 283 268 309
f 268 284 309
f 284 268 317
f 317 340 284
f 284 340 311
f 218 372 298
f 277 242 250
f 251 259 285
f 322 286 270
f 281 287 275
f 287 288 289
f 290 344 264
f 290 334 303
f 261 334 290
f 262 291 293
f 292 293 336
f 305 294 338
f 355 245 295
f 239 267 328
f 296 310 297
f 297 311 296
f 298 372 349
f 256 298 349
f 349 350 256
f 367 313 241
f 331 257 299
f 300 259 301
f 286 322 317
f 302 273 278
f 278 277 302
f 287 281 288
f 289 288 351
f 319 289 351
f 280 324 281
f 264 326 280
f 264 344 326
f 290 303 344
f 265 261 304
f 379 265 305
f 320 335 306
f 335 291 307
f 291 262 307
f 308 328 267
f 308 267 309
f 297 310 308
f 309 297 308
f 296 311 347
f 367 241 350
f 331 312 313
f 314 257 331
f 257 314 384
f 315 285 259
f 316 340 317
f 281 324 395
f 318 306 319
f 319 351 359
f 261 379 334
f 261 265 379
f 318 320 306
f 345 295 239
f 310 296 339
f 296 347 321
f 313 367 411
f 301 258 332
f 300 315 259
f 317 322 316
f 342 271 323
f 273 342 323
f 281 395 288
f 324 280 325
f 280 326 325
f 282 355 327
f 345 355 295
f 239 328 345
f 308 329 328
f 310 329 308
f 296 321 339
f 347 330 321
f 411 331 313
f 405 332 258
f 332 300 301
f 285 277 250
f 322 270 333
f 270 271 333
f 324 397 395
f 375 303 334
f 375 334 379
f 318 353 320
f 320 370 335
f 335 370 291
f 291 364 336
f 379 305 337
f 305 338 337
f 338 282 327
f 310 339 356
f 339 321 361
f 330 362 321
f 348 347 311
f 348 311 340
f 340 316 348
f 336 341 292
f 341 372 292
f 372 409 349
f 277 450 302
f 384 258 257
f 368 271 342
f 302 394 273
f 288 395 343
f 397 324 325
f 408 344 303
f 355 345 346
f 365 346 345
f 329 345 328
f 321 362 361
f 347 348 383
f 349 357 350
f 367 350 446
f 331 411 314
f 368 333 271
f 394 342 273
f 351 288 343
f 359 352 319
f 318 319 352
f 375 379 373
f 318 352 353
f 337 338 354
f 355 346 327
f 356 329 310
f 356 339 403
f 390 403 339
f 357 349 409
f 357 410 350
f 517 384 314
f 363 450 277
f 358 351 343
f 359 351 440
f 326 344 408
f 364 291 370
f 356 423 329
f 361 390 339
f 360 361 362
f 330 347 383
f 277 285 363
f 415 348 316
f 322 415 316
f 397 325 407
f 364 370 377
f 387 336 364
f 354 338 327
f 365 345 434
f 329 434 345
f 329 423 434
f 366 360 362
f 366 362 330
f 330 383 366
f 372 341 425
f 410 446 350
f 446 411 367
f 415 383 348
f 368 428 333
f 487 342 394
f 351 358 440
f 408 369 326
f 408 303 375
f 408 375 420
f 320 353 376
f 376 370 320
f 364 377 371
f 371 387 364
f 341 336 387
f 382 390 361
f 360 382 361
f 372 425 464
f 464 409 372
f 314 411 466
f 384 517 412
f 315 363 285
f 322 333 414
f 325 326 407
f 326 369 407
f 373 374 375
f 420 375 374
f 370 376 377
f 371 377 386
f 378 401 371
f 401 387 371
f 373 379 380
f 337 380 379
f 422 354 327
f 423 356 381
f 403 381 356
f 390 382 455
f 360 366 391
f 366 383 404
f 405 258 384
f 469 414 333
f 368 342 428
f 302 450 393
f 471 343 395
f 395 397 396
f 386 385 378
f 378 371 386
f 385 401 378
f 341 401 400
f 401 341 387
f 354 380 337
f 402 354 422
f 327 346 388
f 346 365 389
f 389 365 434
f 390 444 403
f 424 382 360
f 360 391 424
f 428 342 392
f 393 394 302
f 471 395 396
f 396 397 474
f 471 358 343
f 352 359 440
f 397 407 474
f 438 369 408
f 352 441 353
f 441 376 353
f 398 385 386
f 401 385 431
f 399 401 431
f 400 401 399
f 380 354 402
f 481 381 403
f 481 403 444
f 383 437 404
f 383 415 437
f 314 466 517
f 413 405 384
f 405 413 406
f 392 342 487
f 407 369 453
f 438 408 420
f 376 441 489
f 462 400 433
f 400 462 341
f 390 455 445
f 483 382 424
f 483 455 382
f 445 444 390
f 484 391 366
f 341 462 425
f 409 496 357
f 357 498 410
f 466 411 446
f 412 413 384
f 469 333 428
f 414 415 322
f 358 504 440
f 440 416 352
f 453 369 438
f 374 417 420
f 376 418 377
f 385 419 421
f 385 398 419
f 421 431 385
f 418 386 377
f 399 433 400
f 373 417 374
f 388 422 327
f 456 483 424
f 484 366 404
f 357 496 498
f 467 315 300
f 427 300 332
f 474 407 488
f 488 407 453
f 438 420 470
f 376 489 418
f 386 430 398
f 431 421 475
f 422 388 478
f 346 389 388
f 381 480 423
f 480 381 481
f 391 456 424
f 494 404 437
f 461 425 462
f 464 425 426
f 409 464 497
f 332 405 427
f 437 415 447
f 414 447 415
f 428 392 459
f 453 438 429
f 471 396 473
f 416 441 352
f 417 470 420
f 398 430 419
f 430 386 418
f 399 431 432
f 432 433 399
f 422 525 402
f 525 422 478
f 389 434 443
f 445 455 492
f 391 484 456
f 494 484 404
f 497 496 409
f 435 517 466
f 300 427 436
f 436 467 300
f 468 437 447
f 458 487 394
f 475 421 460
f 438 470 429
f 504 358 471
f 440 504 439
f 439 416 440
f 441 416 505
f 432 431 475
f 513 433 454
f 513 462 433
f 373 380 442
f 402 442 380
f 434 423 443
f 491 443 423
f 480 491 423
f 492 444 445
f 498 446 410
f 587 466 446
f 517 435 624
f 486 363 315
f 469 447 414
f 448 459 392
f 394 393 449
f 450 544 451
f 421 419 452
f 519 474 488
f 429 488 453
f 470 417 514
f 433 432 454
f 417 373 567
f 567 373 442
f 442 402 524
f 444 492 481
f 493 492 455
f 455 483 493
f 463 456 484
f 437 468 494
f 465 497 464
f 413 457 406
f 427 405 406
f 458 448 392
f 459 469 428
f 460 421 452
f 430 508 419
f 418 533 430
f 513 461 462
f 402 525 524
f 388 569 478
f 389 569 388
f 534 493 483
f 483 456 463
f 484 494 535
f 464 426 465
f 587 435 466
f 457 412 517
f 457 413 412
f 486 315 467
f 501 468 447
f 501 447 469
f 459 501 469
f 451 393 450
f 429 470 503
f 471 473 504
f 396 472 473
f 396 474 472
f 520 416 439
f 460 476 475
f 476 432 475
f 432 512 454
f 477 454 512
f 454 477 513
f 569 598 478
f 443 479 389
f 527 491 480
f 528 480 481
f 481 482 528
f 492 482 481
f 534 483 463
f 535 463 484
f 446 498 587
f 450 485 544
f 485 363 486
f 450 363 485
f 487 458 392
f 449 458 394
f 419 508 452
f 548 460 452
f 474 519 472
f 519 488 546
f 503 488 429
f 503 470 514
f 416 521 505
f 489 441 521
f 490 418 489
f 508 430 533
f 533 418 490
f 548 476 460
f 476 512 432
f 525 478 526
f 491 527 443
f 492 516 482
f 492 493 516
f 545 494 468
f 550 425 461
f 495 496 497
f 498 496 543
f 543 587 498
f 406 457 499
f 406 499 427
f 499 436 427
f 500 468 501
f 448 501 459
f 582 393 451
f 502 546 488
f 536 503 514
f 531 439 504
f 504 473 532
f 531 504 532
f 521 416 520
f 505 521 441
f 506 490 489
f 548 510 476
f 513 477 507
f 526 478 598
f 535 534 463
f 494 542 535
f 426 425 550
f 495 497 465
f 552 449 393
f 452 508 554
f 502 488 509
f 578 533 490
f 510 511 476
f 511 512 476
f 507 477 512
f 507 461 513
f 514 417 536
f 567 515 417
f 569 389 479
f 534 516 493
f 480 528 527
f 543 496 495
f 637 457 517
f 436 499 518
f 519 547 472
f 546 547 519
f 439 573 520
f 473 472 606
f 489 521 506
f 508 533 522
f 523 461 507
f 567 442 579
f 442 524 579
f 524 525 526
f 538 443 527
f 549 528 482
f 541 534 535
f 545 542 494
f 523 550 461
f 612 435 587
f 681 544 485
f 518 467 436
f 529 485 486
f 530 545 468
f 562 452 554
f 562 548 452
f 546 502 509
f 509 488 503
f 573 439 531
f 473 606 532
f 520 573 574
f 576 520 574
f 522 533 578
f 515 536 417
f 559 524 526
f 541 516 534
f 541 482 516
f 541 549 482
f 542 541 535
f 637 499 457
f 551 458 449
f 449 552 551
f 562 554 563
f 592 606 472
f 547 592 472
f 583 503 536
f 553 531 532
f 521 520 576
f 565 510 548
f 557 511 510
f 512 511 537
f 537 507 512
f 599 479 443
f 599 443 538
f 539 538 527
f 527 528 539
f 540 541 542
f 550 465 426
f 622 543 495
f 624 637 517
f 681 451 544
f 585 545 530
f 468 500 530
f 501 448 561
f 588 448 458
f 546 589 547
f 548 562 565
f 510 565 557
f 559 526 598
f 549 539 528
f 555 549 541
f 545 540 542
f 555 541 540
f 616 550 523
f 551 588 458
f 501 561 500
f 552 582 551
f 582 552 393
f 592 547 571
f 509 503 583
f 553 573 531
f 521 576 506
f 506 576 608
f 554 508 522
f 537 523 507
f 479 568 569
f 538 539 556
f 539 555 556
f 555 539 549
f 540 556 555
f 545 586 540
f 586 545 585
f 550 601 465
f 603 495 465
f 622 621 543
f 621 587 543
f 675 612 587
f 546 509 590
f 626 583 536
f 553 572 573
f 557 558 511
f 536 515 627
f 579 524 580
f 524 559 580
f 597 559 598
f 540 586 556
f 601 550 616
f 570 499 637
f 529 681 485
f 644 585 530
f 560 530 500
f 560 500 645
f 588 561 448
f 672 592 571
f 589 571 547
f 627 626 536
f 574 573 678
f 608 490 506
f 611 562 563
f 564 565 562
f 557 565 566
f 537 511 558
f 515 567 584
f 596 598 569
f 568 596 569
f 599 568 479
f 538 556 666
f 586 666 556
f 603 465 601
f 603 622 495
f 570 518 499
f 560 644 530
f 561 645 500
f 605 588 551
f 647 571 589
f 572 678 573
f 574 575 576
f 608 576 607
f 522 577 554
f 578 610 522
f 611 564 562
f 557 566 558
f 674 523 537
f 674 616 523
f 579 584 567
f 580 559 597
f 617 599 538
f 659 570 637
f 638 467 518
f 613 551 582
f 581 613 582
f 581 582 451
f 581 451 681
f 583 591 509
f 678 575 574
f 578 490 610
f 565 564 594
f 594 566 565
f 584 579 634
f 579 580 634
f 617 538 666
f 585 644 586
f 621 658 587
f 658 675 587
f 570 638 518
f 639 561 588
f 647 672 571
f 546 590 589
f 590 509 591
f 553 629 572
f 532 606 614
f 606 592 661
f 522 593 577
f 566 594 558
f 558 594 595
f 537 558 674
f 515 632 627
f 596 597 598
f 617 568 599
f 600 666 586
f 601 616 602
f 602 603 601
f 604 605 551
f 554 577 563
f 631 563 577
f 589 590 647
f 606 661 614
f 607 576 575
f 490 608 609
f 610 593 522
f 664 610 490
f 563 631 611
f 611 630 564
f 630 594 564
f 584 632 515
f 600 586 644
f 435 612 680
f 637 624 660
f 529 486 467
f 560 645 618
f 613 604 551
f 591 583 626
f 532 614 553
f 609 664 490
f 674 558 654
f 615 616 674
f 691 596 568
f 691 568 617
f 615 602 616
f 675 680 612
f 435 680 624
f 529 719 681
f 644 560 618
f 646 618 645
f 672 661 592
f 572 629 678
f 607 575 640
f 630 611 631
f 630 595 594
f 619 558 595
f 619 654 558
f 635 580 597
f 620 622 603
f 620 621 622
f 623 660 624
f 652 561 639
f 647 590 625
f 648 626 627
f 632 694 627
f 614 628 553
f 553 628 629
f 607 640 682
f 630 631 649
f 595 630 649
f 694 632 584
f 633 634 580
f 635 597 636
f 597 596 636
f 716 596 691
f 691 617 717
f 600 655 666
f 602 620 603
f 659 637 660
f 638 570 667
f 652 645 561
f 639 588 686
f 625 671 647
f 590 591 625
f 705 591 626
f 575 678 640
f 682 608 607
f 609 608 695
f 593 631 577
f 641 593 610
f 610 664 641
f 651 654 619
f 617 666 642
f 643 600 644
f 623 624 680
f 644 618 643
f 645 652 646
f 588 605 686
f 613 581 681
f 672 647 671
f 627 694 648
f 678 629 679
f 670 628 614
f 661 670 614
f 593 641 631
f 595 649 619
f 650 651 619
f 650 641 651
f 688 651 641
f 688 665 651
f 665 654 651
f 633 580 635
f 636 596 716
f 600 643 655
f 621 620 657
f 699 467 638
f 699 529 467
f 669 652 639
f 648 705 626
f 682 695 608
f 631 641 650
f 649 631 650
f 688 641 664
f 650 619 649
f 653 654 665
f 655 656 666
f 621 657 718
f 718 658 621
f 718 675 658
f 659 660 692
f 692 570 659
f 529 699 719
f 686 605 604
f 661 672 702
f 662 625 591
f 629 628 679
f 663 609 695
f 663 664 609
f 653 665 688
f 653 674 654
f 653 689 674
f 707 584 634
f 685 717 617
f 666 656 642
f 696 602 615
f 718 710 675
f 570 692 667
f 667 699 638
f 668 618 646
f 646 652 668
f 639 686 669
f 725 613 681
f 670 661 702
f 671 703 672
f 591 705 662
f 673 694 584
f 689 615 674
f 685 617 642
f 710 680 675
f 676 681 719
f 677 686 604
f 702 672 703
f 678 679 640
f 663 688 664
f 615 689 696
f 707 673 584
f 633 707 634
f 623 680 712
f 725 681 676
f 692 660 623
f 670 767 628
f 695 682 683
f 688 722 727
f 727 653 688
f 633 684 707
f 642 656 685
f 620 602 730
f 657 620 730
f 686 677 732
f 648 713 705
f 679 628 767
f 679 687 640
f 682 640 687
f 759 663 695
f 688 663 722
f 715 689 653
f 697 633 635
f 690 716 691
f 690 691 717
f 655 765 656
f 756 602 696
f 602 756 730
f 623 712 692
f 719 699 700
f 693 748 671
f 693 671 625
f 704 625 662
f 713 648 694
f 679 743 687
f 683 759 695
f 689 715 696
f 708 635 636
f 635 708 697
f 655 643 698
f 730 709 657
f 724 667 692
f 699 667 700
f 643 618 698
f 701 668 652
f 701 652 669
f 758 670 702
f 671 748 703
f 702 703 758
f 625 704 693
f 705 713 706
f 679 767 743
f 750 683 682
f 715 653 727
f 684 673 707
f 708 636 716
f 723 690 717
f 655 698 765
f 709 718 657
f 680 710 783
f 712 680 783
f 783 711 712
f 604 613 725
f 706 662 705
f 694 673 713
f 714 696 715
f 763 684 633
f 708 716 690
f 685 723 717
f 788 656 765
f 709 731 718
f 731 710 718
f 782 783 710
f 741 676 719
f 700 741 719
f 720 618 668
f 668 701 720
f 746 701 669
f 733 677 604
f 758 703 748
f 704 662 721
f 706 721 662
f 774 767 670
f 759 760 663
f 760 722 663
f 714 756 696
f 771 763 633
f 771 633 697
f 685 754 723
f 740 676 741
f 734 724 692
f 700 724 757
f 724 700 667
f 741 700 757
f 720 698 618
f 732 669 686
f 676 733 725
f 758 775 670
f 693 704 726
f 750 682 687
f 760 727 722
f 770 673 684
f 685 656 754
f 656 788 728
f 755 730 756
f 755 729 730
f 729 709 730
f 782 710 731
f 692 712 734
f 677 733 732
f 746 669 732
f 733 604 725
f 745 684 763
f 737 697 708
f 724 734 815
f 742 701 746
f 774 670 775
f 721 726 704
f 798 706 713
f 799 713 673
f 735 759 683
f 683 750 735
f 736 715 727
f 697 737 771
f 738 708 690
f 738 690 723
f 739 740 741
f 757 739 741
f 698 720 764
f 742 720 701
f 809 693 726
f 713 799 798
f 770 799 673
f 749 687 743
f 749 743 744
f 745 770 684
f 723 754 738
f 764 765 698
f 793 815 734
f 773 742 746
f 747 732 733
f 773 746 732
f 676 740 733
f 809 748 693
f 797 726 721
f 767 744 743
f 749 750 687
f 751 727 760
f 752 756 714
f 737 753 771
f 708 738 737
f 728 754 656
f 755 756 761
f 729 731 709
f 724 815 757
f 758 795 775
f 758 748 795
f 706 797 721
f 759 735 760
f 751 736 727
f 715 768 752
f 752 714 715
f 756 752 761
f 762 745 763
f 762 763 771
f 764 788 765
f 761 729 755
f 823 712 711
f 739 802 740
f 740 766 733
f 744 767 774
f 736 768 715
f 745 769 770
f 762 835 745
f 753 762 771
f 778 762 753
f 761 790 729
f 729 790 780
f 780 731 729
f 839 734 712
f 839 793 734
f 849 739 757
f 849 772 739
f 747 733 766
f 817 773 732
f 819 774 775
f 795 819 775
f 726 797 796
f 769 799 770
f 774 819 804
f 804 744 774
f 778 753 737
f 786 738 754
f 754 728 807
f 779 788 764
f 782 731 780
f 783 782 792
f 839 712 823
f 849 757 815
f 850 764 720
f 742 784 720
f 764 850 779
f 816 742 773
f 817 732 747
f 740 802 766
f 726 796 809
f 810 797 706
f 828 798 799
f 776 749 744
f 737 777 778
f 737 738 777
f 788 779 837
f 780 781 782
f 800 711 783
f 784 850 720
f 810 706 798
f 785 750 749
f 785 735 750
f 760 735 805
f 768 736 751
f 761 752 811
f 812 769 745
f 812 745 835
f 786 777 738
f 787 786 754
f 754 807 787
f 818 728 788
f 837 818 788
f 789 790 761
f 789 791 790
f 782 781 792
f 800 823 711
f 815 793 848
f 742 816 794
f 795 748 809
f 796 797 840
f 828 810 798
f 828 799 769
f 805 751 760
f 811 752 768
f 777 786 822
f 814 807 728
f 728 818 814
f 761 811 789
f 783 792 800
f 794 784 742
f 801 766 802
f 816 773 817
f 809 803 795
f 820 744 804
f 805 768 751
f 806 811 768
f 762 778 835
f 822 786 787
f 807 873 787
f 791 780 790
f 808 793 839
f 852 809 796
f 796 840 852
f 840 797 810
f 776 785 749
f 859 735 785
f 859 805 735
f 834 811 806
f 812 843 769
f 777 821 778
f 813 873 807
f 813 807 814
f 781 780 791
f 792 781 847
f 849 815 848
f 794 816 877
f 766 801 817
f 817 747 766
f 816 817 877
f 772 825 739
f 827 810 828
f 768 805 806
f 828 769 843
f 814 818 837
f 850 837 779
f 847 800 792
f 793 808 848
f 825 832 739
f 832 802 739
f 832 801 802
f 829 819 795
f 870 795 803
f 809 852 803
f 872 820 804
f 872 804 819
f 776 744 820
f 859 842 805
f 805 830 806
f 856 811 834
f 835 778 821
f 846 821 777
f 846 777 822
f 787 873 822
f 823 800 824
f 825 772 849
f 826 817 801
f 870 829 795
f 827 840 810
f 889 827 828
f 829 872 819
f 785 776 853
f 805 842 830
f 789 811 856
f 857 822 873
f 814 873 813
f 885 847 781
f 848 831 849
f 832 868 801
f 868 826 801
f 827 841 840
f 853 859 785
f 833 830 842
f 806 830 834
f 844 843 812
f 845 812 835
f 845 835 821
f 822 857 846
f 836 837 850
f 791 789 861
f 858 781 791
f 800 847 824
f 824 838 823
f 839 823 838
f 838 808 839
f 826 877 817
f 840 841 878
f 859 880 842
f 880 833 842
f 856 861 789
f 843 889 828
f 844 812 845
f 846 891 821
f 874 873 814
f 836 814 837
f 791 861 858
f 847 884 824
f 886 848 808
f 849 831 825
f 836 850 876
f 850 784 876
f 784 794 876
f 832 851 868
f 851 832 825
f 840 878 852
f 879 853 776
f 834 830 854
f 855 834 854
f 834 855 856
f 855 861 856
f 891 912 821
f 857 891 846
f 873 864 857
f 858 885 781
f 884 847 885
f 848 886 831
f 876 794 877
f 895 803 852
f 852 878 895
f 871 879 776
f 853 894 859
f 860 830 833
f 860 854 830
f 904 861 855
f 845 821 912
f 881 873 874
f 861 904 858
f 884 883 838
f 824 884 838
f 808 838 886
f 862 877 826
f 868 862 826
f 851 825 866
f 889 841 827
f 871 776 820
f 859 894 880
f 857 863 891
f 863 857 864
f 865 814 836
f 883 919 838
f 831 901 867
f 825 867 866
f 867 825 831
f 875 836 876
f 868 903 869
f 862 868 869
f 939 829 870
f 871 820 872
f 881 864 873
f 865 874 814
f 875 865 836
f 882 858 904
f 838 900 886
f 831 900 901
f 862 902 876
f 862 876 877
f 902 875 876
f 851 903 868
f 908 878 841
f 888 879 871
f 893 853 879
f 962 893 879
f 893 894 853
f 938 880 894
f 908 841 889
f 926 833 880
f 904 855 854
f 905 891 863
f 865 881 874
f 858 882 885
f 914 883 885
f 883 884 885
f 838 919 900
f 900 831 886
f 866 903 851
f 803 895 887
f 872 923 871
f 879 888 962
f 909 908 889
f 911 909 843
f 909 889 843
f 880 938 926
f 833 926 933
f 833 933 860
f 933 854 860
f 843 844 911
f 890 844 845
f 891 897 912
f 914 885 882
f 892 866 867
f 867 901 892
f 903 866 892
f 829 923 872
f 893 938 894
f 803 887 870
f 887 895 907
f 933 896 854
f 896 904 854
f 905 897 891
f 898 864 881
f 906 881 865
f 919 899 900
f 899 901 900
f 901 899 931
f 931 892 901
f 902 862 915
f 946 869 903
f 920 903 892
f 946 862 869
f 910 904 896
f 904 928 882
f 863 916 905
f 864 916 863
f 906 898 881
f 946 915 862
f 949 875 902
f 903 920 946
f 962 913 893
f 907 895 878
f 908 909 925
f 904 910 928
f 844 934 911
f 912 890 845
f 897 890 912
f 929 897 905
f 951 898 906
f 865 949 906
f 865 875 949
f 953 883 914
f 883 918 919
f 924 923 829
f 924 829 939
f 871 923 922
f 893 913 938
f 878 908 907
f 911 925 909
f 927 933 926
f 934 844 890
f 905 916 929
f 914 882 917
f 899 919 944
f 892 931 920
f 921 902 915
f 888 871 922
f 887 939 870
f 896 933 963
f 928 930 882
f 935 890 897
f 935 897 929
f 864 898 916
f 952 951 906
f 952 906 949
f 953 914 917
f 918 883 953
f 918 944 919
f 931 937 920
f 921 949 902
f 922 923 954
f 960 924 939
f 907 985 887
f 976 908 925
f 966 926 938
f 927 926 966
f 930 928 910
f 936 929 916
f 916 951 950
f 951 916 898
f 930 917 882
f 948 931 899
f 971 915 946
f 920 937 946
f 954 923 924
f 922 962 888
f 974 938 913
f 932 925 911
f 911 934 942
f 933 927 963
f 941 910 896
f 992 934 890
f 968 935 929
f 916 950 936
f 930 959 917
f 959 953 917
f 931 948 937
f 971 921 915
f 974 966 938
f 939 887 960
f 976 907 908
f 932 976 925
f 896 963 941
f 940 941 963
f 941 930 910
f 992 942 934
f 992 890 935
f 955 968 929
f 936 955 929
f 950 956 936
f 943 952 949
f 918 969 944
f 969 947 944
f 937 948 945
f 937 970 946
f 947 899 944
f 899 947 948
f 943 949 921
f 921 971 943
f 946 970 971
f 985 960 887
f 942 932 911
f 966 1002 927
f 958 950 951
f 952 958 951
f 918 953 969
f 948 947 945
f 991 922 954
f 962 922 973
f 988 955 936
f 964 956 950
f 952 957 958
f 953 959 980
f 980 969 953
f 924 960 961
f 991 973 922
f 961 954 924
f 913 962 975
f 973 975 962
f 975 974 913
f 999 976 932
f 966 1010 1002
f 1002 977 927
f 977 963 927
f 977 940 963
f 930 978 959
f 968 992 935
f 956 988 936
f 958 964 950
f 964 958 995
f 995 958 957
f 952 943 957
f 947 969 984
f 984 983 947
f 983 945 947
f 937 945 970
f 989 971 970
f 942 965 932
f 992 986 942
f 1010 966 974
f 941 967 978
f 978 930 941
f 978 967 979
f 1019 968 955
f 1019 955 988
f 959 978 980
f 969 980 984
f 970 945 989
f 971 972 943
f 971 989 972
f 975 973 998
f 1010 974 975
f 1027 985 907
f 999 907 976
f 999 932 1001
f 1023 940 977
f 987 967 941
f 979 967 1003
f 978 979 1005
f 1005 980 978
f 996 988 956
f 981 956 964
f 964 995 982
f 943 990 957
f 1005 1009 980
f 1006 984 1009
f 980 1009 984
f 1006 983 984
f 943 972 990
f 1036 954 961
f 1027 961 960
f 1027 960 985
f 1001 932 965
f 986 965 942
f 940 1023 987
f 941 940 987
f 967 987 1003
f 1041 992 968
f 1019 988 996
f 957 990 995
f 1008 972 989
f 945 983 989
f 990 972 1008
f 1036 991 954
f 1036 1038 991
f 1038 973 991
f 1038 998 973
f 986 992 1041
f 993 1009 1005
f 993 994 1009
f 1004 982 995
f 997 1004 995
f 997 990 1008
f 981 996 956
f 982 981 964
f 990 997 995
f 1007 989 1006
f 983 1006 989
f 989 1007 1008
f 975 998 1020
f 1020 1010 975
f 907 1045 1027
f 907 999 1045
f 1000 999 1001
f 977 1002 1023
f 987 1023 1003
f 1004 1017 982
f 979 1003 1025
f 1025 1024 979
f 993 979 1024
f 979 993 1005
f 1006 994 1007
f 1007 1015 997
f 1008 1007 997
f 1019 1041 968
f 1006 1009 994
f 998 1038 1037
f 1037 1020 998
f 1027 1028 961
f 965 986 1001
f 1021 1002 1010
f 1011 1025 1003
f 1017 1034 982
f 981 982 1034
f 1024 994 993
f 1014 1016 1012
f 1013 1014 1012
f 1015 1013 1012
f 1012 1016 1017
f 1012 1017 1004
f 997 1012 1004
f 997 1015 1012
f 1024 1013 994
f 994 1013 1015
f 1007 994 1015
f 1018 1019 996
f 1010 1020 1021
f 1022 1045 999
f 961 1028 1036
f 1022 999 1000
f 1002 1021 1030
f 1030 1023 1002
f 1003 1023 1031
f 1011 1003 1031
f 1034 1046 981
f 1024 1025 1035
f 1024 1035 1014
f 1013 1024 1014
f 1018 1041 1019
f 1046 1018 996
f 996 981 1046
f 1020 1037 1039
f 1020 1026 1021
f 1027 1045 1028
f 1029 1036 1028
f 1023 1030 1031
f 1032 1016 1014
f 1017 1033 1034
f 1016 1033 1017
f 1011 1035 1025
f 1038 1036 1051
f 1037 1038 1051
f 1039 1037 1051
f 1026 1020 1039
f 1051 1036 1029
f 1050 1022 1000
f 1000 1001 1050
f 986 1050 1001
f 1040 1041 1018
f 1018 1046 1040
f 1042 1030 1026
f 1026 1030 1021
f 1031 1030 1047
f 1011 1031 1047
f 1011 1047 1035
f 1046 1034 1043
f 1034 1033 1043
f 1014 1035 1032
f 1016 1032 1033
f 1028 1044 1029
f 1044 1028 1045
f 1045 1022 1044
f 986 1053 1050
f 1055 1053 986
f 986 1041 1055
f 1041 1040 1055
f 1046 1043 1040
f 1042 1047 1030
f 1035 1047 1048
f 1048 1057 1035
f 1043 1033 1049
f 1033 1032 1049
f 1057 1032 1035
f 1059 1044 1022
f 1022 1053 1059
f 1022 1050 1053
f 1060 1051 1029
f 1051 1060 1039
f 1026 1039 1065
f 1026 1065 1042
f 1052 1053 1055
f 1052 1055 1054
f 1055 1040 1054
f 1040 1043 1054
f 1047 1042 1056
f 1048 1047 1056
f 1043 1049 1054
f 1032 1057 1049
f 1029 1044 1058
f 1058 1044 1059
f 1061 1058 1059
f 1061 1059 1053
f 1058 1060 1029
f 1065 1039 1060
f 1065 1056 1042
f 1052 1061 1053
f 1061 1052 1062
f 1052 1054 1062
f 1064 1062 1054
f 1066 1064 1063
f 1054 1049 1064
f 1048 1056 1063
f 1057 1048 1063
f 1049 1063 1064
f 1063 1049 1057
f 1066 1060 1058
f 1061 1066 1058
f 1065 1060 1066
f 1066 1056 1065
f 1063 1056 1066
f 1066 1061 1062
f 1064 1066 1062
# 2097 faces, 0 coords texture

# End of File
