# PIPER geometrical reference model based on a manual segmentation. See the
# documentation for more info.
# Author: CEESAR, SOTON, UCBL-Ifsttar
# Version: 1.0.0
# License: Creative Commons Attribution 4.0 International License.
# (https://creativecommons.org/licenses/by/4.0/)
# 
# This work has received funding from the European Union Seventh Framework
# Program ([FP7/2007-2013]) under grant agreement 605544 [PIPER project]).
# Contributors include Pierre Maillez, Christophe Lecomte (SOTON), Erwan
# Jolivet (CEESAR), Philippe Beillas (UCBL-Ifsttar)
# This work is derived from a CT scan provided by CEESAR under a CCBY-4.0
# License
# 
# wavefront obj file written by the visualization toolkit

mtllib C:/desktop/registration_reference_model/22_REF_LTE635_Assembly_hands_corr/CCTu635_BP165_Cuboid_R.mtl

v -13.385 122.881 -1703.06
v -15.863 127.106 -1701.14
v -15.323 124.59 -1701.9
v -13.835 124.245 -1701.99
v -18.199 130.378 -1704.51
v -13.335 127.799 -1700.74
v -14.835 128.597 -1701.04
v -12.84 130.453 -1701.44
v -10.889 126.496 -1701.64
v -9.69401 129.675 -1701.38
v -9.14301 128.183 -1700.87
v -4.26001 127.846 -1699.15
v -8.61401 125.759 -1702.47
v -2.33901 125.839 -1700.3
v -5.61601 126.019 -1701.65
v -3.33701 129.653 -1698.5
v -5.15901 131.001 -1699.72
v -4.51201 134.503 -1697.92
v -6.74301 129.246 -1699.86
v -6.40301 132.434 -1701.54
v -16.473 124.028 -1703.26
v -14.947 122.36 -1703.43
v -14.846 122.289 -1705.56
v -16.459 124.225 -1705.97
v -14.767 124.664 -1708.82
v -13.501 121.761 -1705.63
v -10.535 123.952 -1703.92
v -6.87501 124.123 -1704.31
v -9.93601 122.667 -1706.43
v -6.90401 122.829 -1707.03
v -4.03701 123.248 -1705.88
v -4.82901 122.331 -1708.7
v -12.962 121.569 -1707.89
v -10.245 121.808 -1710.57
v -8.75101 121.929 -1711.4
v -8.82701 121.741 -1709.84
v -6.05401 121.424 -1711.07
v -3.60701 121.462 -1713.7
v -18.806 130.037 -1705.68
v -18.414 127.779 -1703.82
v -18.204 127.028 -1706.2
v -18.517 130.011 -1706.96
v -17.252 128.344 -1708.21
v -16.445 132.162 -1704.93
v -16.019 134.716 -1708.44
v -13.473 130.34 -1711.83
v -17.445 132.611 -1709.23
v -15.782 128.357 -1709.64
v -15.386 133.225 -1711.29
v -16.111 134.206 -1710.4
v -8.35401 131.843 -1703.01
v -12.386 134.034 -1705.09
v -8.19801 133.788 -1703.71
v -6.54801 136.466 -1702.68
v -11.967 127.532 -1712
v 3.38999 123.21 -1702.1
v -0.154012 131.861 -1696.88
v -2.69001 133.998 -1696.63
v 0.747988 134.917 -1696.8
v -0.397011 126.368 -1698.02
v 0.975989 128.546 -1698.51
v 1.67799 125.234 -1699.4
v -0.773011 129.458 -1697.63
v 1.03899 124.613 -1699.9
v -2.45401 124.337 -1702.8
v 4.79899 123.995 -1702.84
v 4.04299 128.545 -1701.87
v 2.37099 133.452 -1697.66
v 3.64299 131.709 -1700.3
v 4.99799 131.711 -1703.62
v -1.12301 123.179 -1705.06
v -2.00701 122.64 -1707.44
v 1.10299 122.341 -1706.66
v 1.79599 123.297 -1702.51
v 4.78099 121.816 -1704.16
v 5.80299 126.759 -1704.08
v 4.31199 121.026 -1709.84
v 5.86499 121.577 -1707.85
v -1.13101 122.072 -1710.94
v 6.20799 122.769 -1705.84
v 6.53099 122.158 -1710.52
v 6.93699 123.886 -1711.31
v 7.01899 127.479 -1708.86
v 7.26899 132.365 -1709.55
v 8.80299 136.146 -1713.15
v -5.11401 135.871 -1700.63
v -2.16301 136.95 -1699.26
v -14.121 137.562 -1708.18
v -14.498 137.985 -1709.67
v -14.486 137.492 -1712.93
v -10.873 134.762 -1705.05
v -9.00301 136.013 -1704.36
v -11.249 137.512 -1705.52
v -14.454 135.204 -1706.98
v -8.14301 137.534 -1704.84
v -9.73101 138.636 -1707.58
v -4.62401 137.571 -1701.89
v -3.76101 138.772 -1703.1
v -7.70501 139.007 -1707.02
v -13.779 139.045 -1709.97
v -11.377 139.195 -1711.72
v -8.51501 139.472 -1712.54
v -5.82201 140.011 -1707.54
v -4.10701 141.367 -1709.57
v -5.57501 141.421 -1713.01
v -2.90701 141.903 -1710.47
v -0.990013 143.665 -1713.18
v -2.40901 135.749 -1697
v 2.68899 135.6 -1698.97
v 0.668988 136.413 -1698.01
v 1.81899 138.626 -1701.4
v 0.227988 139.05 -1701.61
v 3.73299 134.521 -1700.12
v 3.08699 137.929 -1701.67
v -3.18601 139.928 -1705.78
v 5.49999 136.357 -1705.8
v 3.94699 138.216 -1703.23
v -1.96401 140.591 -1707.39
v 4.44499 140.415 -1704.69
v 2.97399 141.851 -1703.85
v 1.82899 141.688 -1704.05
v 7.45399 136.961 -1710.21
v 6.67199 140.286 -1709.18
v -0.493012 142.377 -1709.98
v 0.552988 142.076 -1708.05
v 2.84099 143.649 -1710.79
v 4.90499 143.255 -1706.6
v 5.39699 144.255 -1709.84
v 7.06499 143.762 -1711.31
v 8.30699 141.607 -1712.3
v -6.02201 121.506 -1713.6
v -5.11301 121.446 -1715.36
v -2.91201 120.885 -1719.68
v -5.01401 123.443 -1719.26
v -4.15301 121.983 -1719.73
v -8.71101 123.781 -1712.77
v -10.752 131.192 -1714.87
v -8.31601 126.855 -1714.06
v -6.82301 122.599 -1713.96
v -5.88401 123.095 -1715.57
v -7.44501 128.215 -1715.84
v -6.00901 125.291 -1717.97
v -6.55701 127.532 -1717.11
v -11.89 133.291 -1714.99
v -9.51101 131.988 -1717.19
v -9.56901 133.917 -1718.27
v -6.58201 127.095 -1719.94
v -7.99801 130.409 -1719.48
v -6.27701 125.892 -1723.18
v -5.46801 125.657 -1724.77
v -7.63501 130.002 -1722.64
v -8.13301 131.922 -1721.74
v -6.70201 132.362 -1724.25
v -4.69701 122.644 -1723.26
v -4.01901 129.433 -1726.92
v -4.04501 124.664 -1726.18
v -5.28401 128.797 -1725.95
v -3.44001 126.55 -1727.26
v -1.57001 131.415 -1726.25
v -0.177011 121.601 -1713.65
v 3.41299 120.058 -1715.4
v -3.14101 120.721 -1717.55
v 1.12799 120.312 -1717.24
v 4.36599 120.236 -1714.71
v 6.66699 122.303 -1714.55
v 3.19899 120.633 -1719.16
v 5.69899 120.897 -1714.44
v 0.59099 118.723 -1721.84
v -1.75801 119.191 -1721.42
v -1.11701 120.249 -1719.13
v 0.949989 119.979 -1719.34
v -3.02101 120.167 -1722.61
v -1.43901 119.197 -1723.05
v 4.64899 121.646 -1720.07
v 3.63399 120.657 -1721.78
v 4.06099 121.517 -1723.53
v 8.56899 126.344 -1719.25
v 6.65099 124.524 -1721.45
v 5.63299 124.633 -1723.46
v 7.32299 125.976 -1710.92
v 7.95399 126.227 -1714.71
v 8.49599 129.52 -1713.86
v 10.101 133.958 -1716.76
v 10.085 131.288 -1717.82
v 9.73299 129.338 -1718.38
v 8.95799 127.157 -1722.67
v 11.614 129.984 -1725.44
v 11.277 130.321 -1722.34
v 12.017 132.332 -1722.27
v -0.936011 121.265 -1725.42
v 2.42199 121.018 -1724.25
v -2.55201 121.55 -1725.62
v 3.72999 122.797 -1724.96
v 1.36799 125.66 -1726.74
v 1.33099 128.461 -1726.44
v -1.11101 124.31 -1727.11
v -1.30401 126.759 -1727.35
v 4.37399 127.275 -1725.5
v 3.65099 129.045 -1726.25
v 6.63999 126.226 -1723.63
v 5.74399 127.858 -1725.62
v 1.46699 130.61 -1726.54
v 0.286988 132.313 -1726.21
v -4.65801 132.848 -1725.12
v 3.63499 131.816 -1727.56
v 2.05899 135.031 -1727.23
v 5.80199 129.784 -1727.3
v 8.86899 135.272 -1727.39
v 7.17299 131.259 -1729.73
v 5.52399 135.91 -1729.56
v 8.80499 128.943 -1727.36
v 8.99799 127.778 -1724.53
v 11.322 129.833 -1726.62
v 12.048 132.456 -1726.39
v 13.354 133.412 -1725.21
v -13.803 136.529 -1714.18
v -10.737 135.847 -1717.32
v -11.012 137.656 -1717.01
v -11.895 138.796 -1714.37
v -10.097 139.48 -1714.65
v -9.11501 138.553 -1719.55
v -10.193 139.374 -1716.68
v -7.04401 142.884 -1717.91
v -7.57301 142.14 -1719.03
v -6.75501 142.199 -1715.94
v -9.03601 135.138 -1719.9
v -7.62501 135.451 -1722.62
v -4.70701 136.105 -1724.06
v -6.59001 141.508 -1721.33
v -7.20801 137.983 -1722.48
v -3.12001 146.14 -1722.55
v -3.01001 144.226 -1723.65
v -4.30201 145.01 -1718.19
v -4.00301 145.538 -1720.01
v -3.65701 141.561 -1723.57
v 5.70799 145.541 -1712.48
v 6.07699 144.196 -1724.29
v 10.169 137.795 -1715.86
v 9.04599 139.617 -1713.33
v 10.453 142.746 -1715.38
v 11.491 141.74 -1717.19
v 11.194 144.531 -1718.62
v 10.345 144.723 -1716.09
v 11.422 137.491 -1718.84
v 12.562 134.709 -1722.7
v 12.793 139.243 -1721.66
v 13.095 139.102 -1723.31
v 11.864 141.559 -1720.47
v 10.746 143.18 -1721.59
v 9.67499 143.795 -1722.38
v -2.20001 145.752 -1717.36
v 6.22499 146.79 -1713.94
v 3.50999 148.674 -1717.09
v 5.73999 149.064 -1716.38
v 7.68699 149.257 -1716.46
v 9.04899 149.931 -1717.83
v -1.93501 147.336 -1719.56
v -0.047013 149.721 -1722.78
v 1.59499 149.93 -1723.63
v 6.20199 150.575 -1719.18
v 5.70199 148.076 -1721.92
v 3.35399 150.626 -1721.63
v 2.24399 150.227 -1719.73
v 5.53999 151.537 -1718.02
v 2.67199 150.941 -1721.31
v 8.37699 146.996 -1715.62
v 9.89099 147.515 -1718.07
v 9.43299 147.318 -1720.1
v -2.43601 134.76 -1725.16
v -0.665012 137.773 -1725.24
v 2.02699 138.589 -1727.45
v 7.07799 138.987 -1727.05
v 3.81199 139.517 -1728.37
v 5.14599 140.118 -1728.36
v -0.148012 142.514 -1726.19
v 0.136987 145.693 -1727.47
v 2.69799 144.006 -1729.43
v 7.52899 141.379 -1725.32
v 5.07699 142.263 -1727.76
v 2.09499 142.033 -1727.95
v 5.92399 142.602 -1726.06
v 5.01099 134.667 -1729.69
v 4.04399 141.881 -1728.78
v 3.59999 144.132 -1729.44
v 12.609 135.731 -1725.03
v 11.919 134.371 -1726.03
v 9.09199 142.462 -1723.63
v 9.47499 138.651 -1725.59
v 12.363 139.441 -1724.11
v -1.47201 146.767 -1725.39
v -0.203013 148.183 -1726.24
v -0.178013 149.368 -1724.6
v 3.44599 147.665 -1724.4
v 1.28699 146.444 -1728.34
v 2.66199 146.715 -1726.62
vn 0.264269 -0.740136 0.618353
vn -0.473675 -0.0711359 0.877822
vn -0.331409 -0.435684 0.836868
vn 0.0954805 -0.486104 0.868669
vn -0.714145 0.46221 0.525699
vn 0.0365134 -0.0567738 0.997719
vn -0.324157 0.33103 0.886195
vn -0.118701 0.528736 0.840445
vn 0.159433 -0.41634 0.895121
vn -0.12666 0.379504 0.916479
vn -0.339154 -0.184567 0.922448
vn -0.356267 -0.422963 0.833172
vn -0.00535582 -0.658479 0.75258
vn -0.346423 -0.768324 0.53821
vn -0.220229 -0.728385 0.64881
vn -0.417682 -0.165574 0.89338
vn -0.649596 0.102086 0.753395
vn -0.739873 0.206093 0.640401
vn -0.420877 0.183148 0.888437
vn -0.746383 0.214953 0.629847
vn -0.764192 -0.537731 0.356168
vn -0.333167 -0.841461 0.425374
vn -0.595973 -0.792975 -0.126517
vn -0.774627 -0.57237 -0.268971
vn -0.634014 -0.436339 -0.638463
vn 0.00789311 -0.98181 0.189702
vn 0.255675 -0.755958 0.602626
vn -0.0145132 -0.846903 0.531549
vn 0.186849 -0.907851 0.375359
vn 0.0557133 -0.930754 0.361375
vn -0.0620617 -0.936093 0.346233
vn 0.0429889 -0.95452 0.295033
vn -0.299333 -0.924103 -0.237556
vn -0.309572 -0.814372 -0.49088
vn -0.32364 -0.839593 -0.436281
vn 0.0235097 -0.994147 0.105442
vn -0.0111646 -0.991193 0.131957
vn 0.0150498 -0.993048 0.116741
vn -0.975727 0.205546 0.0755461
vn -0.905855 -0.11189 0.408544
vn -0.888129 -0.370128 -0.272455
vn -0.928296 -0.0394575 -0.369742
vn -0.737109 -0.267918 -0.620396
vn -0.465977 0.666297 0.582163
vn -0.805233 0.556956 0.203467
vn -0.616223 -0.287025 -0.733407
vn -0.889286 0.222903 -0.399356
vn -0.618124 -0.267514 -0.739161
vn -0.718043 -0.163117 -0.676614
vn -0.885125 0.265025 -0.382513
vn -0.333993 0.513117 0.79067
vn -0.238337 0.631809 0.737572
vn -0.52067 0.22007 0.824907
vn -0.638071 0.362112 0.679515
vn -0.556648 -0.323396 -0.765218
vn 0.249096 -0.723428 0.643897
vn 0.162996 -0.22447 0.960753
vn -0.323907 -0.0236706 0.945793
vn 0.324747 0.287507 0.901043
vn -0.0212331 -0.467309 0.883839
vn 0.571549 -0.170232 0.802716
vn 0.468931 -0.405422 0.784689
vn -0.0187498 -0.259281 0.96562
vn -0.0826649 -0.813725 0.575341
vn -0.217158 -0.8684 0.445785
vn 0.752339 -0.22318 0.61982
vn 0.79746 -0.0414648 0.601946
vn 0.67745 -0.0359467 0.73469
vn 0.855984 -0.151752 0.49423
vn 0.922583 0.0413223 0.383579
vn -0.167617 -0.938604 0.301542
vn -0.0754494 -0.97269 0.219504
vn -0.209463 -0.956482 0.203145
vn -0.216867 -0.908275 0.357779
vn 0.338443 -0.824229 0.453986
vn 0.894709 0.00674984 0.446598
vn -0.00169212 -0.990186 0.139743
vn 0.595239 -0.791571 0.138223
vn -0.0558256 -0.985952 0.157422
vn 0.897142 -0.330753 0.292811
vn 0.901221 -0.429097 0.0606396
vn 0.97162 -0.222013 0.0816372
vn 0.971442 -0.0401761 0.233852
vn 0.938182 0.00724354 0.346067
vn 0.915816 -0.0408854 0.399512
vn -0.708638 0.467447 0.528513
vn -0.274921 0.818993 0.503656
vn -0.645042 0.568124 0.511034
vn -0.840546 0.524891 0.13406
vn -0.810278 0.452071 -0.372937
vn -0.357424 0.273778 0.892913
vn -0.433405 0.239558 0.868776
vn -0.352437 0.574296 0.738899
vn -0.547904 0.516108 0.658357
vn -0.366243 0.695338 0.618361
vn -0.148161 0.943191 0.297386
vn -0.462842 0.692923 0.552843
vn -0.344869 0.822501 0.452281
vn -0.341918 0.88072 0.327757
vn -0.48224 0.868182 0.117068
vn -0.10277 0.994365 0.0259985
vn -0.322654 0.922099 0.213608
vn -0.357083 0.886574 0.294073
vn -0.287964 0.914541 0.284062
vn -0.45612 0.826495 0.329941
vn -0.280028 0.901894 0.328894
vn -0.320228 0.84232 0.433533
vn -0.259304 0.597262 0.758973
vn 0.700989 0.418156 0.57772
vn 0.248235 0.713092 0.655652
vn 0.28618 0.643859 0.70961
vn -0.111313 0.764921 0.634433
vn 0.891057 0.136568 0.432858
vn 0.665236 0.456645 0.590709
vn -0.268169 0.915476 0.299982
vn 0.914654 0.0976396 0.39227
vn 0.842483 0.252131 0.476081
vn -0.257874 0.919768 0.295852
vn 0.797774 0.217949 0.562188
vn 0.238568 0.717686 0.654226
vn -0.296436 0.854383 0.426797
vn 0.902243 0.0329976 0.429963
vn 0.882403 0.122251 0.454333
vn -0.282826 0.882318 0.376197
vn -0.38346 0.885571 0.262149
vn -0.298318 0.886881 0.352771
vn 0.425218 0.760846 0.490207
vn 0.125032 0.922989 0.363949
vn 0.710681 0.461009 0.531416
vn 0.825264 0.12271 0.551254
vn -0.348225 -0.910262 -0.223969
vn -0.525197 -0.836892 -0.15421
vn -0.567886 -0.815897 0.108709
vn -0.897865 -0.42619 -0.110457
vn -0.782118 -0.621132 -0.0498618
vn -0.579073 -0.350638 -0.736021
vn -0.646427 -0.432186 -0.628766
vn -0.631652 -0.334378 -0.699434
vn -0.687892 -0.448687 -0.570512
vn -0.841328 -0.356487 -0.406306
vn -0.757821 -0.437972 -0.483619
vn -0.947917 -0.296042 -0.117524
vn -0.913211 -0.363424 -0.184305
vn -0.709172 -0.314033 -0.631236
vn -0.783686 -0.416111 -0.461182
vn -0.855825 -0.241599 -0.457376
vn -0.932749 -0.359951 0.0203681
vn -0.908673 -0.396082 -0.132033
vn -0.917992 -0.346986 -0.19207
vn -0.815164 -0.292851 -0.499746
vn -0.931068 -0.186695 -0.313462
vn -0.934011 -0.116495 -0.337718
vn -0.681791 0.127584 -0.720335
vn -0.834124 -0.504109 -0.223854
vn -0.339124 0.213989 -0.916081
vn -0.640539 -0.346557 -0.685279
vn -0.723421 -0.0119042 -0.690305
vn -0.372073 -0.112495 -0.921361
vn -0.0623878 0.296586 -0.952966
vn -0.134925 -0.970806 0.198323
vn 0.00243103 -0.999618 0.0275451
vn -0.321235 -0.946943 0.0103665
vn -0.0643565 -0.989264 0.131209
vn 0.303587 -0.952771 0.00794683
vn 0.883407 -0.46763 -0.0302279
vn 0.397489 -0.917602 0.00317091
vn 0.632411 -0.773317 -0.0451353
vn 0.174437 -0.982936 -0.0583864
vn -0.405992 -0.890908 0.203604
vn -0.195481 -0.94409 0.265483
vn 0.0822699 -0.946785 0.311174
vn -0.697348 -0.703867 -0.135192
vn -0.222048 -0.890369 -0.397415
vn 0.692121 -0.711649 -0.120518
vn 0.632215 -0.76923 -0.0926816
vn 0.663425 -0.62831 -0.406318
vn 0.853213 -0.521428 0.011854
vn 0.746204 -0.610574 -0.265292
vn 0.73149 -0.380489 -0.565819
vn 0.973987 -0.15374 0.166474
vn 0.951859 -0.268928 0.147114
vn 0.950726 -0.146462 0.273255
vn 0.924957 -0.116565 0.361756
vn 0.926099 -0.194165 0.323483
vn 0.914342 -0.32077 0.247156
vn 0.677292 -0.719565 -0.153301
vn 0.842875 -0.533906 -0.0671259
vn 0.898117 -0.396476 0.190244
vn 0.917958 -0.264794 0.295358
vn 0.101636 -0.627544 -0.771919
vn 0.330554 -0.688798 -0.645206
vn -0.395007 -0.590933 -0.703398
vn 0.533808 -0.389434 -0.750593
vn 0.320724 -0.0981808 -0.94207
vn 0.169271 0.0404138 -0.984741
vn 0.0345766 -0.303061 -0.952344
vn 0.0970898 0.0584067 -0.99356
vn 0.326996 -0.321217 -0.888759
vn -0.0383077 -0.389556 -0.920206
vn 0.37752 -0.675206 -0.6337
vn -0.00298405 -0.673062 -0.73958
vn -0.162413 -0.109108 -0.980672
vn -0.272723 0.0925125 -0.957634
vn -0.339753 0.293041 -0.893697
vn -0.434299 -0.325246 -0.84
vn -0.578811 -0.0652742 -0.812845
vn -0.282492 -0.627917 -0.725203
vn 0.513081 0.294423 -0.806265
vn 0.0584008 -0.316094 -0.946929
vn 0.193269 0.242356 -0.950742
vn 0.204488 -0.739857 -0.640934
vn 0.497927 -0.805903 -0.320297
vn 0.709436 -0.503988 -0.492643
vn 0.668664 -0.0430728 -0.742316
vn 0.963909 -0.0433981 -0.26267
vn -0.774226 0.0149823 -0.632732
vn -0.785148 -0.108541 -0.609722
vn -0.779444 0.246985 -0.575731
vn -0.507058 0.814548 -0.281787
vn -0.425507 0.900024 0.0943449
vn -0.824401 0.255886 -0.504862
vn -0.757894 0.59532 -0.266818
vn -0.659215 0.744883 0.102883
vn -0.783331 0.554408 -0.281111
vn -0.506382 0.774983 0.378125
vn -0.887928 -0.0362293 -0.458554
vn -0.735319 0.120531 -0.666917
vn -0.391925 0.208897 -0.895967
vn -0.719593 0.368431 -0.588595
vn -0.645425 0.216927 -0.732372
vn -0.798932 0.510862 -0.317376
vn -0.700865 0.136077 -0.700194
vn -0.540235 0.782089 0.310618
vn -0.685741 0.727674 0.0158109
vn -0.484625 0.14445 -0.862712
vn 0.016592 0.81026 0.585835
vn 0.588122 0.504831 -0.631869
vn 0.900168 -0.113832 0.420403
vn 0.871993 -0.0185849 0.489165
vn 0.845031 0.121452 0.520741
vn 0.940644 0.0507555 0.335579
vn 0.944106 0.329642 0.0010352
vn 0.822187 0.344461 0.453161
vn 0.917118 -0.138659 0.373722
vn 0.961331 -0.0739709 0.265277
vn 0.970043 0.0665664 0.233635
vn 0.950634 0.233183 -0.204743
vn 0.926007 0.376572 -0.0265456
vn 0.783366 0.490512 -0.381753
vn 0.539387 0.512853 -0.667865
vn -0.422167 0.744183 0.517655
vn 0.0630359 0.719289 0.691845
vn -0.396646 0.626499 0.670948
vn -0.192201 0.623058 0.758194
vn 0.296883 0.591981 0.749279
vn 0.706496 0.70171 0.0920123
vn -0.577909 0.755466 0.308694
vn -0.53002 0.847835 -0.0159772
vn 0.134379 0.864715 -0.483952
vn 0.435771 0.723105 -0.535931
vn 0.520772 0.545123 -0.656992
vn 0.378913 0.763046 -0.523628
vn -0.493159 0.772654 0.39975
vn 0.0134182 0.958544 0.284628
vn -0.165086 0.978474 -0.123835
vn 0.623497 0.463356 0.629724
vn 0.912093 0.385063 0.140759
vn 0.687627 0.505241 -0.52144
vn -0.262954 0.193594 -0.945186
vn -0.490073 0.0415311 -0.870692
vn -0.568737 -0.045319 -0.82127
vn 0.585306 0.35333 -0.729777
vn -0.27979 0.0258305 -0.959714
vn 0.443258 0.199929 -0.873814
vn -0.675238 -0.126001 -0.726758
vn -0.723747 -0.00964536 -0.689998
vn -0.324363 -0.0803194 -0.942516
vn 0.546104 0.449686 -0.70679
vn 0.80972 0.170287 -0.561565
vn -0.547682 -0.231677 -0.803971
vn 0.72621 0.441532 -0.526942
vn -0.329765 -0.0559832 -0.942402
vn 0.193545 -0.135825 -0.971644
vn 0.46523 0.271793 -0.842431
vn 0.874215 0.179147 -0.45128
vn 0.514836 0.243291 -0.822042
vn 0.421866 0.499558 -0.756618
vn 0.439444 0.379967 -0.813949
vn 0.590559 0.427225 -0.684631
vn -0.807572 0.240813 -0.538364
vn -0.429777 0.644624 -0.632259
vn -0.427305 0.813874 -0.393726
vn 0.601116 0.571065 -0.559056
vn -0.141739 0.527165 -0.837859
vn 0.580849 0.670784 -0.461154

g grp1
usemtl mtl1
f 4//4 22//22 1//1 
f 3//3 21//21 22//22 
f 22//22 4//4 3//3 
f 40//40 21//21 2//2 
f 4//4 6//6 3//3 
f 3//3 6//6 2//2 
f 21//21 3//3 2//2 
f 2//2 5//5 40//40 
f 2//2 6//6 7//7 
f 6//6 8//8 7//7 
f 5//5 2//2 7//7 
f 5//5 7//7 44//44 
f 8//8 44//44 7//7 
f 17//17 58//58 18//18 
f 108//108 18//18 58//58 
f 9//9 6//6 4//4 
f 4//4 1//1 9//9 
f 1//1 27//27 9//9 
f 27//27 13//13 9//9 
f 13//13 11//11 9//9 
f 10//10 6//6 9//9 
f 10//10 8//8 6//6 
f 11//11 10//10 9//9 
f 19//19 10//10 11//11 
f 11//11 12//12 19//19 
f 60//60 16//16 12//12 
f 16//16 19//19 12//12 
f 19//19 16//16 17//17 
f 15//15 13//13 28//28 
f 15//15 28//28 65//65 
f 12//12 15//15 14//14 
f 15//15 65//65 14//14 
f 11//11 15//15 12//12 
f 13//13 15//15 11//11 
f 10//10 51//51 8//8 
f 58//58 17//17 16//16 
f 18//18 86//86 20//20 
f 17//17 18//18 20//20 
f 19//19 51//51 10//10 
f 51//51 19//19 17//17 
f 17//17 20//20 51//51 
f 51//51 20//20 53//53 
f 86//86 54//54 20//20 
f 22//22 23//23 26//26 
f 1//1 22//22 26//26 
f 22//22 21//21 23//23 
f 24//24 23//23 21//21 
f 33//33 26//26 23//23 
f 25//25 33//33 24//24 
f 23//23 24//24 33//33 
f 26//26 27//27 1//1 
f 27//27 28//28 13//13 
f 27//27 26//26 29//29 
f 27//27 29//29 28//28 
f 28//28 29//29 30//30 
f 26//26 33//33 29//29 
f 30//30 29//29 36//36 
f 30//30 31//31 28//28 
f 65//65 28//28 31//31 
f 71//71 65//65 31//31 
f 30//30 32//32 31//31 
f 72//72 31//31 32//32 
f 29//29 33//33 36//36 
f 36//36 33//33 34//34 
f 34//34 35//35 36//36 
f 33//33 25//25 34//34 
f 25//25 136//136 34//34 
f 136//136 35//35 34//34 
f 32//32 37//37 79//79 
f 36//36 32//32 30//30 
f 37//37 32//32 36//36 
f 36//36 35//35 37//37 
f 37//37 35//35 131//131 
f 37//37 131//131 38//38 
f 79//79 37//37 38//38 
f 139//139 131//131 35//35 
f 139//139 35//35 136//136 
f 21//21 41//41 24//24 
f 21//21 40//40 41//41 
f 39//39 41//41 40//40 
f 5//5 39//39 40//40 
f 41//41 25//25 24//24 
f 43//43 25//25 41//41 
f 42//42 41//41 39//39 
f 41//41 42//42 43//43 
f 52//52 44//44 8//8 
f 5//5 45//45 39//39 
f 39//39 47//47 42//42 
f 39//39 45//45 47//47 
f 5//5 44//44 45//45 
f 94//94 44//44 52//52 
f 44//44 94//94 45//45 
f 43//43 48//48 25//25 
f 25//25 48//48 55//55 
f 48//48 46//46 55//55 
f 42//42 47//47 43//43 
f 47//47 48//48 43//43 
f 48//48 47//47 49//49 
f 48//48 49//49 46//46 
f 50//50 49//49 47//47 
f 47//47 45//45 50//50 
f 144//144 46//46 49//49 
f 50//50 216//216 49//49 
f 8//8 51//51 52//52 
f 51//51 91//91 52//52 
f 53//53 91//91 51//51 
f 91//91 53//53 92//92 
f 52//52 91//91 94//94 
f 20//20 54//54 53//53 
f 136//136 25//25 55//55 
f 136//136 55//55 138//138 
f 55//55 46//46 137//137 
f 64//64 74//74 56//56 
f 64//64 65//65 74//74 
f 62//62 56//56 66//66 
f 63//63 61//61 57//57 
f 57//57 61//61 68//68 
f 63//63 57//57 58//58 
f 57//57 59//59 58//58 
f 57//57 68//68 59//59 
f 60//60 14//14 64//64 
f 60//60 12//12 14//14 
f 62//62 61//61 60//60 
f 62//62 60//60 64//64 
f 63//63 16//16 60//60 
f 61//61 63//63 60//60 
f 14//14 65//65 64//64 
f 62//62 64//64 56//56 
f 66//66 61//61 62//62 
f 67//67 61//61 66//66 
f 76//76 67//67 66//66 
f 58//58 16//16 63//63 
f 68//68 61//61 69//69 
f 67//67 69//69 61//61 
f 68//68 69//69 113//113 
f 67//67 70//70 69//69 
f 76//76 70//70 67//67 
f 70//70 113//113 69//69 
f 74//74 65//65 71//71 
f 74//74 71//71 73//73 
f 73//73 71//71 72//72 
f 71//71 31//31 72//72 
f 72//72 79//79 73//73 
f 56//56 74//74 75//75 
f 66//66 56//56 75//75 
f 74//74 73//73 75//75 
f 66//66 75//75 80//80 
f 80//80 76//76 66//66 
f 77//77 78//78 75//75 
f 75//75 73//73 77//77 
f 75//75 78//78 80//80 
f 32//32 79//79 72//72 
f 73//73 79//79 77//77 
f 79//79 38//38 160//160 
f 79//79 160//160 77//77 
f 80//80 78//78 81//81 
f 80//80 81//81 82//82 
f 160//160 161//161 77//77 
f 77//77 161//161 164//164 
f 78//78 77//77 167//167 
f 78//78 167//167 81//81 
f 164//164 167//167 77//77 
f 165//165 82//82 81//81 
f 80//80 83//83 76//76 
f 83//83 80//80 180//180 
f 70//70 116//116 113//113 
f 76//76 84//84 70//70 
f 84//84 116//116 70//70 
f 80//80 82//82 180//180 
f 76//76 83//83 84//84 
f 122//122 116//116 84//84 
f 122//122 84//84 85//85 
f 180//180 182//182 83//83 
f 182//182 84//84 83//83 
f 108//108 86//86 18//18 
f 87//87 86//86 108//108 
f 86//86 97//97 54//54 
f 87//87 97//97 86//86 
f 87//87 98//98 97//97 
f 88//88 45//45 94//94 
f 88//88 89//89 45//45 
f 45//45 89//89 50//50 
f 90//90 50//50 89//89 
f 89//89 88//88 100//100 
f 89//89 100//100 90//90 
f 50//50 90//90 216//216 
f 90//90 100//100 219//219 
f 93//93 94//94 91//91 
f 54//54 92//92 53//53 
f 91//91 92//92 93//93 
f 93//93 92//92 95//95 
f 88//88 94//94 93//93 
f 100//100 88//88 93//93 
f 93//93 96//96 100//100 
f 93//93 95//95 96//96 
f 96//96 95//95 99//99 
f 54//54 95//95 92//92 
f 54//54 97//97 95//95 
f 95//95 97//97 99//99 
f 97//97 98//98 99//99 
f 99//99 98//98 103//103 
f 115//115 103//103 98//98 
f 103//103 115//115 104//104 
f 115//115 118//118 104//104 
f 100//100 96//96 101//101 
f 99//99 102//102 96//96 
f 219//219 100//100 101//101 
f 96//96 102//102 101//101 
f 101//101 102//102 220//220 
f 99//99 103//103 102//102 
f 104//104 102//102 103//103 
f 104//104 118//118 106//106 
f 104//104 105//105 102//102 
f 104//104 106//106 105//105 
f 105//105 106//106 107//107 
f 59//59 108//108 58//58 
f 110//110 108//108 59//59 
f 108//108 110//110 87//87 
f 68//68 109//109 59//59 
f 109//109 110//110 59//59 
f 109//109 114//114 110//110 
f 112//112 87//87 110//110 
f 112//112 98//98 87//87 
f 121//121 98//98 112//112 
f 111//111 112//112 110//110 
f 114//114 111//111 110//110 
f 68//68 113//113 109//109 
f 109//109 113//113 114//114 
f 113//113 117//117 114//114 
f 111//111 120//120 112//112 
f 121//121 115//115 98//98 
f 113//113 116//116 117//117 
f 120//120 111//111 114//114 
f 114//114 117//117 120//120 
f 119//119 117//117 116//116 
f 122//122 123//123 116//116 
f 119//119 116//116 123//123 
f 115//115 121//121 118//118 
f 112//112 120//120 121//121 
f 121//121 125//125 118//118 
f 117//117 119//119 120//120 
f 120//120 127//127 121//121 
f 120//120 119//119 127//127 
f 119//119 123//123 127//127 
f 126//126 125//125 121//121 
f 121//121 127//127 126//126 
f 123//123 122//122 239//239 
f 239//239 130//130 123//123 
f 122//122 85//85 239//239 
f 118//118 124//124 106//106 
f 124//124 118//118 125//125 
f 125//125 126//126 124//124 
f 107//107 106//106 124//124 
f 124//124 126//126 107//107 
f 236//236 107//107 126//126 
f 128//128 126//126 127//127 
f 129//129 127//127 123//123 
f 127//127 129//129 128//128 
f 123//123 130//130 129//129 
f 236//236 126//126 128//128 
f 128//128 129//129 236//236 
f 236//236 129//129 252//252 
f 131//131 132//132 38//38 
f 162//162 38//38 132//132 
f 131//131 139//139 132//132 
f 140//140 132//132 139//139 
f 162//162 132//132 135//135 
f 162//162 135//135 133//133 
f 140//140 142//142 134//134 
f 134//134 132//132 140//140 
f 132//132 134//134 135//135 
f 133//133 135//135 172//172 
f 133//133 172//172 169//169 
f 154//154 172//172 135//135 
f 134//134 154//154 135//135 
f 192//192 172//172 154//154 
f 134//134 149//149 154//154 
f 150//150 154//154 149//149 
f 216//216 144//144 49//49 
f 55//55 137//137 138//138 
f 138//138 137//137 141//141 
f 136//136 138//138 139//139 
f 138//138 140//140 139//139 
f 141//141 140//140 138//138 
f 143//143 140//140 141//141 
f 143//143 142//142 140//140 
f 147//147 142//142 143//143 
f 145//145 141//141 137//137 
f 141//141 145//145 143//143 
f 143//143 148//148 147//147 
f 145//145 148//148 143//143 
f 46//46 144//144 137//137 
f 145//145 137//137 144//144 
f 146//146 148//148 145//145 
f 146//146 145//145 144//144 
f 144//144 217//217 146//146 
f 217//217 226//226 146//146 
f 142//142 147//147 134//134 
f 147//147 151//151 149//149 
f 151//151 147//147 148//148 
f 147//147 149//149 134//134 
f 149//149 151//151 150//150 
f 148//148 146//146 152//152 
f 152//152 151//151 148//148 
f 146//146 226//226 152//152 
f 227//227 152//152 226//226 
f 153//153 151//151 152//152 
f 227//227 153//153 152//152 
f 156//156 192//192 154//154 
f 150//150 156//156 154//154 
f 158//158 192//192 156//156 
f 150//150 157//157 156//156 
f 157//157 150//150 151//151 
f 158//158 156//156 157//157 
f 158//158 157//157 155//155 
f 197//197 158//158 155//155 
f 151//151 153//153 157//157 
f 204//204 157//157 153//153 
f 204//204 155//155 157//157 
f 155//155 204//204 159//159 
f 228//228 204//204 153//153 
f 269//269 204//204 228//228 
f 162//162 160//160 38//38 
f 161//161 160//160 163//163 
f 170//170 163//163 162//162 
f 160//160 162//162 163//163 
f 171//171 166//166 163//163 
f 81//81 167//167 165//165 
f 82//82 165//165 181//181 
f 161//161 166//166 164//164 
f 166//166 167//167 164//164 
f 166//166 161//161 163//163 
f 167//167 166//166 174//174 
f 168//168 169//169 173//173 
f 133//133 170//170 162//162 
f 133//133 169//169 170//170 
f 168//168 170//170 169//169 
f 163//163 170//170 171//171 
f 166//166 171//171 168//168 
f 168//168 171//171 170//170 
f 172//172 173//173 169//169 
f 192//192 173//173 172//172 
f 168//168 173//173 191//191 
f 168//168 191//191 176//176 
f 166//166 168//168 175//175 
f 175//175 174//174 166//166 
f 174//174 178//178 167//167 
f 178//178 174//174 176//176 
f 175//175 168//168 176//176 
f 174//174 175//175 176//176 
f 176//176 179//179 178//178 
f 180//180 82//82 181//181 
f 165//165 167//167 177//177 
f 167//167 178//178 177//177 
f 179//179 200//200 178//178 
f 178//178 200//200 212//212 
f 180//180 181//181 182//182 
f 165//165 177//177 181//181 
f 177//177 185//185 181//181 
f 182//182 183//183 84//84 
f 85//85 84//84 183//183 
f 185//185 182//182 181//181 
f 182//182 185//185 184//184 
f 184//184 185//185 189//189 
f 182//182 184//184 183//183 
f 178//178 186//186 177//177 
f 177//177 186//186 187//187 
f 185//185 177//177 188//188 
f 212//212 186//186 178//178 
f 177//177 187//187 188//188 
f 185//185 188//188 189//189 
f 184//184 189//189 183//183 
f 192//192 190//190 173//173 
f 191//191 173//173 190//190 
f 190//190 192//192 196//196 
f 196//196 193//193 190//190 
f 158//158 196//196 192//192 
f 196//196 194//194 193//193 
f 176//176 191//191 193//193 
f 193//193 191//191 190//190 
f 193//193 179//179 176//176 
f 195//195 202//202 199//199 
f 196//196 158//158 197//197 
f 197//197 194//194 196//196 
f 197//197 195//195 194//194 
f 159//159 195//195 197//197 
f 197//197 155//155 159//159 
f 193//193 198//198 179//179 
f 198//198 193//193 194//194 
f 194//194 195//195 198//198 
f 198//198 200//200 179//179 
f 198//198 195//195 199//199 
f 199//199 201//201 198//198 
f 200//200 198//198 201//201 
f 212//212 200//200 211//211 
f 201//201 211//211 200//200 
f 201//201 199//199 207//207 
f 207//207 211//211 201//201 
f 204//204 203//203 159//159 
f 159//159 202//202 195//195 
f 159//159 203//203 202//202 
f 203//203 204//204 269//269 
f 270//270 203//203 269//269 
f 205//205 202//202 203//203 
f 202//202 205//205 199//199 
f 206//206 203//203 270//270 
f 206//206 205//205 203//203 
f 199//199 205//205 207//207 
f 207//207 209//209 211//211 
f 209//209 207//207 205//205 
f 205//205 206//206 282//282 
f 205//205 282//282 209//209 
f 208//208 209//209 210//210 
f 209//209 282//282 210//210 
f 186//186 212//212 187//187 
f 211//211 213//213 212//212 
f 187//187 212//212 213//213 
f 213//213 214//214 187//187 
f 188//188 187//187 189//189 
f 189//189 187//187 215//215 
f 215//215 245//245 189//189 
f 245//245 215//215 285//285 
f 214//214 215//215 187//187 
f 214//214 286//286 215//215 
f 213//213 209//209 214//214 
f 211//211 209//209 213//213 
f 208//208 214//214 209//209 
f 214//214 208//208 286//286 
f 288//288 286//286 208//208 
f 218//218 217//217 216//216 
f 218//218 216//216 90//90 
f 216//216 217//217 144//144 
f 90//90 219//219 218//218 
f 219//219 101//101 220//220 
f 222//222 219//219 220//220 
f 221//221 217//217 218//218 
f 219//219 222//222 218//218 
f 218//218 222//222 221//221 
f 223//223 222//222 220//220 
f 220//220 225//225 223//223 
f 223//223 224//224 222//222 
f 102//102 105//105 220//220 
f 105//105 225//225 220//220 
f 105//105 233//233 225//225 
f 225//225 233//233 223//223 
f 233//233 105//105 107//107 
f 107//107 251//251 233//233 
f 221//221 226//226 217//217 
f 221//221 222//222 229//229 
f 230//230 221//221 229//229 
f 230//230 227//227 221//221 
f 221//221 227//227 226//226 
f 230//230 228//228 227//227 
f 227//227 228//228 153//153 
f 229//229 222//222 224//224 
f 223//223 234//234 224//224 
f 231//231 224//224 234//234 
f 233//233 234//234 223//223 
f 228//228 230//230 235//235 
f 229//229 235//235 230//230 
f 229//229 232//232 235//235 
f 224//224 231//231 229//229 
f 231//231 232//232 229//229 
f 251//251 257//257 233//233 
f 257//257 234//234 233//233 
f 258//258 231//231 234//234 
f 231//231 290//290 232//232 
f 270//270 269//269 228//228 
f 270//270 228//228 235//235 
f 251//251 107//107 236//236 
f 268//268 287//287 237//237 
f 183//183 238//238 85//85 
f 239//239 85//85 238//238 
f 239//239 238//238 241//241 
f 238//238 183//183 244//244 
f 241//241 238//238 244//244 
f 240//240 130//130 239//239 
f 241//241 240//240 239//239 
f 129//129 130//130 240//240 
f 240//240 243//243 129//129 
f 241//241 243//243 240//240 
f 242//242 243//243 241//241 
f 189//189 245//245 183//183 
f 245//245 244//244 183//183 
f 246//246 241//241 244//244 
f 244//244 245//245 246//246 
f 245//245 247//247 246//246 
f 249//249 247//247 289//289 
f 242//242 241//241 248//248 
f 241//241 246//246 248//248 
f 246//246 247//247 248//248 
f 248//248 249//249 242//242 
f 242//242 249//249 268//268 
f 248//248 247//247 249//249 
f 289//289 287//287 250//250 
f 289//289 250//250 249//249 
f 249//249 250//250 268//268 
f 268//268 250//250 287//287 
f 236//236 252//252 251//251 
f 253//253 251//251 252//252 
f 253//253 263//263 251//251 
f 254//254 253//253 252//252 
f 266//266 252//252 129//129 
f 266//266 255//255 252//252 
f 264//264 263//263 253//253 
f 264//264 253//253 254//254 
f 252//252 255//255 254//254 
f 254//254 255//255 264//264 
f 255//255 256//256 264//264 
f 264//264 256//256 260//260 
f 257//257 258//258 234//234 
f 257//257 263//263 258//258 
f 257//257 251//251 263//263 
f 265//265 258//258 263//263 
f 258//258 292//292 231//231 
f 231//231 292//292 290//290 
f 265//265 262//262 259//259 
f 262//262 293//293 259//259 
f 265//265 259//259 258//258 
f 258//258 259//259 292//292 
f 260//260 261//261 262//262 
f 260//260 268//268 261//261 
f 237//237 261//261 268//268 
f 293//293 262//262 261//261 
f 260//260 262//262 264//264 
f 264//264 265//265 263//263 
f 262//262 265//265 264//264 
f 243//243 266//266 129//129 
f 266//266 243//243 267//267 
f 242//242 267//267 243//243 
f 267//267 256//256 266//266 
f 256//256 255//255 266//266 
f 267//267 242//242 268//268 
f 268//268 256//256 267//267 
f 268//268 260//260 256//256 
f 275//275 271//271 270//270 
f 270//270 271//271 206//206 
f 278//278 272//272 281//281 
f 282//282 206//206 271//271 
f 282//282 271//271 273//273 
f 273//273 210//210 282//282 
f 272//272 208//208 210//210 
f 210//210 273//273 274//274 
f 274//274 281//281 272//272 
f 210//210 274//274 272//272 
f 232//232 270//270 235//235 
f 232//232 275//275 270//270 
f 280//280 271//271 275//275 
f 280//280 275//275 276//276 
f 232//232 290//290 275//275 
f 275//275 290//290 276//276 
f 271//271 280//280 273//273 
f 276//276 277//277 280//280 
f 294//294 277//277 276//276 
f 281//281 284//284 295//295 
f 237//237 281//281 295//295 
f 287//287 278//278 237//237 
f 278//278 281//281 237//237 
f 273//273 280//280 283//283 
f 283//283 274//274 273//273 
f 280//280 277//277 283//283 
f 283//283 279//279 274//274 
f 281//281 274//274 279//279 
f 284//284 281//281 279//279 
f 284//284 279//279 283//283 
f 294//294 284//284 277//277 
f 283//283 277//277 284//284 
f 288//288 208//208 272//272 
f 247//247 245//245 285//285 
f 288//288 289//289 286//286 
f 286//286 285//285 215//215 
f 286//286 289//289 285//285 
f 278//278 288//288 272//272 
f 289//289 288//288 287//287 
f 287//287 288//288 278//278 
f 285//285 289//289 247//247 
f 292//292 291//291 290//290 
f 293//293 295//295 294//294 
f 294//294 259//259 293//293 
f 291//291 292//292 294//294 
f 294//294 292//292 259//259 
f 291//291 276//276 290//290 
f 276//276 291//291 294//294 
f 284//284 294//294 295//295 
f 237//237 295//295 293//293 
f 237//237 293//293 261//261 
