# PIPER geometrical reference model based on a manual segmentation. See the
# documentation for more info.
# Author: CEESAR, SOTON, UCBL-Ifsttar
# Version: 1.0.0
# License: Creative Commons Attribution 4.0 International License.
# (https://creativecommons.org/licenses/by/4.0/)
# 
# This work has received funding from the European Union Seventh Framework
# Program ([FP7/2007-2013]) under grant agreement 605544 [PIPER project]).
# Contributors include Pierre Maillez, Christophe Lecomte (SOTON), Erwan
# Jolivet (CEESAR), Philippe Beillas (UCBL-Ifsttar)
# This work is derived from a CT scan provided by CEESAR under a CCBY-4.0
# License
# 
# wavefront obj file written by the visualization toolkit

mtllib C:/desktop/registration_reference_model/22_REF_LTE635_Assembly_hands_corr/CCTu635_BPXXX_Toe2_R.mtl

v -4.66502 225.945 -1746.94
v -2.97402 224.624 -1745.58
v -0.99102 226.936 -1744.93
v 2.11098 225.579 -1743.93
v -6.65702 226.087 -1750
v -5.99302 223.86 -1751.33
v -2.33102 223.243 -1751.8
v -2.80002 225.036 -1754.43
v -3.51402 227.403 -1754.24
v -6.06202 226.786 -1752.73
v -1.07302 231.827 -1747.64
v 1.83498 232.049 -1745.82
v 1.92798 242.683 -1748.51
v -1.89002 233.544 -1750.62
v 0.713979 240.805 -1749.68
v -0.71002 234.475 -1752.32
v 2.73498 233.205 -1754.19
v 0.909979 241.377 -1751.77
v 3.67898 243.061 -1748.2
v -0.196021 245.776 -1752.6
v 2.13698 238.201 -1753.03
v 4.66998 224.908 -1745.35
v 2.67298 224.06 -1745.84
v 3.84798 230.805 -1745.66
v 3.02898 221.802 -1754.4
v 6.12898 222.132 -1750.71
v 6.31398 224.128 -1750.67
v 5.50698 223.483 -1754.94
v 5.34298 230.499 -1749.33
v 4.47098 231.139 -1753
v 4.96998 238.847 -1748.06
v 6.03998 238.277 -1750.73
v 6.70998 242.35 -1749.85
v 4.58098 238.424 -1753.22
v 3.17098 243.524 -1753.63
v 6.83798 242.749 -1753.8
v -0.299022 250.924 -1755.74
v 1.40898 247.414 -1749.19
v 8.60798 248.301 -1750.87
v 7.11598 249.863 -1749.88
v 4.51798 250.855 -1750.13
v 2.47198 252.368 -1752.57
v 9.19998 245.27 -1753.53
v 3.83898 257.395 -1755.14
v 2.53198 224.41 -1756.95
v 2.60298 255.938 -1756.22
v 3.42698 261.622 -1756.48
v 3.27398 255.774 -1758.7
v 0.291977 262.338 -1761.25
v 1.32198 265.303 -1759.89
v 0.998977 265.701 -1761.93
v 1.54398 250.344 -1757.65
v 8.44898 247.807 -1758.09
v 9.79998 256.796 -1758.78
v 10.011 251.746 -1755.76
v 6.66798 258.265 -1755.2
v 6.97598 256.731 -1760.37
v 2.41898 259.411 -1760.12
v 8.91998 257.064 -1760.47
v 8.53298 266.595 -1759.2
v 5.62698 267.261 -1759.52
v 9.56998 259.605 -1757.73
v 11.356 262.845 -1763.54
v 11.125 266.892 -1762.03
v 7.42798 270.104 -1762.68
v 2.78198 264.559 -1764.08
v 9.03398 262.54 -1764.93
v 6.02698 268.546 -1766.23
v 4.29398 268.458 -1762.64
v 5.25598 262.587 -1764.7
v 10.334 268.274 -1764.46
v 9.56998 266.328 -1766.09
v 6.85398 252.194 -1751.33
v 2.80998 226.881 -1744.52
v 6.60098 262.998 -1757.38
v 1.80898 249.127 -1750.34
v 8.94498 247.011 -1752.32
v 3.64198 259.907 -1755.93
v 9.64898 258.478 -1757.82
v 2.76298 266.27 -1763.56
v 10.053 263.475 -1764.64
vn -0.76459 0.0360133 0.64351
vn -0.437611 -0.537749 0.720641
vn -0.381479 0.233026 0.894524
vn 0.0885208 -0.259764 0.961606
vn -0.968393 0.0519021 0.24397
vn -0.674989 -0.720502 -0.158954
vn -0.2327 -0.966006 -0.112622
vn -0.45534 -0.441704 -0.773022
vn -0.455534 0.194587 -0.868691
vn -0.833076 0.146606 -0.533376
vn -0.648446 0.39857 0.648583
vn -0.231665 0.291268 0.928167
vn -0.493334 0.130737 0.859959
vn -0.882626 0.465476 0.065602
vn -0.932804 0.132237 0.335247
vn -0.65643 0.36235 -0.661666
vn 0.117846 0.189658 -0.974752
vn -0.852982 -0.0529458 -0.519248
vn 0.0433624 0.166396 0.985105
vn -0.967446 -0.176558 -0.181315
vn -0.317672 0.115803 -0.941103
vn 0.663243 -0.351547 0.660699
vn 0.0311678 -0.88146 0.471228
vn 0.580732 0.183918 0.793047
vn -0.0088138 -0.93795 -0.34666
vn 0.641994 -0.753646 0.14093
vn 0.998837 0.0286319 0.0387938
vn 0.758217 -0.286155 -0.585851
vn 0.992969 0.0546441 0.105004
vn 0.853129 0.0931353 -0.51332
vn 0.729134 0.036071 0.683419
vn 0.976949 -0.212263 -0.022682
vn 0.827705 -0.144188 0.542323
vn 0.420854 -0.124108 -0.898598
vn -0.342511 -0.343673 -0.8744
vn 0.348327 -0.52351 -0.777564
vn -0.959144 0.184284 -0.214669
vn -0.556427 0.280089 0.782265
vn 0.811031 0.0673933 0.581108
vn 0.429869 0.307363 0.848965
vn -0.140712 0.480849 0.865439
vn -0.636892 0.504021 0.583379
vn 0.932693 -0.358746 -0.0372125
vn -0.487934 0.389657 0.781081
vn 0.0658846 -0.204038 -0.976743
vn -0.95674 0.25909 0.132367
vn -0.496729 0.282498 0.820643
vn -0.674946 -0.224834 -0.702778
vn -0.944919 -0.285658 -0.159773
vn -0.707252 0.47724 0.521572
vn -0.868415 0.451906 -0.204052
vn -0.514392 -0.184509 -0.837471
vn 0.440811 -0.435981 -0.784606
vn 0.976322 -0.129339 -0.173397
vn 0.997486 -0.00582598 0.0706295
vn 0.201988 0.45919 0.865069
vn -0.169384 -0.444365 -0.879687
vn -0.814915 -0.47938 -0.325741
vn 0.460245 -0.490316 -0.740111
vn 0.385978 0.509003 0.769375
vn -0.173604 0.679605 0.71274
vn 0.822316 0.168134 0.543624
vn 0.902726 -0.253031 -0.347939
vn 0.880765 0.389587 0.269212
vn 0.0694619 0.986892 0.145666
vn -0.601823 -0.100575 -0.792271
vn 0.219734 -0.460539 -0.860012
vn -0.250157 0.515374 -0.81964
vn -0.549668 0.8318 0.0772853
vn -0.272618 -0.436912 -0.857197
vn 0.711221 0.607976 -0.352887
vn 0.432536 0.0374135 -0.90084
vn 0.123332 0.536194 0.835036
vn 0.505429 0.114933 0.855179
vn 0.0756648 0.41772 0.90542
vn -0.422875 0.571401 0.703334
vn 0.966649 -0.0336726 0.253883
vn -0.0747483 0.295402 0.952444
vn 0.996936 0.0665689 0.0410823
vn -0.700088 0.19993 -0.685496
vn 0.51867 -0.316908 -0.794072

g grp1
usemtl mtl1
f 2//2 4//4 3//3 
f 2//2 3//3 1//1 
f 7//7 23//23 2//2 
f 4//4 2//2 23//23 
f 11//11 1//1 3//3 
f 3//3 4//4 12//12 
f 3//3 12//12 11//11 
f 2//2 5//5 6//6 
f 1//1 5//5 2//2 
f 5//5 10//10 6//6 
f 7//7 2//2 6//6 
f 1//1 11//11 5//5 
f 11//11 14//14 5//5 
f 5//5 14//14 10//10 
f 8//8 6//6 10//10 
f 8//8 7//7 6//6 
f 9//9 8//8 10//10 
f 7//7 8//8 25//25 
f 25//25 8//8 45//45 
f 8//8 9//9 45//45 
f 10//10 16//16 9//9 
f 15//15 11//11 12//12 
f 12//12 13//13 15//15 
f 16//16 10//10 14//14 
f 14//14 11//11 15//15 
f 15//15 16//16 14//14 
f 16//16 17//17 9//9 
f 17//17 16//16 21//21 
f 18//18 16//16 15//15 
f 38//38 13//13 19//19 
f 38//38 15//15 13//13 
f 15//15 20//20 18//18 
f 15//15 38//38 20//20 
f 16//16 18//18 21//21 
f 35//35 21//21 18//18 
f 18//18 20//20 35//35 
f 23//23 22//22 4//4 
f 26//26 22//22 23//23 
f 22//22 26//26 27//27 
f 4//4 24//24 12//12 
f 29//29 24//24 22//22 
f 25//25 26//26 23//23 
f 25//25 28//28 26//26 
f 23//23 7//7 25//25 
f 27//27 29//29 22//22 
f 27//27 28//28 30//30 
f 28//28 45//45 30//30 
f 27//27 26//26 28//28 
f 29//29 27//27 30//30 
f 30//30 45//45 17//17 
f 29//29 32//32 24//24 
f 31//31 24//24 32//32 
f 19//19 12//12 24//24 
f 24//24 31//31 19//19 
f 12//12 19//19 13//13 
f 30//30 32//32 29//29 
f 30//30 17//17 34//34 
f 30//30 34//34 32//32 
f 17//17 21//21 34//34 
f 31//31 32//32 33//33 
f 33//33 32//32 43//43 
f 39//39 33//33 43//43 
f 35//35 34//34 21//21 
f 32//32 34//34 36//36 
f 35//35 36//36 34//34 
f 43//43 32//32 36//36 
f 35//35 53//53 36//36 
f 37//37 20//20 38//38 
f 38//38 42//42 37//37 
f 20//20 52//52 35//35 
f 20//20 37//37 52//52 
f 42//42 46//46 37//37 
f 38//38 19//19 40//40 
f 19//19 31//31 40//40 
f 41//41 38//38 40//40 
f 40//40 31//31 33//33 
f 40//40 33//33 39//39 
f 39//39 55//55 40//40 
f 42//42 41//41 44//44 
f 42//42 44//44 46//46 
f 41//41 56//56 44//44 
f 44//44 47//47 46//46 
f 62//62 56//56 40//40 
f 9//9 17//17 45//45 
f 45//45 28//28 25//25 
f 53//53 43//43 36//36 
f 46//46 52//52 37//37 
f 58//58 48//48 46//46 
f 46//46 47//47 58//58 
f 47//47 49//49 58//58 
f 49//49 47//47 50//50 
f 51//51 49//49 50//50 
f 66//66 70//70 49//49 
f 51//51 66//66 49//49 
f 35//35 52//52 53//53 
f 53//53 55//55 43//43 
f 52//52 48//48 53//53 
f 53//53 54//54 55//55 
f 53//53 48//48 57//57 
f 46//46 48//48 52//52 
f 40//40 55//55 62//62 
f 53//53 57//57 59//59 
f 53//53 59//59 54//54 
f 57//57 48//48 58//58 
f 70//70 58//58 49//49 
f 57//57 58//58 70//70 
f 70//70 67//67 57//57 
f 57//57 67//67 59//59 
f 54//54 59//59 63//63 
f 67//67 63//63 59//59 
f 61//61 47//47 60//60 
f 62//62 60//60 56//56 
f 60//60 62//62 64//64 
f 47//47 61//61 50//50 
f 61//61 69//69 50//50 
f 50//50 69//69 51//51 
f 51//51 69//69 68//68 
f 54//54 63//63 62//62 
f 62//62 63//63 64//64 
f 61//61 65//65 69//69 
f 61//61 60//60 65//65 
f 60//60 64//64 65//65 
f 67//67 70//70 72//72 
f 66//66 68//68 70//70 
f 64//64 71//71 65//65 
f 71//71 72//72 68//68 
f 68//68 72//72 70//70 
f 63//63 71//71 64//64 
f 71//71 63//63 72//72 
f 69//69 65//65 68//68 
f 65//65 71//71 68//68 
f 40//40 56//56 73//73 
f 56//56 41//41 73//73 
f 41//41 40//40 73//73 
f 4//4 22//22 74//74 
f 22//22 24//24 74//74 
f 24//24 4//4 74//74 
f 56//56 60//60 75//75 
f 60//60 47//47 75//75 
f 47//47 56//56 75//75 
f 42//42 38//38 76//76 
f 38//38 41//41 76//76 
f 41//41 42//42 76//76 
f 39//39 43//43 77//77 
f 43//43 55//55 77//77 
f 55//55 39//39 77//77 
f 44//44 56//56 78//78 
f 56//56 47//47 78//78 
f 47//47 44//44 78//78 
f 62//62 55//55 79//79 
f 55//55 54//54 79//79 
f 54//54 62//62 79//79 
f 68//68 66//66 80//80 
f 66//66 51//51 80//80 
f 51//51 68//68 80//80 
f 67//67 72//72 81//81 
f 72//72 63//63 81//81 
f 63//63 67//67 81//81 
