# PIPER geometrical reference model based on a manual segmentation. See the
# documentation for more info.
# Author: CEESAR, SOTON, UCBL-Ifsttar
# Version: 1.0.0
# License: Creative Commons Attribution 4.0 International License.
# (https://creativecommons.org/licenses/by/4.0/)
# 
# This work has received funding from the European Union Seventh Framework
# Program ([FP7/2007-2013]) under grant agreement 605544 [PIPER project]).
# Contributors include Pierre Maillez, Christophe Lecomte (SOTON), Erwan
# Jolivet (CEESAR), Philippe Beillas (UCBL-Ifsttar)
# This work is derived from a CT scan provided by CEESAR under a CCBY-4.0
# License
# 
# wavefront obj file written by the visualization toolkit

mtllib C:/desktop/registration_reference_model/22_REF_LTE635_Assembly_hands_corr/CCTu635_BP163_Talus_R.mtl

v -26.761 100.868 -1658.18
v -28.926 101.516 -1658.42
v -30.327 102.249 -1661.08
v -21.083 106.707 -1657.26
v -27.544 107.603 -1656.47
v -23.413 111.435 -1656.34
v -25.054 95.786 -1662.26
v -15.064 84.66 -1674.62
v -29.152 93.637 -1669.44
v -24.638 92.335 -1669.1
v -26.624 92.715 -1673.06
v -33.146 94.653 -1672.85
v -18.892 85.255 -1672.08
v -22.907 90.491 -1670.24
v -19.394 91.873 -1667.08
v -21.293 85.581 -1673.24
v -20.712 85.081 -1674.6
v -26.89 93.02 -1676.61
v -21.651 90.619 -1676.3
v -36.606 106.619 -1671.98
v -28.476 98.438 -1659.98
v -31.233 104.587 -1664.37
v -28.817 96.898 -1664.12
v -31.889 101.377 -1665.95
v -30.166 112.712 -1667.37
v -35.152 98.762 -1671.8
v -33.916 104.391 -1668.38
v -33.906 94.501 -1676.74
v -33.886 96.414 -1678.3
v -36.054 101.507 -1674.96
v -20.563 95.979 -1677.1
v -35.299 111.08 -1671.27
v -33.505 105.131 -1677.51
v -34.956 109.899 -1676.99
v -34.89 113.817 -1675.72
v -15.846 108.362 -1658.35
v -12.686 95.524 -1663.5
v -17.19 88.099 -1670.06
v -13.872 85.634 -1672.84
v -13.336 88.86 -1673.7
v -14.096 91.319 -1668.79
v -11.053 92.181 -1671.53
v -8.76801 95.053 -1673.92
v -11.565 92.392 -1673.6
v -19.232 98.529 -1660.66
v -18.404 103.741 -1658.8
v -9.09401 104.24 -1659.52
v -10.383 94.603 -1667.73
v -5.41801 101.361 -1660.99
v -6.74101 97.056 -1664.28
v -16.03 114.632 -1658.9
v -7.05401 109.418 -1659.29
v -3.20801 106.332 -1659.53
v -2.22301 104.995 -1661.54
v -0.89501 111.237 -1660.05
v -15.309 101.425 -1678.45
v -9.70601 96.695 -1675.94
v -8.61601 99.831 -1679.03
v -7.33901 96.933 -1670.57
v -3.52801 102.829 -1670.08
v -5.35701 98.037 -1677.21
v -3.56001 99.878 -1675.86
v -0.07901 112.606 -1668.81
v -1.06501 108.593 -1673.59
v 0.21999 112.621 -1676.86
v -28.077 113.699 -1659.54
v -26.052 114.676 -1656.56
v -23.712 120.128 -1657.79
v -24.024 115.394 -1656.51
v -27.747 123.417 -1664.17
v -29.418 117.981 -1666.46
v -22.01 123.288 -1660.17
v -24.574 124.118 -1659.97
v -26.176 125.93 -1663.63
v -25.527 128.095 -1665.79
v -22.231 126.726 -1663.67
v -30.02 121.7 -1668.6
v -31.082 118.376 -1672.58
v -31.432 125.493 -1674.94
v -27.685 128.171 -1669.05
v -26.713 130.726 -1673.16
v -24.37 131.244 -1672.45
v -20.629 130.196 -1672.13
v -25.037 133.862 -1676.2
v -19.499 132.496 -1675.47
v -8.94801 113.992 -1660.1
v -15.854 120.376 -1661.19
v -9.38801 117.954 -1661.62
v -0.73301 116.307 -1662.03
v 0.79399 111.697 -1661.56
v -9.85801 121.858 -1663.93
v 1.49699 120.479 -1668.93
v 0.435989 121.469 -1665.35
v -16.503 127.154 -1667.75
v -14.126 124.398 -1664.77
v -1.13901 124.68 -1667.61
v 0.07899 115.737 -1674.5
v 0.123989 123.043 -1671.41
v -4.15901 123.64 -1677
v -1.28301 119.18 -1678.52
v -11.287 126.705 -1669.06
v -13.677 128.579 -1674.72
v -8.66401 129.113 -1677.99
v -7.58401 126.937 -1673.79
v 1.74699 116.3 -1664.21
v -25.118 93.087 -1677.52
v -26.612 96.44 -1679.17
v -30.029 96.265 -1680.15
v -25.365 101.652 -1679.06
v -17.619 98.791 -1677.37
v -23.207 104.607 -1680.06
v -34.47 114.074 -1679.45
v -32.988 113.156 -1682.05
v -29.726 108.225 -1679.54
v -20.588 106.837 -1682.2
v -22.625 110.128 -1683.85
v -1.71101 104.358 -1674.7
v -0.537009 99.498 -1681.8
v -2.03301 102.757 -1686.86
v -12.172 103.501 -1681.72
v -15.209 107.726 -1685.81
v -10.179 106.451 -1687.9
v -9.93901 112.36 -1687.41
v 0.01199 114.218 -1679.46
v -0.131009 103.573 -1687.97
v -11.134 108.74 -1688.34
v -13.7 112.087 -1686.97
v -0.201009 107.875 -1687.67
v -5.17301 106.769 -1690.4
v 2.32199 102.436 -1682.77
v 1.85499 101.552 -1687.07
v 3.15499 106.103 -1683.41
v 2.43699 107.78 -1684.34
v -37.168 125.83 -1684.46
v -35.739 124.608 -1691.57
v -33.477 120.152 -1680.33
v -30.213 112.157 -1683.16
v -34.172 117.292 -1685.55
v -18.406 111.653 -1686.32
v -33.499 126.864 -1679.99
v -29.498 129.04 -1675.43
v -35.217 119.706 -1690.08
v -31.103 118.119 -1693.32
v -20.834 113.199 -1688.41
v -24.677 114.939 -1691.84
v -20.583 117.911 -1696.34
v -21.232 115.53 -1692.41
v -32.137 123.533 -1695.77
v -33.768 128.289 -1693.08
v -30.202 126.389 -1697.34
v -26.516 133.298 -1696.95
v -32.871 134.454 -1685.21
v -28.162 133.944 -1680.03
v -27.25 140.355 -1685.85
v -22.263 142.306 -1684.35
v -20.464 138.733 -1680.08
v -18.854 143.41 -1685.64
v -34.478 131.898 -1688.12
v -28.824 138.854 -1688.36
v -24.721 141.703 -1689.36
v -29.77 135.581 -1692.99
v -21.925 140.438 -1692.85
v -17.358 141.94 -1690.52
v -17.427 124.043 -1698.52
v -29.903 129.35 -1696.89
v -24.608 119.583 -1697.96
v -21.881 125.155 -1699.33
v -20.874 121.196 -1698.75
v -23.285 131.841 -1698.64
v -17.622 133.879 -1697.67
v -23.693 137.729 -1695.25
v -18.948 137.206 -1696.06
v -12.997 115.854 -1686.62
v -6.69201 118.349 -1684.75
v -1.39501 115.77 -1683.08
v -4.01901 119.332 -1683.24
v -5.56101 123.161 -1682.68
v -18.455 135.301 -1677.86
v -7.35701 126.798 -1684.78
v -6.49001 125.879 -1678.59
v -6.48401 126.544 -1681.49
v -13.789 120.251 -1688.35
v -18.409 118.534 -1688.55
v -9.68501 122.542 -1686.28
v -11.848 129.883 -1694.76
v -14.064 124.075 -1691.97
v -15.933 123.865 -1696.04
v -11.246 134.229 -1693.91
v -15.325 139.795 -1681.05
v -9.59801 137.222 -1682.18
v -15.522 142.594 -1683.02
v -13.51 142.389 -1685.42
v -6.73701 133.347 -1684.5
v -7.88301 133.074 -1689.62
v -13.75 138.784 -1692.35
v -8.91701 137.674 -1686.61
v -14.44 130.959 -1696.76
v -15.126 133.197 -1677.91
v -16.21 142.768 -1683.64
vn -0.019833 -0.420142 0.907241
vn -0.627025 -0.2574 0.735245
vn -0.926692 -0.10387 0.361182
vn 0.182939 -0.198964 0.962781
vn -0.491924 -0.030606 0.8701
vn 0.1284 0.000605192 0.991722
vn -0.154093 -0.769784 0.619426
vn 0.405895 -0.759254 -0.508707
vn -0.405612 -0.864525 0.296775
vn -0.373114 -0.85114 0.369251
vn -0.509646 -0.855241 0.0939339
vn -0.620033 -0.742013 0.254904
vn -0.12713 -0.811157 0.570844
vn -0.488544 -0.649028 0.583171
vn -0.0733614 -0.753909 0.65287
vn -0.579105 -0.751578 0.315861
vn -0.334333 -0.818793 -0.46669
vn -0.352726 -0.844289 -0.403437
vn 0.0990315 -0.259018 -0.960782
vn -0.974409 0.0513781 0.218833
vn -0.515865 -0.617252 0.594039
vn -0.87813 0.166846 0.448387
vn -0.649399 -0.624662 0.43368
vn -0.848822 -0.210674 0.48489
vn -0.865557 0.228684 0.44555
vn -0.891522 -0.316863 0.323707
vn -0.810827 0.0183985 0.584997
vn -0.64377 -0.718166 -0.264193
vn -0.676923 -0.238483 -0.696349
vn -0.956534 -0.0976727 -0.274779
vn 0.246763 -0.213288 -0.945313
vn -0.831772 0.325896 0.449386
vn -0.485076 -0.0353876 -0.873756
vn -0.861707 -0.100877 -0.497277
vn -0.953718 0.292788 0.0685377
vn 0.169821 -0.0445736 0.984466
vn 0.207915 -0.712038 0.670651
vn 0.042355 -0.583719 0.81085
vn 0.697293 -0.677753 0.233308
vn 0.629494 -0.177401 -0.756483
vn 0.398097 -0.657011 0.6402
vn 0.771654 -0.62328 0.126776
vn 0.610199 -0.728995 -0.310201
vn 0.550722 -0.509084 -0.661467
vn 0.106547 -0.498086 0.860557
vn 0.159915 -0.291699 0.943048
vn 0.0931467 -0.232042 0.968236
vn 0.553587 -0.781955 0.286508
vn 0.420484 -0.513152 0.748244
vn 0.594738 -0.731071 0.334397
vn 0.243445 0.225274 0.943391
vn 0.0872174 0.0705562 0.993688
vn 0.406286 -0.23821 0.88215
vn 0.829025 -0.458119 0.320693
vn 0.436365 0.07257 0.896839
vn -0.0925531 -0.597526 -0.79649
vn 0.0466719 -0.638943 -0.767837
vn -0.187648 -0.724522 -0.663217
vn 0.755186 -0.650896 0.0776505
vn 0.895292 -0.436507 0.0889576
vn 0.322634 -0.913922 -0.246281
vn 0.738858 -0.6071 0.292436
vn 0.962767 -0.249297 -0.104549
vn 0.952089 -0.200863 0.23061
vn 0.983683 0.0549589 0.171308
vn -0.902438 0.182611 0.390203
vn -0.491662 0.196978 0.848215
vn -0.00707173 0.384554 0.923075
vn 0.093133 0.172025 0.98068
vn -0.851443 0.298972 0.430883
vn -0.950876 0.0989166 0.293344
vn 0.299944 0.570265 0.764743
vn -0.285829 0.608836 0.740014
vn -0.561508 0.620434 0.547513
vn -0.290151 0.813207 0.504487
vn 0.131468 0.815104 0.5642
vn -0.936229 0.122096 0.329496
vn -0.913128 0.226236 0.339139
vn -0.89728 0.260297 0.356559
vn -0.708786 0.602656 0.366645
vn -0.52029 0.747721 0.412568
vn -0.0475714 0.869013 0.492498
vn 0.252202 0.843333 0.474535
vn -0.277166 0.747678 0.603454
vn 0.211153 0.677263 0.70479
vn 0.146739 0.305472 0.940826
vn 0.300076 0.454779 0.838529
vn 0.171102 0.439621 0.881736
vn 0.373512 0.38508 0.843921
vn 0.906514 -0.105608 0.408753
vn 0.179557 0.548076 0.816928
vn 0.976438 0.209593 -0.0513798
vn 0.628877 0.532392 0.566633
vn 0.24837 0.869945 0.426038
vn 0.236068 0.704009 0.669808
vn 0.500792 0.799623 0.331375
vn 0.995178 -0.0150923 -0.0969199
vn 0.785663 0.577096 -0.222919
vn 0.682808 0.680316 -0.266351
vn 0.864835 0.393219 -0.312153
vn 0.159274 0.917451 0.364576
vn 0.3002 0.817443 0.491596
vn 0.658435 0.585043 0.473485
vn 0.413608 0.904221 0.106362
vn 0.95472 0.0621226 0.290948
vn -0.122123 -0.614845 -0.779135
vn 0.28054 -0.174439 -0.943858
vn -0.125534 -0.300132 -0.945601
vn 0.0100791 -0.100116 -0.994925
vn 0.102325 -0.361766 -0.926636
vn -0.171786 -0.416203 -0.892897
vn -0.975805 -0.0418652 -0.214599
vn -0.67743 -0.57908 -0.453602
vn -0.354475 -0.457605 -0.815442
vn -0.284771 -0.588046 -0.757039
vn -0.254663 -0.694755 -0.672653
vn 0.867617 -0.324013 0.37717
vn 0.337233 -0.938571 -0.0732031
vn -0.239947 -0.773266 -0.586929
vn -0.267412 -0.755358 -0.598268
vn -0.359927 -0.520613 -0.774219
vn -0.383103 -0.604933 -0.698061
vn -0.0699549 0.324654 -0.943242
vn 0.952137 0.295086 -0.0797478
vn 0.190285 -0.295644 -0.936155
vn -0.360614 -0.0255456 -0.932365
vn -0.204786 0.0557979 -0.977215
vn 0.581097 0.294467 -0.758694
vn -0.000763306 -0.154931 -0.987925
vn 0.885954 -0.409807 0.217125
vn 0.529771 -0.579418 -0.619369
vn 0.998201 0.0596711 -0.00576507
vn 0.879023 0.333831 -0.340405
vn -0.97089 0.0833247 0.224564
vn -0.90137 0.0111187 -0.432907
vn -0.95371 0.0265607 0.299554
vn -0.373649 -0.748202 -0.548251
vn -0.973899 -0.20133 0.10482
vn -0.0366943 -0.422274 -0.905725
vn -0.810062 0.271648 0.519621
vn -0.743903 0.556247 0.370403
vn -0.839912 -0.43101 -0.329816
vn -0.479493 -0.6395 -0.600938
vn 0.346557 -0.689561 -0.635928
vn -0.132687 -0.841164 -0.52425
vn 0.39692 -0.724071 -0.564071
vn 0.469698 -0.775081 -0.42265
vn -0.626933 -0.182689 -0.757351
vn -0.790902 0.288699 -0.539562
vn -0.490566 0.0265948 -0.870998
vn -0.392683 0.436297 -0.809596
vn -0.761303 0.586921 0.275574
vn -0.604913 0.603562 0.519417
vn -0.558953 0.78256 0.274174
vn -0.315127 0.862541 0.395876
vn -0.0689709 0.653845 0.753478
vn -0.045254 0.997867 0.0470551
vn -0.868711 0.460827 -0.181603
vn -0.679761 0.710801 -0.180796
vn -0.373973 0.88581 -0.274746
vn -0.637249 0.572602 -0.515792
vn -0.129915 0.798335 -0.588034
vn 0.183278 0.867996 -0.461511
vn 0.536102 -0.237485 -0.810059
vn -0.543723 0.280327 -0.791063
vn -0.20045 -0.501407 -0.841672
vn -0.0253713 -0.0184154 -0.999509
vn 0.167994 -0.368725 -0.914232
vn -0.115554 0.265737 -0.957095
vn 0.256988 0.329261 -0.908595
vn -0.266572 0.628789 -0.730455
vn 0.133069 0.58896 -0.797132
vn 0.158108 -0.0447776 -0.986406
vn 0.327658 0.205848 -0.922099
vn 0.784582 0.44679 -0.429895
vn 0.636748 0.401062 -0.65856
vn 0.806482 0.351041 -0.475769
vn 0.173507 0.551174 0.816151
vn 0.900891 -0.0970821 -0.423048
vn 0.81968 0.572796 -0.00544435
vn 0.96635 0.255677 0.028219
vn 0.413113 -0.455266 -0.788715
vn 0.576601 -0.519246 -0.630805
vn 0.630349 -0.208244 -0.74786
vn 0.720435 -0.194433 -0.66571
vn 0.647844 -0.587548 -0.484856
vn 0.775084 -0.469367 -0.423013
vn 0.664941 0.314772 -0.677327
vn 0.22571 0.533327 0.815241
vn 0.659117 0.543052 0.52025
vn 0.206851 0.832212 0.514428
vn 0.50934 0.860498 -0.0107387
vn 0.969626 0.233536 0.0727058
vn 0.89818 0.10525 -0.426844
vn 0.493454 0.642366 -0.586403
vn 0.798233 0.58294 -0.151674
vn 0.513783 0.0520217 -0.856342
vn 0.337114 0.516411 0.787194
vn 0.185425 0.980207 0.0693668

g grp1
usemtl mtl1
f 21//21 1//1 2//2 
f 5//5 2//2 1//1 
f 5//5 3//3 2//2 
f 5//5 66//66 3//3 
f 4//4 5//5 1//1 
f 46//46 4//4 1//1 
f 4//4 6//6 5//5 
f 6//6 67//67 5//5 
f 6//6 51//51 69//69 
f 9//9 10//10 7//7 
f 7//7 10//10 15//15 
f 37//37 7//7 15//15 
f 13//13 16//16 17//17 
f 13//13 17//17 8//8 
f 9//9 12//12 11//11 
f 10//10 9//9 11//11 
f 11//11 12//12 28//28 
f 28//28 18//18 11//11 
f 38//38 14//14 13//13 
f 14//14 38//38 15//15 
f 13//13 14//14 16//16 
f 11//11 14//14 10//10 
f 14//14 15//15 10//10 
f 18//18 17//17 16//16 
f 11//11 16//16 14//14 
f 11//11 18//18 16//16 
f 17//17 18//18 19//19 
f 8//8 17//17 19//19 
f 19//19 18//18 106//106 
f 31//31 19//19 107//107 
f 107//107 19//19 106//106 
f 31//31 44//44 19//19 
f 35//35 20//20 32//32 
f 34//34 30//30 20//20 
f 21//21 23//23 7//7 
f 3//3 21//21 2//2 
f 21//21 3//3 23//23 
f 3//3 24//24 23//23 
f 7//7 23//23 9//9 
f 23//23 26//26 12//12 
f 9//9 23//23 12//12 
f 24//24 26//26 23//23 
f 22//22 27//27 24//24 
f 22//22 24//24 3//3 
f 1//1 21//21 7//7 
f 45//45 1//1 7//7 
f 37//37 45//45 7//7 
f 45//45 46//46 1//1 
f 25//25 22//22 3//3 
f 66//66 25//25 3//3 
f 71//71 25//25 66//66 
f 22//22 25//25 27//27 
f 27//27 26//26 24//24 
f 20//20 26//26 27//27 
f 20//20 30//30 26//26 
f 12//12 26//26 28//28 
f 26//26 30//30 28//28 
f 28//28 30//30 29//29 
f 30//30 33//33 29//29 
f 32//32 20//20 27//27 
f 25//25 32//32 27//27 
f 25//25 78//78 32//32 
f 34//34 33//33 30//30 
f 35//35 34//34 20//20 
f 112//112 34//34 35//35 
f 46//46 36//36 4//4 
f 36//36 46//46 47//47 
f 36//36 6//6 4//4 
f 51//51 6//6 36//36 
f 52//52 51//51 36//36 
f 37//37 15//15 41//41 
f 38//38 41//41 15//15 
f 41//41 48//48 37//37 
f 39//39 13//13 8//8 
f 13//13 39//39 38//38 
f 39//39 41//41 38//38 
f 39//39 42//42 41//41 
f 39//39 40//40 42//42 
f 42//42 40//40 44//44 
f 41//41 42//42 48//48 
f 44//44 43//43 42//42 
f 39//39 8//8 40//40 
f 19//19 40//40 8//8 
f 40//40 19//19 44//44 
f 57//57 43//43 44//44 
f 49//49 45//45 37//37 
f 37//37 50//50 49//49 
f 47//47 46//46 45//45 
f 49//49 47//47 45//45 
f 48//48 50//50 37//37 
f 50//50 54//54 49//49 
f 50//50 48//48 59//59 
f 59//59 60//60 50//50 
f 54//54 50//50 60//60 
f 51//51 52//52 86//86 
f 49//49 53//53 47//47 
f 53//53 52//52 47//47 
f 47//47 52//52 36//36 
f 53//53 49//49 54//54 
f 54//54 90//90 53//53 
f 53//53 55//55 52//52 
f 52//52 55//55 86//86 
f 89//89 86//86 55//55 
f 90//90 55//55 53//53 
f 55//55 90//90 89//89 
f 54//54 60//60 90//90 
f 60//60 63//63 90//90 
f 42//42 59//59 48//48 
f 59//59 42//42 43//43 
f 31//31 110//110 44//44 
f 57//57 110//110 56//56 
f 57//57 44//44 110//110 
f 57//57 56//56 58//58 
f 57//57 58//58 61//61 
f 60//60 59//59 62//62 
f 61//61 62//62 43//43 
f 57//57 61//61 43//43 
f 59//59 43//43 62//62 
f 60//60 62//62 117//117 
f 60//60 117//117 64//64 
f 60//60 64//64 63//63 
f 64//64 97//97 63//63 
f 64//64 65//65 97//97 
f 5//5 67//67 66//66 
f 67//67 70//70 66//66 
f 69//69 67//67 6//6 
f 69//69 68//68 67//67 
f 51//51 68//68 69//69 
f 73//73 70//70 67//67 
f 73//73 67//67 68//68 
f 68//68 72//72 73//73 
f 66//66 70//70 71//71 
f 71//71 78//78 25//25 
f 71//71 70//70 77//77 
f 71//71 77//77 78//78 
f 73//73 74//74 70//70 
f 68//68 51//51 87//87 
f 68//68 87//87 72//72 
f 80//80 74//74 75//75 
f 80//80 70//70 74//74 
f 73//73 76//76 74//74 
f 72//72 76//76 73//73 
f 76//76 75//75 74//74 
f 82//82 75//75 76//76 
f 94//94 83//83 76//76 
f 77//77 79//79 78//78 
f 32//32 78//78 35//35 
f 136//136 35//35 78//78 
f 78//78 79//79 136//136 
f 70//70 79//79 77//77 
f 70//70 80//80 79//79 
f 75//75 81//81 80//80 
f 79//79 80//80 141//141 
f 80//80 81//81 141//141 
f 141//141 81//81 153//153 
f 84//84 153//153 81//81 
f 75//75 82//82 81//81 
f 83//83 82//82 76//76 
f 84//84 81//81 82//82 
f 82//82 83//83 84//84 
f 83//83 85//85 84//84 
f 85//85 178//178 84//84 
f 88//88 51//51 86//86 
f 88//88 87//87 51//51 
f 72//72 87//87 95//95 
f 91//91 87//87 88//88 
f 91//91 95//95 87//87 
f 88//88 86//86 89//89 
f 89//89 90//90 105//105 
f 89//89 105//105 93//93 
f 88//88 89//89 91//91 
f 89//89 93//93 91//91 
f 90//90 63//63 105//105 
f 96//96 91//91 93//93 
f 93//93 105//105 92//92 
f 93//93 92//92 98//98 
f 95//95 76//76 72//72 
f 95//95 94//94 76//76 
f 101//101 94//94 95//95 
f 95//95 96//96 101//101 
f 96//96 95//95 91//91 
f 93//93 98//98 96//96 
f 63//63 97//97 92//92 
f 63//63 92//92 105//105 
f 124//124 100//100 97//97 
f 65//65 124//124 97//97 
f 92//92 97//97 100//100 
f 100//100 98//98 92//92 
f 98//98 100//100 99//99 
f 101//101 102//102 94//94 
f 104//104 102//102 101//101 
f 102//102 83//83 94//94 
f 83//83 102//102 85//85 
f 178//178 85//85 102//102 
f 104//104 103//103 102//102 
f 104//104 180//180 103//103 
f 104//104 101//101 96//96 
f 98//98 104//104 96//96 
f 104//104 99//99 180//180 
f 104//104 98//98 99//99 
f 108//108 18//18 28//28 
f 18//18 108//108 106//106 
f 106//106 108//108 107//107 
f 108//108 28//28 29//29 
f 108//108 109//109 107//107 
f 33//33 108//108 29//29 
f 108//108 33//33 109//109 
f 109//109 33//33 111//111 
f 31//31 107//107 109//109 
f 111//111 110//110 109//109 
f 109//109 110//110 31//31 
f 56//56 110//110 111//111 
f 33//33 34//34 114//114 
f 33//33 114//114 111//111 
f 34//34 112//112 113//113 
f 34//34 113//113 114//114 
f 114//114 113//113 137//137 
f 137//137 116//116 114//114 
f 116//116 137//137 145//145 
f 111//111 114//114 115//115 
f 116//116 115//115 114//114 
f 111//111 120//120 56//56 
f 111//111 115//115 120//120 
f 121//121 120//120 115//115 
f 116//116 121//121 115//115 
f 116//116 139//139 121//121 
f 144//144 139//139 116//116 
f 116//116 145//145 144//144 
f 120//120 58//58 56//56 
f 61//61 58//58 118//118 
f 58//58 120//120 118//118 
f 62//62 61//61 118//118 
f 130//130 117//117 62//62 
f 118//118 130//130 62//62 
f 119//119 118//118 120//120 
f 118//118 119//119 131//131 
f 122//122 120//120 121//121 
f 121//121 139//139 127//127 
f 121//121 127//127 126//126 
f 64//64 132//132 65//65 
f 130//130 64//64 117//117 
f 131//131 128//128 133//133 
f 176//176 128//128 129//129 
f 124//124 133//133 175//175 
f 133//133 128//128 175//175 
f 175//175 128//128 176//176 
f 131//131 119//119 125//125 
f 122//122 121//121 126//126 
f 129//129 122//122 126//126 
f 126//126 127//127 123//123 
f 129//129 126//126 123//123 
f 120//120 122//122 119//119 
f 129//129 119//119 122//122 
f 125//125 119//119 129//129 
f 128//128 125//125 129//129 
f 128//128 131//131 125//125 
f 131//131 130//130 118//118 
f 130//130 132//132 64//64 
f 65//65 132//132 133//133 
f 131//131 132//132 130//130 
f 132//132 131//131 133//133 
f 138//138 134//134 142//142 
f 134//134 135//135 142//142 
f 134//134 158//158 135//135 
f 35//35 136//136 112//112 
f 112//112 138//138 113//113 
f 112//112 136//136 138//138 
f 138//138 142//142 113//113 
f 136//136 134//134 138//138 
f 134//134 136//136 140//140 
f 79//79 140//140 136//136 
f 79//79 141//141 140//140 
f 141//141 153//153 140//140 
f 153//153 152//152 140//140 
f 140//140 152//152 134//134 
f 134//134 152//152 158//158 
f 137//137 113//113 143//143 
f 143//143 145//145 137//137 
f 142//142 143//143 113//113 
f 145//145 143//143 166//166 
f 135//135 148//148 142//142 
f 142//142 148//148 143//143 
f 143//143 148//148 166//166 
f 139//139 144//144 183//183 
f 147//147 183//183 144//144 
f 183//183 147//147 187//187 
f 144//144 145//145 147//147 
f 146//146 147//147 145//145 
f 145//145 166//166 146//146 
f 147//147 146//146 187//187 
f 149//149 135//135 158//158 
f 161//161 149//149 158//158 
f 149//149 148//148 135//135 
f 149//149 150//150 148//148 
f 149//149 165//165 150//150 
f 165//165 149//149 161//161 
f 155//155 153//153 84//84 
f 159//159 152//152 154//154 
f 153//153 154//154 152//152 
f 155//155 154//154 153//153 
f 160//160 159//159 154//154 
f 156//156 84//84 178//178 
f 84//84 156//156 155//155 
f 156//156 178//178 189//189 
f 189//189 191//191 156//156 
f 156//156 191//191 155//155 
f 155//155 160//160 154//154 
f 155//155 191//191 157//157 
f 157//157 160//160 155//155 
f 152//152 159//159 158//158 
f 161//161 158//158 159//159 
f 159//159 160//160 161//161 
f 165//165 161//161 151//151 
f 161//161 171//171 151//151 
f 171//171 161//161 160//160 
f 195//195 170//170 172//172 
f 171//171 160//160 162//162 
f 172//172 162//162 163//163 
f 172//172 163//163 195//195 
f 162//162 172//172 171//171 
f 160//160 157//157 163//163 
f 157//157 192//192 163//163 
f 160//160 163//163 162//162 
f 148//148 150//150 166//166 
f 168//168 146//146 166//166 
f 168//168 166//166 167//167 
f 187//187 146//146 164//164 
f 164//164 146//146 168//168 
f 150//150 165//165 169//169 
f 165//165 151//151 169//169 
f 150//150 167//167 166//166 
f 197//197 164//164 170//170 
f 167//167 164//164 168//168 
f 170//170 164//164 167//167 
f 150//150 169//169 167//167 
f 167//167 169//169 170//170 
f 151//151 171//171 169//169 
f 169//169 171//171 172//172 
f 170//170 169//169 172//172 
f 183//183 173//173 139//139 
f 127//127 139//139 173//173 
f 127//127 173//173 123//123 
f 174//174 173//173 184//184 
f 173//173 182//182 184//184 
f 65//65 133//133 124//124 
f 100//100 175//175 176//176 
f 100//100 124//124 175//175 
f 100//100 177//177 99//99 
f 100//100 176//176 177//177 
f 123//123 174//174 129//129 
f 174//174 176//176 129//129 
f 174//174 123//123 173//173 
f 174//174 184//184 176//176 
f 184//184 177//177 176//176 
f 181//181 103//103 180//180 
f 184//184 179//179 177//177 
f 177//177 180//180 99//99 
f 180//180 177//177 181//181 
f 103//103 181//181 193//193 
f 181//181 177//177 179//179 
f 179//179 193//193 181//181 
f 182//182 173//173 183//183 
f 182//182 183//183 186//186 
f 182//182 186//186 184//184 
f 185//185 184//184 186//186 
f 179//179 184//184 185//185 
f 185//185 194//194 179//179 
f 193//193 179//179 194//194 
f 183//183 187//187 186//186 
f 187//187 185//185 186//186 
f 188//188 185//185 197//197 
f 194//194 185//185 188//188 
f 189//189 103//103 190//190 
f 193//193 190//190 103//103 
f 190//190 193//193 196//196 
f 189//189 190//190 191//191 
f 190//190 192//192 191//191 
f 192//192 195//195 163//163 
f 192//192 190//190 196//196 
f 195//195 192//192 196//196 
f 193//193 194//194 196//196 
f 196//196 188//188 195//195 
f 196//196 194//194 188//188 
f 197//197 170//170 188//188 
f 170//170 195//195 188//188 
f 185//185 187//187 197//197 
f 164//164 197//197 187//187 
f 178//178 198//198 189//189 
f 198//198 103//103 189//189 
f 103//103 198//198 102//102 
f 198//198 178//178 102//102 
f 191//191 192//192 199//199 
f 192//192 157//157 199//199 
f 157//157 191//191 199//199 
