# PIPER geometrical reference model based on a manual segmentation. See the
# documentation for more info.
# Author: CEESAR, SOTON, UCBL-Ifsttar
# Version: 1.0.0
# License: Creative Commons Attribution 4.0 International License.
# (https://creativecommons.org/licenses/by/4.0/)
# 
# This work has received funding from the European Union Seventh Framework
# Program ([FP7/2007-2013]) under grant agreement 605544 [PIPER project]).
# Contributors include Pierre Maillez, Christophe Lecomte (SOTON), Erwan
# Jolivet (CEESAR), Philippe Beillas (UCBL-Ifsttar)
# This work is derived from a CT scan provided by CEESAR under a CCBY-4.0
# License
# 
# wavefront obj file written by the visualization toolkit

mtllib C:/desktop/registration_reference_model/22_REF_LTE635_Assembly_hands_corr/CCTs635_BP064_Rib_r01L.mtl

v -22.322 181.106 -404.041
v 9.47598 218.425 -408.374
v -16.672 198.844 -407.76
v 17.458 140.601 -386.192
v -12.599 170.402 -399.353
v -22.343 184.511 -404.343
v -22.372 183.436 -403.039
v 27.461 144.266 -389.488
v -21.441 185.577 -403.231
v -4.49002 198.058 -402.968
v -21.95 186.401 -404.165
v -1.47402 195.458 -403.073
v -2.15602 197.653 -403
v -7.71402 198.613 -403.61
v -5.99302 195.67 -402.805
v -4.39202 194.02 -402.539
v -19 193.016 -407.046
v -4.47102 191.679 -402.48
v -6.31002 191.906 -402.398
v -21.299 186.756 -405.603
v -3.27402 190.874 -403.222
v -17.597 158.131 -389.228
v -8.14502 188.772 -402.194
v -8.73502 194.838 -403.262
v -8.78602 191.666 -402.946
v -19.132 191.754 -406.995
v -11.511 192.954 -403.418
v -19.785 192.507 -405.409
v -11.086 189.459 -402.981
v -14.082 190.578 -403.442
v 4.81898 222.529 -412.707
v -4.82702 188.074 -402.538
v -4.02602 187.746 -403.359
v -3.68602 187.745 -404.454
v -6.27702 187.807 -402.011
v -7.83402 186.212 -401.468
v -6.72902 185.16 -401.412
v -5.54902 184.781 -401.876
v -19.889 191.113 -404.647
v -7.77102 182.229 -400.278
v -6.32902 182.603 -400.931
v -5.96802 178.524 -400.486
v -7.40402 176.882 -398.288
v -21.002 180.145 -404.319
v -7.41201 178.024 -401.169
v -5.63802 182.495 -402.147
v -19.191 180.071 -404.482
v -6.85501 181.016 -402.408
v -9.38702 182.904 -400.373
v -11.991 183.339 -400.802
v -10.321 186.431 -401.85
v -13.875 186.678 -402.549
v -17.714 185.644 -402.454
v -11.387 180.213 -399.391
v -10.703 176.162 -397.746
v -7.38302 179.264 -399.127
v -8.68702 183.089 -404.041
v -15.926 181.145 -404.708
v -14.252 180.57 -399.854
v -19.586 184.19 -405.511
v -17.787 178.751 -399.35
v -15.561 183.023 -401.37
v -20.633 187.646 -403.59
v -19.703 185.878 -402.721
v -19.182 187.026 -406.198
v -20.16 183.666 -401.892
v -16.027 188.242 -406.503
v -9.38902 180.279 -402.654
v -20.9 177.574 -399.21
v -15.068 184.687 -405.807
v -19.169 181.913 -401.025
v -21.365 181.053 -400.942
v -12.806 187.33 -406.657
v -22.952 180.499 -402.487
v -22.438 180.816 -401.484
v -22.243 176.887 -399.429
v -6.11802 183.503 -403.761
v 11.469 145.353 -380.834
v 22.158 145.463 -385.161
v 14.488 143.822 -380.994
v 8.25399 145.096 -380.025
v 9.61599 143.486 -379.883
v -4.97002 184.934 -402.898
v -4.51502 186.362 -404.583
v 5.36899 145.324 -379.865
v 5.63099 143.335 -379.174
v -5.70702 185.003 -404.399
v -6.21402 180.016 -399.806
v 12.168 141.534 -380.303
v 10.289 140.854 -380.578
v 12.531 139.598 -381.115
v 8.85999 140.628 -381.359
v -13.341 190.399 -407.135
v 8.44399 141.624 -380.216
v -10.93 185.777 -405.959
v -18.023 193.676 -407.665
v -15.971 191.28 -407.002
v 6.28999 139.7 -380.841
v -10.755 192.921 -408.183
v -17.981 191.625 -407.082
v 6.06799 141.936 -379.334
v 3.54999 140.426 -379.199
v 3.83499 139.112 -379.55
v 3.65199 138.067 -380.281
v -20.786 190.321 -404.97
v -18.814 190.025 -403.769
v 29.849 151.694 -392.367
v 26.9 150.838 -391.841
v 30.77 148.085 -392.825
v 25.166 149.203 -389.479
v 25.057 148.047 -388.104
v -10.486 189.492 -407.267
v 25.228 146.591 -387.237
v -7.89302 191.063 -407.884
v -13.332 181.888 -404.6
v 27.616 150.128 -390.835
v 27.875 145.591 -389.137
v 25.695 145.305 -387.377
v -8.08402 188.591 -406.766
v 28.374 147.097 -389.288
v 28.806 148.924 -390.326
v 30.033 149.188 -391.487
v 29.687 146.904 -390.342
v 29.48 145.517 -390.988
v 29.007 144.196 -392.772
v 27.436 143.089 -390.725
v -21.21 184.85 -405.395
v 26.646 141.989 -392.144
v -14.464 193.478 -407.597
v -12.876 195.459 -408.517
v -17.578 196.006 -408.308
v 30.65 151.386 -393.062
v -16.664 195.637 -408.234
v -17.434 197.389 -408.072
v -21.425 188.033 -404.335
v -6.56301 179.612 -401.607
v 30.729 149.618 -394.047
v -14.977 197.832 -409.053
v -21.691 182.922 -402.042
v -16.086 197.798 -408.929
v -17.689 196.399 -406.648
v 30.155 152.955 -396.794
v 30.355 150.494 -395.217
v 30.446 151.845 -394.84
v 30.697 149.193 -395.926
v -18.535 194.884 -407.279
v 30.65 151.66 -397.002
v -18.532 193.897 -405.533
v -17.906 193.074 -404.812
v -15.046 193.748 -404.249
v -16.469 195.657 -405.611
v -5.87502 180.793 -401.489
v 25.822 150.733 -392.458
v 27.366 152.065 -393.943
v 25.491 150.764 -394.025
v 29.917 152.985 -394.207
v 28.675 152.723 -393.584
v 28.815 153.78 -396.159
v 27.551 153.188 -395.689
v 26.03 151.429 -395.355
v 25.688 151.414 -398.096
v -11.601 196.927 -404.445
v 30.261 146.239 -393.645
v 30.497 148.851 -397.44
v 29.488 144.574 -394.973
v 29.749 147.845 -398.163
v -20.231 188.818 -406.302
v 30.649 147.514 -395.612
v 29.3 144.912 -396.814
v 28.322 143.527 -396.392
v 27.561 153.322 -397.522
v 29.588 151.587 -399.03
v 28.239 152.06 -399.418
v 28.267 149.977 -399.913
v 30.237 150.493 -398.498
v 26.88 151.447 -399.519
v 26.451 152.425 -397.007
v 26.999 148.8 -400.224
v 28.581 148.28 -399.62
v 28.472 145.504 -398.411
v -1.84502 192.985 -408.371
v -1.32002 195.164 -409.68
v 25.102 145.291 -397.672
v 25.519 148.457 -399.777
v 27.244 147.121 -399.879
v 25.861 146.207 -399.152
v 0.927983 198.229 -410.76
v 0.898983 196.27 -409.643
v 27.459 145.042 -398.741
v -20.13 190.923 -406.579
v 28.098 142.74 -393.777
v 3.63098 215.032 -416.964
v -6.76102 194.152 -409.118
v 25.901 141.933 -392.987
v -4.56002 190.227 -407.128
v 3.27198 216.144 -418.015
v 23.162 142.329 -391.526
v -4.80502 187.644 -405.569
v 27.397 142.745 -395.291
v 26.949 143.221 -396.456
v 26.5 144.568 -398.151
v 0.279981 215.794 -408.215
v -4.78602 192.05 -408.252
v -2.65502 213.211 -406.878
v -2.30902 189.794 -405.49
v -2.16702 191.005 -406.915
v -3.39802 188.723 -405.691
v -2.66002 189.652 -404.352
v -1.16402 191.372 -405.409
v -0.610017 193.101 -404.344
v -2.27802 215.171 -408.594
v -6.08902 197.565 -410.585
v 19.104 145.981 -384.709
v 19.018 144.266 -383.682
v 0.607983 194.661 -408.419
v 6.43298 210.929 -412.352
v -0.848017 191.948 -406.725
v 0.376983 193.401 -406.774
v 2.36698 197.119 -408.773
v 17.431 144.678 -382.922
v 0.585983 195.106 -404.735
v 1.22598 194.975 -405.93
v 4.21198 217.941 -415.73
v -0.521017 194.928 -403.573
v -0.628017 198.292 -403.629
v 17.278 146.535 -384.447
v 3.22898 219.231 -416.221
v 23.05 149.294 -390.265
v 21.74 149.153 -391.454
v 16.187 149.233 -386.527
v 2.33798 210.356 -418.069
v 0.121982 209.508 -417.656
v 21.58 148.244 -388.083
v 23.456 146.27 -386.618
v -1.08902 206.393 -415.85
v 22.988 148.995 -389.299
v 17.859 148.353 -386.43
v 20.95 147.368 -387.158
v 18.705 148.956 -387.961
v 19.473 149.07 -389.033
v 20.228 147.425 -392.353
v 4.04698 215.781 -415.581
v 0.419982 204.986 -415.125
v 3.88098 200.847 -410.142
v 17.406 148.998 -389.578
v 15.516 149.659 -387.671
v -2.91902 207.308 -415.729
v 14.412 145.425 -389.304
v 19.4 148.655 -390.584
v 17.436 147.885 -390.632
v 15.549 148.412 -389.34
v 14.158 149.292 -387.912
v 0.736982 207.695 -416.478
v 18.145 145.046 -390.964
v 16.672 146.603 -390.502
v 8.21599 148.848 -382.751
v 10.871 149.583 -384.347
v 12.253 149.546 -386.742
v 14.014 149.255 -386.201
v 8.91899 150.052 -385.66
v 1.75098 205.302 -414.504
v 7.39699 150.047 -384.169
v 4.40699 148.914 -382.229
v 5.68699 150.593 -385.021
v 6.01699 150.572 -386.065
v 1.34898 213.079 -420.306
v 14.484 145.312 -381.664
v 12.689 148.414 -383.835
v 10.823 148.389 -382.897
v 14.266 148.034 -384.535
v 9.44799 146.779 -381.239
v 1.40198 214.95 -420.5
v 11.483 149.224 -387.39
v -5.81502 208.952 -415.154
v 3.86499 150.927 -387.217
v -6.73602 210.794 -414.935
v 7.66599 149.408 -387.043
v 13.612 148.596 -388.44
v 13.226 147.377 -388.845
v -4.84502 213.105 -415.526
v -5.38202 213.927 -414.242
v -2.13102 210.18 -417.114
v 12.173 144.826 -388.44
v 12.095 146.481 -388.594
v 9.67699 148.689 -387.431
v 9.28799 147.486 -387.91
v 3.46498 201.615 -410.996
v 2.94998 212.547 -419.793
v 4.60998 204.115 -411.693
v 8.34699 144.5 -387.574
v 8.05599 146.266 -387.892
v -3.68602 211.704 -416.608
v 6.44099 148.576 -387.741
v 4.94799 145.597 -387.747
v 5.30599 147.281 -388.115
v 23.948 142.648 -387.323
v 23.71 144.861 -385.977
v 19.237 142.562 -384.016
v 21.472 143.5 -384.711
v 23.904 143.658 -386.41
v 21.154 141.789 -385.797
v 18.726 141.754 -384.255
v 16.554 141.47 -382.483
v 2.52598 197.147 -407.546
v 16.765 143.414 -381.993
v 0.348981 211.797 -418.841
v 1.84898 211.422 -419.172
v 14.467 141.122 -381.271
v 14.044 139.145 -382.159
v 15.475 139.468 -383.475
v 15.834 139.56 -385.001
v 4.70698 202.342 -409.461
v 17.393 140.676 -384.104
v 21.527 141.273 -387.384
v 25.013 141.919 -389.745
v 23.649 141.535 -389.949
v 19.156 140.966 -386.274
v 20.947 141.298 -388.666
v 18.191 143.471 -390.055
v 16.464 140.979 -387.298
v 18.846 142.05 -388.914
v 18.779 141.147 -387.498
v -0.572019 213.277 -418.802
v 12.911 142.378 -387.543
v 0.328981 215.687 -419.31
v 15.575 142.252 -388.206
v 15.136 144.097 -389.182
v 12.171 138.789 -382.224
v 13.017 138.763 -383.977
v 13.595 138.63 -382.987
v 9.19899 140.114 -383.011
v 8.89599 140.504 -384.322
v -1.82202 214.754 -417.793
v 9.21999 142.617 -386.849
v 13.045 140.501 -386.285
v 12.924 139.482 -385.209
v 7.37499 140.13 -383.438
v 0.839981 217.165 -418.736
v 2.25898 216.506 -419.289
v 7.19199 139.808 -382.238
v 3.99899 137.993 -381.689
v 3.35798 213.606 -416.297
v 1.47998 218.396 -417.918
v 5.06699 141.149 -384.915
v 4.00499 139.264 -383.65
v -1.96002 216.115 -416.668
v 8.45799 141.47 -385.675
v 6.19899 143.169 -386.612
v 6.17599 140.532 -384.398
v 10.837 143.535 -387.703
v 24.319 149.883 -394.689
v -0.616019 216.606 -417.387
v 20.781 148.319 -392.191
v -2.63602 216.398 -414.648
v 20.284 146.129 -392.63
v 21.096 144.876 -392.695
v 23.663 144.293 -394.659
v 24.014 149.145 -395.711
v 25.156 149.937 -398.712
v 23.083 147.527 -395.917
v 22.958 145.896 -395.509
v 23.747 146.441 -396.909
v 21.347 143.545 -391.68
v 0.942987 146.057 -379.69
v 3.81299 147.378 -380.967
v 0.516981 218.292 -417.48
v -2.91301 148.332 -380.192
v -0.293019 217.923 -415.732
v 2.54198 205.729 -413.489
v -1.35401 146.533 -379.456
v -0.627013 148.898 -381.322
v 3.11499 144.237 -379.113
v 0.874981 220.069 -416.288
v -4.46401 147.952 -380.007
v -5.46601 146.896 -380.219
v 2.13898 220.4 -416
v -3.07901 146.199 -379.383
v -6.23001 145.558 -380.879
v 3.08799 142.378 -378.866
v -0.577013 144.764 -379.023
v -1.88801 142.185 -379.758
v -14.723 200.532 -410.247
v -1.11901 143.562 -379.032
v -14.24 203.928 -410.373
v -13.34 203.138 -411.249
v -12.241 205.391 -412.19
v -2.36301 141.088 -381.331
v 0.883988 141.218 -379.279
v -0.213012 140.372 -380.22
v 2.17499 139.19 -379.738
v -10.104 197.476 -409.824
v 0.675988 139.377 -381.253
v -3.52701 144.177 -379.728
v -8.23602 200.433 -411.269
v -11.763 167.997 -393.296
v -12.687 201.069 -410.937
v -12.11 203.052 -411.699
v -5.09401 156.103 -386.04
v -7.63501 154.638 -384.418
v -12.897 206.488 -411.578
v 3.03798 207.023 -413.238
v -9.56502 206.072 -413.24
v -12.482 208.006 -411.799
v 0.779981 213.909 -406.274
v -7.70901 162.633 -392.558
v -10.72 209.369 -412.738
v 3.94598 208.196 -413.04
v -9.70002 208.789 -413.663
v 2.29398 209.73 -414.494
v -7.90401 158.232 -386.856
v -7.22901 159.019 -388.264
v -4.74701 156.774 -387.583
v 0.208982 210.777 -404.551
v -7.14001 160.263 -390.261
v -6.19301 158.781 -389.463
v -6.20001 159.463 -390.93
v -4.54701 156.963 -389.272
v -4.42101 156.517 -390.585
v -6.36301 158.08 -392.808
v -11.599 209.03 -410.174
v -13.345 206.051 -409.796
v -8.91501 156.939 -385.756
v -13.53 157.306 -386.865
v -15.371 155.742 -387.237
v -10.262 162.816 -390.007
v -11.961 161.438 -388.653
v -12.943 165.045 -390.729
v -11.411 166.024 -391.784
v -8.81801 163.092 -391.435
v -14.851 164.318 -390.582
v -15.46 201.69 -409.612
v -16.279 197.693 -406.548
v -16.098 199.398 -409.117
v -15.828 200.412 -407.989
v -17.218 162.492 -390.562
v -13.255 199.409 -406.073
v -8.53101 160.488 -388.937
v -10.029 160.091 -387.9
v -11.36 157.36 -386.211
v -14.052 160.882 -388.727
v -13.896 202.142 -407.766
v -16.428 158.965 -388.841
v -19.716 161.291 -391.164
v -14.351 203.355 -408.754
v -18.646 156.332 -389.899
v -19.456 158.501 -390.538
v -10.512 201.107 -405.519
v -20.183 157.951 -391.763
v -8.34902 172.231 -397.899
v -9.19501 171.363 -396.744
v -6.22902 177.361 -399.211
v -12.436 205.954 -408.569
v -6.92802 175.472 -399.218
v -6.84502 176.742 -400.294
v 3.11898 211.746 -415.59
v -9.16302 204.829 -406.164
v -7.95502 173.635 -399.266
v 3.90198 211.457 -414.8
v -8.06701 174.681 -398.006
v -13.148 177.597 -398.296
v -13.067 174.341 -396.815
v -10.76 173.768 -396.911
v -9.32701 173.705 -397.362
v -8.85902 209.217 -407.999
v -15.876 175.282 -397.123
v -18.459 175.754 -397.504
v -18.206 171.993 -395.459
v -10.843 169.464 -394.873
v -3.67102 196.424 -410.402
v -13.911 168.2 -392.796
v -13.045 170.375 -394.588
v -10.203 166.982 -393.445
v -9.51301 169.451 -395.873
v -11.204 171.152 -395.629
v -8.98302 169.73 -397.25
v 5.18098 203.102 -410.525
v 1.75698 208.432 -415.882
v -4.80702 200.189 -411.935
v 6.48298 205.861 -409.966
v -15.708 170.433 -394.299
v 4.12298 213.946 -414.775
v -15.63 167.137 -392.176
v -18.9 169.366 -394.057
v -18.629 166.51 -392.598
v -8.36002 175.086 -400.25
v -8.80501 170.832 -398.302
v -9.85902 172.859 -399.81
v -9.11001 171.938 -399.168
v -2.28502 200.174 -412.47
v 6.12098 206.196 -410.823
v -0.775017 199.044 -411.794
v -12.107 173.972 -400.603
v 7.69098 210.955 -411.053
v -11.675 177.711 -402.074
v -15.284 175.929 -402.36
v -15.417 172.118 -400.608
v -1.16602 201.756 -413.202
v -18.488 174.386 -402.272
v -10.738 168.95 -398.539
v -9.68001 169.2 -398.141
v -18.159 170.461 -400.559
v -15.879 168.455 -399.101
v -19.234 168.023 -399.359
v -8.28901 164.514 -394.352
v -6.28801 159.873 -392.202
v -7.40301 161.565 -393.882
v 0.242982 201.991 -412.904
v -9.07701 165.457 -393.461
v -8.75001 161.613 -394.951
v -8.78102 166.551 -395.597
v 5.57898 207.418 -411.532
v -8.44501 163.906 -395.239
v 4.95598 213.294 -413.345
v -10.747 164.817 -396.814
v -12.549 166.476 -397.81
v -9.36601 165.208 -396.258
v 1.79998 201.893 -411.794
v -20.131 166.004 -398.054
v 2.41398 199.198 -410.288
v -14.93 162.424 -396.236
v -17.588 164.526 -397.616
v -11.084 161.276 -395.451
v -7.84801 157.795 -393.492
v -12.386 155.929 -392.865
v -13.015 159.257 -394.6
v -9.80701 156.992 -393.424
v -17.702 161.322 -395.784
v -8.10402 208.129 -414.197
v -6.46002 205.88 -413.938
v -19.076 160.454 -395.17
v -16.303 157.719 -393.937
v -5.68302 202.634 -412.814
v -2.40402 202.487 -413.633
v 8.78598 214.48 -410.418
v -21.023 160.388 -392.108
v -21.19 162.995 -392.67
v -21.199 160.219 -393.345
v -19.853 157.645 -392.878
v 6.35598 208.57 -411.961
v -22.561 175.246 -398.866
v -20.526 171.133 -395.431
v -22.194 170.397 -396.024
v 2.74398 203.756 -412.686
v -20.558 174.995 -397.396
v -22.053 172.77 -396.994
v 5.25198 209.662 -413.66
v 6.51898 209.48 -412.347
v -21.041 168.588 -394.553
v -22.952 171.424 -397.375
v -4.91102 200.796 -403.616
v -23.19 171.099 -398.52
v -7.25802 202.45 -404.497
v -21.732 166.111 -397.335
v -23.04 169.413 -397.067
v -2.72202 200.74 -403.433
v -22.459 166.633 -396.032
v 3.12598 215.024 -419.575
v 2.40798 198.809 -406.48
v 8.23098 207.99 -409.93
v 8.08798 208.095 -410.934
v -23.094 173.378 -398.636
v 3.42498 213.569 -419.42
v -1.11302 202.375 -404.049
v -22.852 172.468 -399.774
v 1.83298 201.03 -405.726
v 0.687982 202.55 -404.992
v -21.974 176.653 -402.617
v -22.697 178.119 -402.551
v -22.988 176.046 -400.983
v -23.037 177.513 -400.803
v -22.287 174.557 -401.466
v -20.535 175.828 -402.812
v -22.222 171.106 -399.888
v -20.837 173.044 -401.539
v -21.232 168.171 -398.873
v -22.42 167.904 -397.828
v -19.935 164.57 -392.303
v 5.40198 213.345 -411.782
v -21.962 167.069 -394.694
v -7.70102 207.721 -406.423
v -22.28 164.39 -395.939
v -5.38502 207.738 -405.132
v -2.37602 209.017 -404.669
v 3.39498 199.533 -409.076
v -4.24302 205.529 -404.225
v -21.15 164.257 -396.795
v -1.97002 207.219 -404.125
v -2.02102 204.638 -403.996
v -22.398 164.254 -394.538
v -19.39 163.851 -397.132
v -20.45 160.171 -394.479
v -19.141 157.92 -393.791
v 5.12298 211.639 -414.057
v -0.490018 205.396 -404.335
v 4.17599 150.128 -383.415
v 2.68398 208.568 -404.82
v 0.600982 209.075 -404.211
v 2.75199 151.475 -384.95
v 1.37499 151.379 -383.768
v -0.726013 151.578 -382.99
v -0.721019 214.288 -406.712
v -0.424013 152.912 -384.425
v 2.48099 151.747 -386.464
v -9.69602 210.667 -412.097
v -2.72801 154.646 -385.865
v 0.703987 152.669 -385.318
v -1.34702 212.746 -405.829
v -5.84901 153.318 -383.526
v -5.91901 150.403 -381.687
v -11.227 209.712 -411.145
v -4.21501 150.633 -381.773
v -3.74801 153.98 -384.374
v -6.18401 155.616 -385.124
v 1.08499 149.698 -382.18
v -6.52401 143.46 -385.622
v 3.64598 200.484 -407.872
v 0.041987 153.103 -387.187
v -1.61001 154.312 -387.288
v -0.349013 152.786 -388.562
v -2.60701 154.907 -389.495
v 1.89599 151.052 -387.998
v 1.09999 149.8 -388.841
v -8.34802 211.475 -413.067
v -1.65101 152.374 -389.799
v -2.96401 151.581 -390.259
v -7.56702 211.641 -413.984
v -6.70101 149.789 -389.843
v -3.51401 154.437 -390.748
v -5.25301 154.294 -391.867
v -5.88901 153.451 -391.844
v -7.16501 153.363 -391.973
v -4.92001 151.16 -390.503
v -2.88601 148.997 -389.555
v 2.07899 147.346 -388.556
v -0.299013 148.997 -389.284
v 3.28399 149.245 -388.365
v -0.232013 145.977 -387.902
v -7.81002 212.211 -412.097
v 3.52399 145.244 -387.601
v -6.70201 146.936 -388.217
v -3.66501 145.856 -387.547
v -10.431 154.111 -384.691
v -8.34301 152.38 -383.322
v 3.17698 212.28 -418.092
v -13.374 154.625 -385.996
v -12.66 152.222 -385.071
v -4.79602 214.987 -413.221
v -10.645 151.162 -383.827
v -13.781 150.381 -386.022
v -14.686 152.634 -386.48
v -7.22901 149.269 -381.533
v -8.77402 210.453 -409.503
v -8.63501 147.784 -382.017
v -9.29501 149.304 -382.613
v -8.62701 146.441 -382.292
v -12.246 150.017 -384.576
v -11.813 147.973 -384.696
v -11.727 146.888 -386.331
v -6.99602 211.777 -409.818
v -10.432 145.854 -386.478
v -9.68001 145.954 -383.685
v -10.454 145.926 -384.92
v -8.56501 144.809 -386.276
v -8.23101 144.042 -384.971
v -9.45801 150.615 -390.32
v -5.72202 213.989 -411.389
v -10.27 153.23 -391.666
v -13.572 152.947 -391.471
v -12.004 150.939 -390.306
v -16.002 152.483 -387.785
v -17.049 155.773 -388.369
v -17.449 154.136 -389.165
v -13.905 149.273 -387.459
v -15.369 151.153 -387.765
v -4.15602 213.292 -408.436
v -15.619 152.654 -391.175
v -15.169 154.761 -392.552
v -17.141 156.525 -393.394
v -3.64002 216.03 -412.134
v -18.843 155.679 -391.436
v -17.281 154.552 -392.089
v -13.618 150.24 -389.638
v -15.159 150.811 -389.31
v -16.847 152.724 -390
v -8.84401 146.134 -387.549
v -10.832 146.91 -387.877
v -4.19402 214.681 -410.134
v -9.30601 148.225 -389.063
v -12.768 148.275 -388.11
v -11.65 148.653 -389.228
v 0.550988 140.847 -383.991
v -1.62001 140.532 -382.575
v 2.35999 138.279 -381.512
v -1.29402 217.225 -414.405
v 4.06999 138.319 -382.768
v 1.01499 139.488 -382.639
v -2.78002 216.253 -410.863
v 3.08799 142.831 -385.814
v -1.68801 143.521 -386.069
v -1.28401 141.124 -383.923
v -4.23501 142.971 -380.766
v 3.86698 205.122 -406.435
v -3.60501 141.55 -382.497
v -7.53201 144.777 -382.327
v -5.99901 143.05 -382.528
v -0.007019 218.077 -414.383
v -7.24901 143.347 -383.962
v 0.970981 220.256 -414.741
v 3.63398 202.844 -407.06
v -4.65801 143.491 -386.06
v -4.74201 142.329 -384.482
v 6.07298 221.287 -410.726
v 2.07398 204.353 -405.547
v 4.40698 221.613 -411.085
v 5.79098 221.925 -412.183
v 1.75498 220.585 -413.425
v 2.46598 221.777 -413.458
v -0.314019 217.628 -412.406
v 3.24098 221.768 -412.21
v 3.35398 220.69 -415.199
v 3.88398 221.962 -413.9
v 6.25198 214.385 -411.154
v 2.18698 221.418 -414.733
v 9.56098 215.953 -408.048
v 8.30398 216.632 -407.58
v -0.552019 216.793 -410.332
v 5.98998 215.217 -407.527
v 5.05198 216.451 -408.229
v 9.48098 214.195 -409.271
v 8.37898 212.828 -409.896
v 8.32898 210.941 -408.084
v 8.90198 213.072 -408.629
v 1.60498 217.04 -409.492
v 7.50998 207.747 -408.597
v 8.52198 210.282 -409.844
v 2.88898 213.955 -420.709
v 5.19698 210.463 -405.61
v 4.65098 208.182 -405.812
v 3.50298 211.156 -405.108
v 8.53098 213.889 -407.888
v 7.27998 211.597 -406.866
v 7.42998 214.201 -407.304
v 3.80798 213.631 -406.209
v 7.15898 209.016 -407.309
v 1.08198 218.059 -411.571
v 8.05498 219.877 -409.99
v 10.285 219.047 -410.42
v 9.32398 218.788 -411.681
v 8.23498 219.023 -411.248
v 11.06 216.586 -409.991
v 4.97798 203.575 -408.716
v 10.966 217.715 -409.584
v -6.38602 211.311 -408.19
v 10.722 215.858 -411.114
v 8.36998 217.745 -411.753
v 9.70698 215.639 -411.387
v 11.034 217.657 -411.403
v 9.62198 217.075 -412.016
v 6.35098 219.936 -409.736
v 5.26898 218.307 -409.25
v 4.69298 220.073 -410.308
v 7.91198 218.28 -408.295
v 7.22198 219.87 -411.522
v 3.08698 218.602 -410.379
v 2.63398 219.405 -411.485
v 7.11498 218.186 -411.875
v 5.07798 205.019 -407.685
v -6.16302 209.956 -406.702
v 7.61298 216.328 -411.297
v 3.18798 216.796 -408.557
v 6.29598 220.747 -412.586
v 6.09998 218.89 -413.406
v -4.23402 211.611 -406.914
v 5.47698 221.113 -413.406
v -3.96602 209.819 -405.589
v 6.51798 216.594 -411.865
v 5.11198 215.093 -412.532
v 5.80298 217.279 -413.429
v 28.835 153.381 -397.672
v 9.82398 218.47 -408.948
v 28.692 153.487 -397.228
vn -0.724619 -0.134549 -0.675887
vn 0.38663 0.532575 0.752915
vn -0.902613 0.408712 0.135069
vn 0.232687 -0.949392 -0.210977
vn 0.15525 -0.357084 -0.92108
vn -0.947775 0.161017 -0.275313
vn -0.914625 0.234145 0.329602
vn 0.651396 -0.473039 0.593226
vn -0.598963 0.333873 0.727855
vn -0.0621581 0.158392 0.985418
vn -0.958872 0.244654 0.143905
vn 0.336845 -0.023782 0.94126
vn 0.196951 0.113097 0.973868
vn -0.250122 0.218024 0.943347
vn -0.133666 0.128758 0.982626
vn 0.0599836 0.0622147 0.996259
vn -0.774145 0.131074 -0.61929
vn 0.247693 -0.0338734 0.968246
vn -0.0841348 0.106412 0.990756
vn -0.697331 0.0274163 -0.716225
vn 0.560964 -0.218183 0.798571
vn -0.5181 0.161334 0.839967
vn -0.117177 0.213989 0.969783
vn -0.209264 0.150798 0.966162
vn -0.184995 0.140821 0.972598
vn -0.431682 -0.00816505 -0.901989
vn -0.155534 0.1696 0.973162
vn -0.829271 0.494804 0.259766
vn -0.140535 0.211039 0.967322
vn -0.0870799 0.199802 0.975959
vn 0.185878 0.976555 -0.108583
vn 0.53517 -0.0636254 0.842345
vn 0.813415 -0.303217 0.496402
vn 0.82659 -0.554154 -0.0982953
vn 0.170673 0.142351 0.974991
vn 0.0271592 0.263577 0.964256
vn 0.276511 0.205883 0.938698
vn 0.693807 0.0277745 0.719625
vn -0.624763 0.460571 0.630512
vn 0.188092 0.349216 0.91797
vn 0.645956 0.181232 0.74155
vn 0.932565 -0.158961 -0.32412
vn 0.417016 0.0832883 0.905075
vn -0.263868 -0.298809 -0.917108
vn 0.348543 -0.385687 -0.854262
vn 0.957445 -0.284159 -0.0505311
vn -0.026023 -0.30459 -0.952128
vn 0.41516 -0.449581 -0.790897
vn -0.00307494 0.352561 0.935784
vn -0.128272 0.392088 0.910941
vn -0.139761 0.332363 0.932739
vn -0.101117 0.29891 0.948909
vn -0.0726229 0.311149 0.947582
vn -0.0367753 0.386769 0.921443
vn 0.104247 0.328827 0.938619
vn 0.182213 0.345982 0.920377
vn 0.19435 -0.459757 -0.866517
vn 0.0797967 -0.332933 -0.939568
vn -0.116284 0.44038 0.890249
vn -0.0915754 -0.236446 -0.96732
vn -0.100697 0.476817 0.873216
vn -0.104749 0.404386 0.90857
vn -0.443751 0.315318 0.838844
vn -0.201147 0.327966 0.923027
vn -0.121706 -0.188598 -0.974484
vn -0.187378 0.394721 0.899491
vn -0.0557341 -0.185286 -0.981103
vn 0.226865 -0.439589 -0.869076
vn -0.265556 0.474856 0.839042
vn 0.00568509 -0.287819 -0.957668
vn -0.0893894 0.409601 0.907875
vn -0.323638 0.395481 0.859566
vn -0.0219974 -0.264613 -0.964104
vn -0.991287 0.131015 -0.0136434
vn -0.727137 0.356431 0.58671
vn -0.577031 0.392628 0.716156
vn 0.514535 -0.460532 -0.7233
vn 0.216311 0.436641 0.873244
vn 0.379473 0.435895 0.816086
vn 0.342311 0.17273 0.923573
vn 0.140952 0.387782 0.91091
vn 0.17021 0.0536524 0.983946
vn 0.945086 -0.316946 0.0797293
vn 0.753757 -0.492612 -0.434952
vn 0.106059 0.44296 0.890246
vn 0.135908 0.126702 0.982586
vn 0.473801 -0.519633 -0.710981
vn 0.788188 0.226044 0.572419
vn 0.182816 -0.186831 0.965232
vn -0.110639 -0.583825 0.804306
vn 0.0877221 -0.613584 0.784742
vn 0.0167393 -0.860229 0.509633
vn -0.121286 -0.194802 -0.973315
vn 0.194767 -0.478135 0.856418
vn 0.128641 -0.395131 -0.909573
vn -0.299801 -0.135996 -0.944259
vn -0.0428117 -0.197399 -0.979388
vn 0.482478 -0.757198 0.440303
vn -0.144716 -0.284237 -0.947769
vn -0.0884019 -0.197153 -0.976379
vn 0.217921 -0.18514 0.958245
vn 0.0291111 -0.219688 0.975136
vn 0.163148 -0.464277 0.870534
vn 0.0705532 -0.876545 0.476121
vn -0.896873 0.408916 0.16854
vn -0.245967 0.316868 0.916021
vn 0.386821 0.610029 0.691545
vn -0.210163 0.835759 0.507286
vn 0.975988 -0.0937367 0.196624
vn -0.0256427 0.817323 0.575609
vn 0.18887 0.634727 0.749299
vn -0.026575 -0.296882 -0.954544
vn 0.414657 0.34193 0.843293
vn -0.00349802 -0.376463 -0.926425
vn 0.174585 -0.396003 -0.9015
vn 0.0978903 0.696585 0.710765
vn 0.636214 -0.251428 0.729394
vn 0.626771 -0.0809268 0.77499
vn 0.117898 -0.426511 -0.896766
vn 0.552718 0.142642 0.82107
vn 0.465094 0.413211 0.782908
vn 0.777025 0.190914 0.59982
vn 0.800511 -0.076331 0.594438
vn 0.819418 -0.439127 0.368405
vn 0.810546 -0.562031 0.164728
vn 0.643478 -0.666253 0.376885
vn -0.476701 -0.10243 -0.873077
vn 0.375121 -0.922822 0.0876508
vn -0.100884 -0.26343 -0.959389
vn -0.175804 -0.320599 -0.930757
vn -0.516379 -0.00708434 -0.856331
vn 0.896193 0.320628 0.306653
vn -0.13092 -0.244128 -0.960865
vn -0.863903 0.341052 -0.370613
vn -0.900116 0.353792 0.254211
vn 0.633412 -0.366678 -0.681423
vn 0.996355 0.0631227 -0.0573728
vn -0.16741 -0.311543 -0.935369
vn -0.531862 0.383409 0.755063
vn -0.405225 -0.0736292 -0.911247
vn -0.750094 0.515112 0.414751
vn 0.745818 0.636483 -0.196581
vn 0.995852 0.0869924 -0.0266553
vn 0.975259 0.221054 0.00235435
vn 0.998867 0.0317771 -0.0354259
vn -0.884818 0.26538 -0.382976
vn 0.963522 0.210098 -0.165781
vn -0.664591 0.505984 0.549818
vn -0.319541 0.415714 0.851513
vn -0.219286 0.313041 0.924077
vn -0.349518 0.422364 0.836329
vn 0.950619 -0.219349 -0.219568
vn -0.3524 0.905172 0.237652
vn -0.538815 0.772885 0.335151
vn -0.542629 0.836648 0.0746579
vn 0.531556 0.790937 0.303097
vn -0.178426 0.844681 0.504656
vn 0.0693593 0.996211 0.0524693
vn -0.519221 0.817788 0.248258
vn -0.701421 0.697061 0.148708
vn -0.758981 0.590347 -0.27466
vn -0.281225 0.289243 0.915014
vn 0.923329 -0.378456 0.0650779
vn 0.926795 -0.182669 -0.32815
vn 0.850728 -0.521617 -0.0646394
vn 0.793556 -0.296441 -0.531405
vn -0.558913 -0.03631 -0.828431
vn 0.963307 -0.226722 -0.143655
vn 0.790334 -0.487935 -0.370529
vn 0.508168 -0.759947 -0.405273
vn -0.391144 0.875059 -0.285092
vn 0.608329 0.336779 -0.71869
vn 0.079516 0.565352 -0.821008
vn 0.305421 0.0934978 -0.947616
vn 0.82894 0.0115198 -0.559219
vn -0.373052 0.49296 -0.786017
vn -0.733008 0.679951 0.0191372
vn -0.0378643 0.00146367 -0.999282
vn 0.538269 -0.201778 -0.818262
vn 0.595784 -0.463693 -0.655767
vn 0.28939 -0.574038 -0.765985
vn 0.185478 -0.516888 -0.835718
vn -0.611757 -0.561163 -0.557538
vn -0.597164 -0.00562356 -0.8021
vn 0.104259 -0.33869 -0.935104
vn -0.449128 -0.43373 -0.781129
vn 0.397688 -0.421172 -0.815143
vn 0.460014 -0.525004 -0.716071
vn 0.170759 -0.621941 -0.764219
vn -0.722958 0.177163 -0.667791
vn 0.604035 -0.796912 -0.00849883
vn 0.984274 -0.0696084 -0.162356
vn -0.0894697 -0.370724 -0.924423
vn -0.0444695 -0.966685 -0.252078
vn 0.175811 -0.523827 -0.833484
vn 0.889492 0.237059 -0.39065
vn -0.343438 -0.808364 -0.478119
vn 0.366475 -0.519957 -0.771583
vn 0.21762 -0.928666 -0.300367
vn -0.09324 -0.844263 -0.527755
vn -0.257257 -0.72762 -0.635916
vn -0.214218 0.769533 0.601607
vn 0.0557541 -0.471896 -0.879889
vn -0.483601 0.552771 0.678656
vn 0.757591 -0.639458 -0.130956
vn 0.486545 -0.630051 -0.605235
vn 0.590375 -0.628229 -0.50674
vn 0.797297 -0.467418 0.381886
vn 0.800154 -0.594103 0.0824315
vn 0.721929 -0.404584 0.561364
vn -0.426179 0.72501 0.541047
vn -0.149283 -0.374324 -0.915203
vn 0.29059 0.63041 0.71982
vn 0.45862 0.192956 0.867431
vn 0.603633 -0.593988 -0.531795
vn 0.767226 0.210081 -0.605995
vn 0.634081 -0.678286 -0.371306
vn 0.807814 -0.577879 -0.116159
vn 0.793386 -0.499306 -0.348184
vn 0.436602 0.463223 0.771235
vn 0.781739 -0.214957 0.585387
vn 0.874651 -0.386179 0.293006
vn 0.798314 0.11328 -0.591492
vn 0.591073 -0.151458 0.792271
vn 0.470612 0.0912688 0.877607
vn 0.331449 0.651117 0.68278
vn 0.565784 0.436564 -0.6995
vn -0.244915 0.925117 0.290128
vn -0.333169 0.937081 -0.104299
vn 0.226377 0.849108 0.477252
vn 0.643157 -0.562608 -0.519443
vn -0.140657 -0.480088 -0.86587
vn 0.11065 0.750645 0.651374
vn 0.232016 0.578636 0.781888
vn -0.125881 -0.443753 -0.887264
vn -0.0255094 0.912182 0.408991
vn 0.354084 0.706807 0.612412
vn 0.226223 0.706191 0.670908
vn 0.227929 0.926921 0.298103
vn 0.0353424 0.997131 0.0669422
vn -0.607147 0.350368 -0.713172
vn 0.914772 -0.154093 -0.373427
vn 0.236012 -0.512917 -0.825357
vn 0.760923 -0.490974 -0.424195
vn -0.117352 0.882055 -0.456297
vn -0.0306953 0.992052 -0.122025
vn -0.301761 -0.359361 -0.883063
vn -0.34966 -0.157658 -0.923516
vn -0.261165 0.844794 -0.467028
vn -0.400342 0.453674 -0.796182
vn -0.326773 0.565341 -0.75737
vn -0.189738 0.888744 -0.417294
vn 0.336674 -0.509404 -0.791933
vn -0.447687 -0.353216 -0.821471
vn -0.468896 0.0235055 -0.882941
vn 0.129364 0.717707 0.684223
vn 0.222112 0.893763 0.389685
vn 0.0690971 0.976767 -0.202859
vn 0.136345 0.942532 0.305031
vn 0.140845 0.971809 -0.189075
vn 0.651385 -0.350901 -0.67273
vn 0.151786 0.894337 0.420859
vn 0.143211 0.660581 0.736969
vn 0.209387 0.950604 0.22915
vn 0.285436 0.937154 -0.20067
vn -0.308551 -0.350195 -0.884398
vn 0.340836 0.527368 0.778276
vn 0.420916 0.535909 0.731868
vn 0.242621 0.679261 0.692633
vn 0.3291 0.718423 0.612831
vn 0.167382 0.570001 0.804414
vn -0.232302 0.332173 -0.914165
vn -0.0928817 0.74913 -0.655879
vn -0.368375 -0.201998 -0.907467
vn 0.314956 0.728409 -0.608459
vn -0.500786 0.115435 -0.857839
vn 0.196373 0.663954 -0.721528
vn -0.29052 0.569872 -0.768664
vn -0.307993 0.230721 -0.922989
vn -0.626188 0.336697 -0.703224
vn -0.680614 0.597919 -0.423388
vn -0.391382 -0.281554 -0.876098
vn -0.251409 -0.23812 -0.938132
vn -0.268096 -0.032634 -0.962839
vn -0.101545 0.580202 -0.808118
vn -0.102067 0.220857 -0.969951
vn 0.473377 -0.45232 -0.755858
vn 0.597893 -0.565851 -0.567748
vn 0.610462 -0.294399 -0.735299
vn -0.142717 -0.328398 -0.933695
vn -0.0519956 -0.0604555 -0.996816
vn -0.523581 -0.0290157 -0.851482
vn 0.180251 0.278289 -0.943432
vn 0.0137528 -0.334466 -0.942307
vn 0.124728 -0.0466593 -0.991093
vn 0.539043 -0.645388 0.541209
vn 0.537776 0.0774361 0.839524
vn 0.469741 -0.364793 0.803909
vn 0.472104 -0.249871 0.845389
vn 0.584192 -0.382401 0.715883
vn 0.410718 -0.732797 0.542512
vn 0.511194 -0.607531 0.607937
vn 0.575536 -0.411165 0.706896
vn 0.911043 -0.388055 0.139331
vn 0.514057 0.0395166 0.856845
vn -0.407233 -0.399368 -0.821381
vn 0.185565 -0.62039 -0.762025
vn 0.429505 -0.28793 0.855933
vn 0.401643 -0.713417 0.574212
vn 0.505801 -0.823099 0.258213
vn 0.317413 -0.922854 -0.218151
vn 0.909995 -0.396202 0.122203
vn 0.552179 -0.750954 0.362169
vn 0.24832 -0.95253 0.176137
vn 0.402919 -0.872788 0.275497
vn 0.0566621 -0.990036 -0.128911
vn 0.24011 -0.964414 0.110694
vn -0.0819169 -0.953168 -0.291136
vn -0.319228 -0.570302 -0.756868
vn -0.0358575 -0.79027 -0.611709
vn -0.21708 -0.751299 -0.623238
vn -0.000209858 -0.933391 -0.35886
vn -0.581094 -0.100024 -0.807666
vn -0.219988 -0.495454 -0.840316
vn -0.553464 0.387915 -0.737021
vn -0.221471 -0.580612 -0.783479
vn -0.325385 -0.381576 -0.865173
vn -0.188409 -0.940361 0.283236
vn -0.080173 -0.95127 -0.297754
vn 0.20086 -0.976778 0.0745692
vn -0.181641 -0.982763 -0.0343933
vn -0.162708 -0.89558 -0.41408
vn -0.635051 0.278254 -0.720614
vn -0.193472 -0.540205 -0.818992
vn -0.191687 -0.654915 -0.730988
vn -0.147553 -0.806945 -0.571898
vn 0.150985 -0.920525 -0.360329
vn -0.387307 0.520786 -0.760773
vn 0.336247 0.552035 -0.763017
vn 0.364383 -0.930803 0.0288113
vn 0.177401 -0.980837 -0.0805512
vn 0.965652 -0.194482 -0.172315
vn -0.0234186 0.683882 -0.729217
vn -0.064558 -0.591913 -0.803412
vn -0.0708902 -0.644661 -0.761174
vn -0.588178 0.654798 -0.474643
vn -0.157943 -0.710137 -0.686119
vn -0.124111 -0.536932 -0.834446
vn 0.0614453 -0.738818 -0.671097
vn -0.181048 -0.403554 -0.896864
vn -0.607432 0.759063 -0.234201
vn -0.666835 0.571853 -0.477822
vn -0.56901 0.65931 -0.491464
vn -0.570548 0.791312 -0.219773
vn -0.615579 -0.101726 -0.781482
vn -0.568142 -0.492946 -0.658953
vn -0.57115 -0.621037 -0.53675
vn -0.758969 0.593232 -0.268406
vn -0.804294 0.340481 -0.487015
vn -0.823107 0.187745 -0.535953
vn -0.71667 -0.350687 -0.602829
vn -0.786431 -0.243704 -0.567569
vn -0.431149 -0.628842 -0.647045
vn 0.126415 0.460647 0.878535
vn 0.120062 0.565077 0.816256
vn -0.617506 0.57249 -0.53939
vn 0.102046 0.516929 0.849924
vn -0.815116 0.558538 -0.153693
vn 0.715184 -0.134961 -0.685783
vn 0.105692 0.398607 0.911011
vn 0.176889 0.559395 0.809807
vn 0.0845088 0.2705 0.959004
vn -0.48689 0.740132 -0.463835
vn -0.1854 0.334786 0.923875
vn -0.422648 0.0122915 0.90621
vn 0.0369156 0.750638 -0.659682
vn -0.177975 0.124432 0.976136
vn -0.529462 -0.266983 0.805227
vn 0.0273034 -0.0461452 0.998562
vn 0.00508068 0.162417 0.986709
vn -0.40405 -0.473973 0.782364
vn -0.440574 -0.18672 -0.878083
vn -0.192396 -0.141336 0.971086
vn -0.883054 0.275297 -0.380036
vn -0.508342 -0.0913057 -0.856301
vn -0.500775 -0.0725676 -0.86253
vn -0.492243 -0.792033 0.361084
vn -0.211763 -0.317859 0.924187
vn -0.454972 -0.679553 0.575507
vn -0.32323 -0.602441 0.729786
vn -0.159355 -0.354465 -0.92139
vn -0.501492 -0.855107 0.131519
vn -0.410656 -0.243624 0.87864
vn -0.168931 -0.365413 -0.915388
vn 0.331294 0.579874 0.744305
vn -0.200542 -0.324214 -0.924483
vn -0.285222 -0.256201 -0.923585
vn 0.380997 0.723947 0.575102
vn -0.0684652 0.497916 0.864518
vn -0.822228 0.169473 -0.543342
vn 0.618113 -0.164763 -0.768629
vn -0.267093 -0.255439 -0.9292
vn -0.829916 0.365972 -0.421075
vn -0.0418166 0.576077 0.816325
vn 0.851844 0.473377 0.224225
vn -0.625676 0.48365 -0.612056
vn 0.440969 -0.406806 -0.800035
vn -0.478207 0.111919 -0.871087
vn 0.763198 -0.385854 -0.518311
vn 0.253933 0.658518 0.708429
vn 0.513711 0.699504 0.496785
vn 0.579019 0.753975 0.310255
vn -0.0643055 0.325523 0.943345
vn 0.688956 0.612674 0.387261
vn 0.662567 0.673132 0.328479
vn 0.770866 0.611826 0.177299
vn 0.739759 0.67223 0.0293819
vn 0.815231 0.48336 -0.319001
vn 0.643057 0.021489 -0.765517
vn -0.681898 0.619939 0.388189
vn -0.856377 0.458815 0.236869
vn -0.00952355 0.517394 0.855694
vn -0.335792 0.332659 0.881239
vn -0.489469 0.186694 0.851801
vn 0.354486 0.585259 0.729254
vn -0.00852736 0.529383 0.84834
vn 0.054867 0.518613 0.853247
vn 0.346945 0.568773 0.745739
vn 0.610954 0.564094 0.555457
vn -0.187729 0.427311 0.8844
vn -0.890859 0.288781 -0.350679
vn -0.52863 0.458193 0.714569
vn -0.798662 0.0271095 -0.601169
vn -0.79322 0.46261 0.395973
vn -0.323534 0.347735 0.880003
vn -0.368634 0.387267 0.845064
vn 0.452564 0.650034 0.610445
vn 0.148507 0.597116 0.788288
vn -0.17605 0.424895 0.887958
vn -0.247786 0.424511 0.870858
vn -0.464902 0.403727 0.787953
vn -0.406172 0.300644 0.862924
vn -0.513575 0.211128 0.831664
vn -0.762477 0.459805 0.455201
vn -0.799661 -0.193414 0.568448
vn -0.694628 -0.0150201 0.719213
vn -0.400216 0.319391 0.858962
vn -0.899196 -0.374089 0.226945
vn 0.94717 -0.190673 0.2579
vn 0.741219 0.117777 0.660851
vn 0.909499 -0.16112 0.383214
vn -0.587249 0.422463 0.690408
vn 0.899014 -0.437624 0.0161077
vn 0.667642 -0.423724 -0.612137
vn 0.869983 -0.328462 -0.367754
vn -0.458961 0.299998 0.836275
vn 0.818184 -0.419181 -0.393526
vn 0.512119 -0.268172 -0.815977
vn 0.613499 -0.0657028 0.786957
vn -0.0236958 0.429282 0.90286
vn 0.0933273 0.430524 0.897741
vn 0.218012 0.361882 0.906373
vn 0.40055 0.224402 0.888371
vn -0.509178 0.549531 0.662385
vn -0.0117172 0.486947 0.873353
vn -0.0960953 0.513227 0.852856
vn -0.116668 0.481852 0.868451
vn 0.437884 0.507157 0.742327
vn -0.0494164 -0.435743 -0.898713
vn 0.0927855 0.571849 0.815095
vn 0.202681 0.531441 0.822491
vn 0.540368 0.519933 0.661568
vn 0.74201 0.325069 0.586303
vn 0.345097 0.405678 0.846365
vn 0.992281 -0.120047 -0.0311097
vn 0.841239 -0.447579 -0.303297
vn 0.859892 -0.377495 -0.343632
vn -0.195659 -0.404727 -0.89326
vn 0.846542 -0.504097 -0.171035
vn -0.0119732 0.530829 0.847394
vn 0.878873 -0.0573496 -0.473596
vn -0.12349 0.492376 0.861578
vn -0.226136 0.451675 0.863048
vn -0.289984 0.392853 0.872683
vn 0.385698 -0.394595 -0.833986
vn 0.894347 -0.314655 -0.31802
vn 0.254166 -0.340213 -0.905348
vn 0.562884 -0.369484 -0.739353
vn -0.0590338 -0.455127 -0.888467
vn 0.646311 -0.368389 -0.668261
vn 0.201177 -0.450401 -0.869866
vn 0.203623 -0.365467 -0.908279
vn 0.730667 0.162019 -0.663231
vn 0.242979 -0.395948 -0.885543
vn 0.206181 -0.400083 -0.892986
vn 0.201201 -0.389071 -0.898967
vn 0.17275 -0.336971 -0.925531
vn 0.0627507 -0.395711 -0.916229
vn 0.259763 -0.367432 -0.893038
vn 0.612606 -0.365056 -0.701033
vn 0.0808202 -0.418791 -0.904479
vn 0.147186 -0.405089 -0.902352
vn -0.0738858 -0.453095 -0.888395
vn 0.94789 0.318476 0.00883571
vn 0.91229 0.376181 -0.161911
vn 0.851137 0.113239 -0.512584
vn 0.350748 -0.500388 -0.791573
vn 0.776719 0.461728 0.428387
vn 0.442218 -0.248699 -0.861738
vn 0.986951 0.105474 -0.121667
vn 0.397525 -0.390381 -0.830407
vn 0.811045 -0.0100836 -0.584897
vn 0.894652 0.226543 -0.385067
vn 0.284968 -0.345497 -0.894106
vn 0.12681 -0.385499 -0.913953
vn 0.616557 -0.190389 -0.763943
vn 0.402847 -0.475036 -0.78234
vn -0.253953 -0.45828 -0.851755
vn 0.596709 -0.432496 -0.675933
vn 0.0670058 -0.435344 -0.897767
vn 0.0325654 -0.446251 -0.894315
vn 0.137016 -0.385333 -0.912549
vn 0.287772 -0.248537 -0.924888
vn 0.0179554 -0.436017 -0.899759
vn 0.0333075 -0.44066 -0.897056
vn 0.0421747 -0.398326 -0.916274
vn -0.020994 -0.483053 -0.87534
vn -0.316108 -0.182572 -0.930991
vn -0.268747 -0.33559 -0.902859
vn -0.192382 -0.484976 -0.853105
vn 0.0151699 -0.431746 -0.901868
vn -0.235504 -0.388085 -0.891026
vn -0.0911386 -0.455337 -0.885642
vn 0.369883 -0.528966 -0.763794
vn -0.858262 -0.0929948 0.504717
vn -0.690868 0.166772 0.703483
vn -0.906914 -0.394337 -0.148345
vn -0.715605 -0.579427 -0.390094
vn 0.407887 -0.475774 -0.779274
vn -0.753742 0.332759 0.566696
vn -0.318322 0.417824 0.850937
vn -0.660466 0.267315 0.701661
vn 0.490756 -0.429743 -0.757944
vn -0.298211 0.47818 0.826083
vn -0.578683 0.374874 0.72429
vn 0.461736 -0.373919 -0.804354
vn 0.67256 -0.163967 -0.721649
vn -0.462562 0.333448 0.821492
vn -0.881441 0.18224 0.435718
vn -0.143105 0.192435 0.970819
vn -0.969731 -0.129537 -0.206985
vn -0.32746 0.237173 0.914614
vn -0.651406 -0.375764 -0.659144
vn -0.982743 -0.0716888 0.17052
vn 0.0905253 0.152104 0.98421
vn -0.993973 -0.108933 -0.0122962
vn 0.774879 0.378185 -0.506496
vn 0.801235 -0.145743 0.580328
vn 0.902037 -0.42783 0.0573604
vn 0.77466 -0.356145 -0.522554
vn -0.958394 0.155403 0.239438
vn 0.966936 -0.102272 -0.233615
vn 0.346884 0.0853261 0.934019
vn -0.884782 -0.180644 -0.429568
vn 0.628404 -0.0349026 0.777104
vn 0.478892 0.00596145 0.877853
vn -0.539293 -0.333128 -0.773427
vn -0.815137 -0.197922 -0.544406
vn -0.96836 -0.108957 -0.224516
vn -0.970043 0.11402 0.214515
vn -0.634881 -0.29874 -0.712517
vn -0.183746 -0.377977 -0.907398
vn -0.601832 -0.370584 -0.707435
vn -0.253616 -0.400725 -0.880397
vn -0.394759 -0.44692 -0.802763
vn -0.78629 -0.373277 -0.492353
vn -0.443513 0.307179 0.841984
vn 0.802959 0.172481 -0.570533
vn -0.774395 0.186376 0.604629
vn -0.475725 0.371037 0.797507
vn -0.854033 -0.302251 -0.423405
vn -0.36199 0.326922 0.872975
vn -0.244189 0.29915 0.922432
vn 0.87986 -0.439382 -0.181078
vn -0.197975 0.178552 0.963808
vn -0.435783 -0.451246 -0.778762
vn -0.0700061 0.123428 0.989881
vn 0.0821787 0.0830741 0.993149
vn -0.966814 -0.0542898 0.249646
vn -0.162084 -0.474654 -0.86512
vn -0.556901 -0.498322 -0.664482
vn -0.383734 -0.541919 -0.747711
vn 0.712173 0.0632663 -0.699148
vn 0.267219 -0.0448678 0.962591
vn 0.209123 0.772486 0.599611
vn 0.334836 -0.107792 0.936091
vn 0.090948 0.0718083 0.993263
vn 0.354846 0.885298 0.300553
vn 0.327749 0.724283 0.606626
vn 0.22074 0.61068 0.760489
vn -0.217548 0.656439 0.722331
vn 0.363667 0.770331 0.523771
vn 0.417162 0.887626 -0.195183
vn -0.617789 0.781833 -0.084111
vn 0.441422 0.799992 0.406397
vn 0.483501 0.843031 0.23564
vn -0.282706 0.48326 0.828575
vn 0.0146847 0.554774 0.831871
vn -0.149045 0.490058 0.858853
vn -0.647388 0.761954 0.0177291
vn 0.0591893 0.568035 0.820873
vn 0.223065 0.678271 0.700136
vn 0.161403 0.615902 0.771112
vn 0.187149 0.599694 0.778037
vn -0.286619 -0.800336 -0.526604
vn 0.897045 -0.281214 0.340923
vn 0.58352 0.786015 -0.204168
vn 0.61151 0.791082 0.0156164
vn 0.630684 0.553559 -0.543884
vn 0.73078 0.547938 -0.407092
vn 0.422394 0.548616 -0.721529
vn 0.339477 0.147625 -0.928958
vn -0.628003 0.669412 -0.396862
vn 0.495932 0.14779 -0.855693
vn 0.278361 -0.176736 -0.944076
vn -0.647877 0.506805 -0.568687
vn 0.00709658 -0.483914 -0.875087
vn 0.63797 0.157537 -0.753775
vn 0.388133 -0.177024 -0.904442
vn 0.213497 -0.295607 -0.931147
vn 0.0559652 -0.401982 -0.913936
vn 0.11301 -0.404019 -0.907743
vn 0.0422241 -0.401362 -0.914946
vn 0.0904357 -0.239503 -0.966675
vn 0.187751 -0.207873 -0.959968
vn 0.23904 0.231363 -0.943043
vn -0.0276333 -0.510146 -0.859644
vn -0.661004 0.749646 0.0332513
vn -0.0338393 -0.48771 -0.87235
vn -0.0189229 -0.535747 -0.844167
vn -0.0260117 -0.53889 -0.841975
vn -0.274396 0.349333 0.89592
vn -0.244525 0.419327 0.874284
vn 0.923701 -0.354779 -0.144598
vn -0.412291 0.220532 0.883958
vn -0.50431 0.135701 0.852794
vn -0.674093 0.723953 -0.146596
vn -0.43613 0.235312 0.868573
vn -0.742948 -0.252873 0.619745
vn -0.62903 -0.0449691 0.776079
vn -0.372391 0.28822 0.882187
vn -0.513089 0.749693 0.417973
vn -0.572917 -0.0332233 0.81894
vn -0.527379 0.120641 0.841021
vn -0.65594 -0.261175 0.708189
vn -0.613901 -0.0403482 0.788351
vn -0.726178 -0.367871 0.580807
vn -0.711247 -0.702794 0.0144439
vn -0.569201 0.720441 0.3962
vn -0.489962 -0.828813 -0.270196
vn -0.669804 -0.506036 0.543406
vn -0.670623 -0.700708 0.243461
vn -0.396793 -0.774009 -0.493422
vn -0.583799 -0.80678 -0.0910217
vn -0.0318945 -0.473235 -0.880359
vn -0.657555 0.710973 0.249278
vn -0.0460078 -0.450049 -0.891818
vn -0.016545 -0.505748 -0.862523
vn -0.0824825 -0.486279 -0.869902
vn -0.785829 -0.290819 0.545799
vn -0.642327 0.0403093 0.76537
vn -0.833133 -0.336395 0.439007
vn -0.774474 -0.629841 0.0590834
vn -0.806016 -0.473519 0.35513
vn -0.561715 0.614993 0.553408
vn -0.291789 -0.636677 -0.713794
vn -0.0158025 -0.479345 -0.877484
vn -0.0977967 -0.479835 -0.871891
vn -0.576515 0.811692 0.0937319
vn -0.81138 -0.572874 -0.116095
vn -0.414202 -0.619165 -0.667137
vn -0.32044 -0.659325 -0.680154
vn -0.605143 -0.734927 -0.30608
vn -0.756254 -0.639202 -0.139647
vn -0.152233 -0.659189 -0.736407
vn -0.325033 -0.73486 -0.595259
vn -0.594775 0.678895 0.430516
vn -0.024729 -0.536295 -0.843668
vn -0.584893 -0.70374 -0.403298
vn -0.212402 -0.583005 -0.784213
vn -0.143918 -0.667629 -0.730452
vn -0.396217 -0.90808 -0.135654
vn -0.403169 -0.913074 -0.0612448
vn -0.537525 0.838969 -0.084838
vn 0.0579303 -0.866468 -0.49586
vn -0.354627 -0.821821 -0.445926
vn -0.462059 0.824707 0.326127
vn -0.10159 -0.580987 -0.807548
vn -0.033985 -0.611656 -0.790394
vn -0.186028 -0.777239 -0.601076
vn -0.5293 -0.559624 0.637701
vn 0.583768 -0.301957 0.753682
vn -0.506025 -0.850041 0.146181
vn -0.613371 -0.517813 0.59636
vn -0.562299 -0.708685 0.426128
vn -0.725719 0.668521 0.16252
vn -0.563629 -0.818501 0.111256
vn -0.75888 0.645402 0.0869333
vn 0.718063 -0.204196 0.66535
vn -0.0788393 -0.66808 -0.739901
vn -0.299918 -0.87907 -0.370521
vn 0.431293 0.727593 0.533474
vn 0.474637 -0.165611 0.864461
vn -0.262898 0.66465 0.699374
vn 0.644659 0.764359 -0.0130229
vn -0.830302 0.387949 0.400118
vn -0.557046 0.820541 0.128112
vn -0.41372 0.893507 0.174586
vn -0.546325 0.717387 0.432302
vn 0.371554 0.58386 -0.721841
vn 0.132102 0.861648 -0.490012
vn 0.525424 -0.177745 -0.832068
vn -0.385428 0.842036 -0.377387
vn 0.632558 -0.116252 0.765739
vn 0.114153 0.206187 0.971831
vn -0.309281 0.850494 0.425446
vn 0.0181316 0.407253 0.913135
vn -0.0948156 0.500594 0.860474
vn 0.853206 -0.520864 0.0272021
vn 0.755679 -0.111403 -0.645398
vn 0.865984 -0.179548 0.466727
vn 0.953539 -0.212231 0.213827
vn -0.303421 0.776742 0.551913
vn 0.787741 -0.434773 0.436391
vn 0.978006 -0.0468873 -0.203238
vn 0.481774 0.0241827 -0.875962
vn 0.441083 -0.0158115 0.897327
vn 0.493199 -0.236548 0.837138
vn 0.228661 0.2196 0.948414
vn 0.671065 -0.124489 0.730872
vn 0.597515 -0.0286752 0.801345
vn 0.299153 0.147918 0.942671
vn 0.114973 0.471227 0.874486
vn 0.6868 -0.273536 0.673412
vn -0.510854 0.748934 0.422049
vn 0.256631 0.95153 0.169506
vn 0.588558 0.807115 -0.0465245
vn 0.114921 0.637483 -0.761845
vn 0.262229 0.615218 -0.743467
vn 0.949314 -0.230768 0.213424
vn 0.8536 -0.384967 0.350951
vn 0.88104 0.255384 0.398179
vn -0.50955 0.669208 0.540851
vn 0.708246 -0.517497 -0.480192
vn -0.100516 0.0464539 -0.99385
vn 0.129014 -0.590317 -0.796794
vn 0.811668 0.201232 -0.548361
vn 0.102527 -0.111917 -0.988414
vn 0.0213528 0.687751 0.725632
vn -0.272729 0.492367 0.826556
vn -0.35647 0.427824 0.8306
vn -0.1019 0.529863 0.841939
vn 0.742756 0.552332 -0.378474
vn -0.435869 0.607581 0.663976
vn -0.612827 0.498897 0.612818
vn 0.571214 -0.0339232 -0.8201
vn 0.700354 -0.391199 0.597049
vn -0.440906 0.51908 0.732228
vn 0.12023 -0.314831 -0.941502
vn -0.150965 0.659919 0.736014
vn 0.820617 0.384391 -0.422883
vn 0.787864 0.0463492 -0.614103
vn -0.468996 0.544315 0.695531
vn 0.648938 0.411133 -0.640195
vn -0.360334 0.434184 0.825617
vn 0.609913 -0.316443 -0.726546
vn 0.832102 -0.216282 -0.510713
vn 0.803126 -0.263984 -0.534135
vn 0.229582 0.858026 -0.459438
vn 0.653572 0.612635 0.444436
vn -0.0759051 0.963934 -0.255088

g grp1
usemtl mtl1
f 178//178 174//174 179//179 
f 1//1 74//74 7//7 
f 748//748 747//747 757//757 
f 127//127 44//44 1//1 
f 60//60 47//47 44//44 
f 79//79 297//297 234//234 
f 115//115 57//57 68//68 
f 752//752 2//2 724//724 
f 355//355 254//254 255//255 
f 250//250 245//245 249//249 
f 249//249 245//245 240//240 
f 282//282 232//232 247//247 
f 285//285 260//260 273//273 
f 558//558 304//304 616//616 
f 432//432 141//141 151//151 
f 1//1 7//7 6//6 
f 714//714 31//31 719//719 
f 127//127 1//1 6//6 
f 8//8 124//124 117//117 
f 320//320 4//4 311//311 
f 475//475 473//473 510//510 
f 403//403 406//406 408//408 
f 307//307 288//288 644//644 
f 570//570 540//540 76//76 
f 124//124 8//8 126//126 
f 496//496 5//5 502//502 
f 502//502 5//5 515//515 
f 563//563 555//555 225//225 
f 555//555 13//13 225//225 
f 7//7 139//139 9//9 
f 550//550 10//10 555//555 
f 10//10 13//13 555//555 
f 550//550 14//14 10//10 
f 126//126 8//8 296//296 
f 225//225 12//12 224//224 
f 13//13 12//12 225//225 
f 127//127 65//65 60//60 
f 13//13 16//16 12//12 
f 20//20 65//65 127//127 
f 6//6 9//9 11//11 
f 18//18 224//224 12//12 
f 12//12 16//16 18//18 
f 10//10 15//15 16//16 
f 16//16 13//13 10//10 
f 11//11 9//9 63//63 
f 10//10 14//14 15//15 
f 14//14 24//24 15//15 
f 19//19 16//16 15//15 
f 15//15 24//24 19//19 
f 224//224 21//21 210//210 
f 224//224 18//18 21//21 
f 208//208 210//210 21//21 
f 487//487 499//499 5//5 
f 100//100 26//26 17//17 
f 16//16 19//19 18//18 
f 19//19 35//35 18//18 
f 19//19 24//24 25//25 
f 18//18 35//35 32//32 
f 208//208 21//21 33//33 
f 21//21 18//18 32//32 
f 32//32 33//33 21//21 
f 100//100 167//167 190//190 
f 34//34 208//208 33//33 
f 19//19 23//23 35//35 
f 23//23 51//51 36//36 
f 14//14 162//162 24//24 
f 162//162 27//27 24//24 
f 162//162 150//150 27//27 
f 24//24 27//27 25//25 
f 27//27 30//30 29//29 
f 27//27 150//150 30//30 
f 19//19 25//25 23//23 
f 29//29 23//23 25//25 
f 190//190 167//167 105//105 
f 29//29 25//25 27//27 
f 23//23 29//29 51//51 
f 52//52 51//51 29//29 
f 29//29 30//30 52//52 
f 30//30 53//53 52//52 
f 30//30 150//150 53//53 
f 11//11 63//63 135//135 
f 106//106 53//53 150//150 
f 492//492 487//487 5//5 
f 106//106 63//63 64//64 
f 64//64 53//53 106//106 
f 55//55 43//43 56//56 
f 37//37 49//49 40//40 
f 499//499 487//487 488//488 
f 488//488 449//449 486//486 
f 719//719 31//31 721//721 
f 135//135 63//63 105//105 
f 105//105 167//167 135//135 
f 38//38 32//32 37//37 
f 384//384 385//385 431//431 
f 190//190 105//105 39//39 
f 442//442 22//22 671//671 
f 33//33 32//32 83//83 
f 38//38 83//83 32//32 
f 35//35 37//37 32//32 
f 36//36 37//37 35//35 
f 36//36 35//35 23//23 
f 36//36 49//49 37//37 
f 17//17 26//26 28//28 
f 38//38 41//41 46//46 
f 38//38 46//46 83//83 
f 68//68 77//77 48//48 
f 77//77 57//57 87//87 
f 87//87 57//57 95//95 
f 41//41 38//38 37//37 
f 37//37 40//40 41//41 
f 487//487 457//457 488//488 
f 28//28 39//39 149//149 
f 115//115 68//68 494//494 
f 22//22 446//446 445//445 
f 172//172 779//779 142//142 
f 148//148 17//17 28//28 
f 88//88 42//42 136//136 
f 451//451 88//88 43//43 
f 40//40 49//49 56//56 
f 41//41 40//40 88//88 
f 88//88 40//40 56//56 
f 414//414 429//429 437//437 
f 44//44 127//127 60//60 
f 451//451 453//453 454//454 
f 454//454 45//45 42//42 
f 45//45 454//454 485//485 
f 152//152 88//88 136//136 
f 41//41 88//88 152//152 
f 779//779 172//172 173//173 
f 432//432 3//3 134//134 
f 46//46 152//152 48//48 
f 48//48 136//136 68//68 
f 385//385 396//396 382//382 
f 494//494 68//68 45//45 
f 42//42 45//45 136//136 
f 55//55 54//54 460//460 
f 460//460 54//54 59//59 
f 429//429 414//414 405//405 
f 61//61 465//465 460//460 
f 465//465 61//61 466//466 
f 49//49 51//51 50//50 
f 59//59 50//50 62//62 
f 51//51 49//49 36//36 
f 50//50 51//51 52//52 
f 366//366 368//368 373//373 
f 52//52 62//62 50//50 
f 53//53 62//62 52//52 
f 53//53 71//71 62//62 
f 60//60 58//58 47//47 
f 60//60 70//70 58//58 
f 66//66 71//71 53//53 
f 53//53 64//64 66//66 
f 54//54 56//56 49//49 
f 49//49 50//50 54//54 
f 59//59 54//54 50//50 
f 59//59 61//61 460//460 
f 56//56 54//54 55//55 
f 373//373 368//368 708//708 
f 68//68 57//57 77//77 
f 65//65 67//67 70//70 
f 232//232 235//235 247//247 
f 57//57 115//115 95//95 
f 70//70 60//60 65//65 
f 494//494 495//495 115//115 
f 58//58 115//115 495//495 
f 58//58 495//495 498//498 
f 62//62 61//61 59//59 
f 61//61 71//71 69//69 
f 61//61 62//62 71//71 
f 466//466 69//69 544//544 
f 299//299 297//297 79//79 
f 9//9 64//64 63//63 
f 64//64 9//9 139//139 
f 70//70 95//95 115//115 
f 139//139 66//66 64//64 
f 72//72 71//71 66//66 
f 66//66 139//139 72//72 
f 68//68 136//136 45//45 
f 88//88 451//451 42//42 
f 252//252 246//246 251//251 
f 7//7 74//74 139//139 
f 73//73 95//95 70//70 
f 73//73 70//70 67//67 
f 71//71 72//72 69//69 
f 560//560 547//547 493//493 
f 73//73 67//67 93//93 
f 493//493 547//547 216//216 
f 258//258 252//252 278//278 
f 61//61 69//69 466//466 
f 259//259 252//252 258//258 
f 77//77 87//87 83//83 
f 83//83 46//46 77//77 
f 72//72 75//75 69//69 
f 75//75 72//72 139//139 
f 198//198 87//87 119//119 
f 75//75 74//74 570//570 
f 139//139 74//74 75//75 
f 596//596 738//738 737//737 
f 87//87 84//84 83//83 
f 83//83 84//84 33//33 
f 198//198 84//84 87//87 
f 34//34 33//33 84//84 
f 84//84 198//198 34//34 
f 1//1 44//44 568//568 
f 138//138 140//140 433//433 
f 138//138 382//382 396//396 
f 44//44 567//567 568//568 
f 570//570 76//76 75//75 
f 76//76 69//69 75//75 
f 74//74 568//568 570//570 
f 74//74 1//1 568//568 
f 305//305 267//267 80//80 
f 80//80 308//308 305//305 
f 80//80 89//89 308//308 
f 78//78 267//267 269//269 
f 81//81 78//78 271//271 
f 78//78 82//82 80//80 
f 80//80 267//267 78//78 
f 82//82 89//89 80//80 
f 82//82 78//78 81//81 
f 365//365 85//85 271//271 
f 271//271 85//85 81//81 
f 364//364 85//85 365//365 
f 81//81 85//85 86//86 
f 86//86 82//82 81//81 
f 85//85 364//364 372//372 
f 372//372 86//86 85//85 
f 67//67 100//100 97//97 
f 303//303 305//305 308//308 
f 79//79 213//213 214//214 
f 109//109 168//168 137//137 
f 168//168 109//109 163//163 
f 93//93 112//112 73//73 
f 17//17 96//96 100//100 
f 42//42 451//451 454//454 
f 97//97 93//93 67//67 
f 100//100 96//96 129//129 
f 39//39 28//28 190//190 
f 39//39 105//105 63//63 
f 129//129 97//97 100//100 
f 127//127 11//11 20//20 
f 93//93 99//99 112//112 
f 129//129 93//93 97//97 
f 99//99 93//93 129//129 
f 65//65 100//100 67//67 
f 94//94 90//90 89//89 
f 89//89 82//82 94//94 
f 100//100 65//65 167//167 
f 90//90 94//94 92//92 
f 91//91 309//309 308//308 
f 106//106 39//39 63//63 
f 91//91 328//328 309//309 
f 308//308 89//89 91//91 
f 90//90 91//91 89//89 
f 90//90 328//328 91//91 
f 328//328 90//90 92//92 
f 87//87 95//95 119//119 
f 328//328 92//92 331//331 
f 39//39 106//106 149//149 
f 340//340 331//331 92//92 
f 92//92 94//94 98//98 
f 86//86 101//101 82//82 
f 82//82 101//101 94//94 
f 94//94 101//101 103//103 
f 86//86 379//379 101//101 
f 86//86 372//372 379//379 
f 379//379 388//388 102//102 
f 149//149 148//148 28//28 
f 149//149 106//106 150//150 
f 94//94 103//103 98//98 
f 98//98 340//340 92//92 
f 102//102 101//101 379//379 
f 112//112 95//95 73//73 
f 102//102 103//103 101//101 
f 103//103 104//104 98//98 
f 98//98 104//104 340//340 
f 112//112 114//114 119//119 
f 341//341 340//340 104//104 
f 119//119 95//95 112//112 
f 297//297 118//118 113//113 
f 115//115 58//58 70//70 
f 234//234 297//297 113//113 
f 300//300 118//118 297//297 
f 114//114 112//112 99//99 
f 11//11 127//127 6//6 
f 562//562 736//736 557//557 
f 122//122 132//132 107//107 
f 99//99 129//129 130//130 
f 108//108 110//110 116//116 
f 228//228 110//110 108//108 
f 228//228 236//236 110//110 
f 132//132 156//156 107//107 
f 157//157 107//107 156//156 
f 157//157 116//116 107//107 
f 122//122 107//107 121//121 
f 99//99 391//391 193//193 
f 193//193 114//114 99//99 
f 43//43 88//88 56//56 
f 391//391 99//99 130//130 
f 107//107 116//116 121//121 
f 157//157 108//108 116//116 
f 146//146 96//96 17//17 
f 153//153 229//229 228//228 
f 129//129 96//96 133//133 
f 228//228 108//108 153//153 
f 146//146 131//131 133//133 
f 146//146 133//133 96//96 
f 229//229 153//153 155//155 
f 122//122 123//123 109//109 
f 138//138 129//129 133//133 
f 130//130 129//129 138//138 
f 123//123 124//124 109//109 
f 124//124 163//163 109//109 
f 134//134 140//140 133//133 
f 131//131 134//134 133//133 
f 559//559 735//735 731//731 
f 3//3 140//140 134//134 
f 135//135 20//20 11//11 
f 20//20 135//135 167//167 
f 141//141 134//134 131//131 
f 134//134 141//141 432//432 
f 138//138 133//133 140//140 
f 116//116 111//111 121//121 
f 204//204 607//607 601//601 
f 121//121 120//120 123//123 
f 120//120 117//117 123//123 
f 121//121 111//111 120//120 
f 3//3 432//432 434//434 
f 110//110 236//236 111//111 
f 458//458 407//407 409//409 
f 146//146 17//17 148//148 
f 111//111 113//113 120//120 
f 455//455 458//458 409//409 
f 583//583 597//597 413//413 
f 234//234 113//113 111//111 
f 111//111 116//116 110//110 
f 124//124 123//123 117//117 
f 148//148 151//151 141//141 
f 117//117 120//120 113//113 
f 113//113 118//118 117//117 
f 148//148 149//149 151//151 
f 151//151 149//149 150//150 
f 300//300 296//296 8//8 
f 8//8 117//117 118//118 
f 146//146 141//141 131//131 
f 141//141 146//146 148//148 
f 151//151 436//436 432//432 
f 121//121 123//123 122//122 
f 126//126 125//125 124//124 
f 125//125 163//163 124//124 
f 126//126 191//191 125//125 
f 8//8 118//118 300//300 
f 315//315 126//126 296//296 
f 138//138 391//391 130//130 
f 128//128 191//191 126//126 
f 315//315 128//128 126//126 
f 315//315 194//194 128//128 
f 316//316 197//197 194//194 
f 194//194 315//315 316//316 
f 144//144 156//156 132//132 
f 132//132 137//137 144//144 
f 132//132 109//109 137//137 
f 122//122 109//109 132//132 
f 143//143 144//144 137//137 
f 168//168 164//164 145//145 
f 142//142 158//158 156//156 
f 144//144 142//142 156//156 
f 142//142 147//147 172//172 
f 142//142 144//144 147//147 
f 779//779 158//158 142//142 
f 172//172 147//147 175//175 
f 9//9 6//6 7//7 
f 144//144 143//143 147//147 
f 436//436 151//151 150//150 
f 162//162 436//436 150//150 
f 137//137 145//145 143//143 
f 145//145 137//137 168//168 
f 145//145 147//147 143//143 
f 162//162 447//447 436//436 
f 145//145 164//164 147//147 
f 164//164 166//166 175//175 
f 175//175 147//147 164//164 
f 14//14 447//447 162//162 
f 157//157 154//154 108//108 
f 154//154 159//159 160//160 
f 154//154 157//157 159//159 
f 108//108 154//154 153//153 
f 154//154 155//155 153//153 
f 155//155 351//351 229//229 
f 154//154 160//160 155//155 
f 155//155 160//160 351//351 
f 158//158 157//157 156//156 
f 158//158 171//171 159//159 
f 159//159 157//157 158//158 
f 779//779 173//173 171//171 
f 212//212 391//391 394//394 
f 160//160 159//159 177//177 
f 177//177 159//159 171//171 
f 171//171 161//161 177//177 
f 160//160 358//358 351//351 
f 160//160 177//177 161//161 
f 358//358 160//160 161//161 
f 161//161 359//359 358//358 
f 469//469 203//203 193//193 
f 212//212 478//478 469//469 
f 168//168 166//166 164//164 
f 125//125 165//165 163//163 
f 181//181 203//203 182//182 
f 182//182 188//188 215//215 
f 215//215 181//181 182//182 
f 191//191 165//165 125//125 
f 165//165 168//168 163//163 
f 191//191 199//199 170//170 
f 48//48 152//152 136//136 
f 152//152 46//46 41//41 
f 48//48 77//77 46//46 
f 168//168 169//169 166//166 
f 182//182 203//203 469//469 
f 182//182 491//491 187//187 
f 168//168 165//165 169//169 
f 736//736 562//562 288//288 
f 170//170 169//169 165//165 
f 170//170 165//165 191//191 
f 170//170 199//199 200//200 
f 187//187 188//188 182//182 
f 215//215 188//188 219//219 
f 169//169 170//170 180//180 
f 519//519 219//219 188//188 
f 519//519 188//188 187//187 
f 20//20 167//167 65//65 
f 288//288 562//562 644//644 
f 195//195 119//119 114//114 
f 362//362 183//183 357//357 
f 201//201 170//170 200//200 
f 201//201 357//357 183//183 
f 735//735 559//559 560//560 
f 201//201 189//189 170//170 
f 171//171 173//173 176//176 
f 176//176 161//161 171//171 
f 114//114 193//193 203//203 
f 174//174 173//173 172//172 
f 173//173 174//174 176//176 
f 587//587 597//597 583//583 
f 175//175 174//174 172//172 
f 203//203 195//195 114//114 
f 175//175 179//179 174//174 
f 242//242 192//192 196//196 
f 190//190 26//26 100//100 
f 174//174 178//178 176//176 
f 198//198 119//119 195//195 
f 207//207 198//198 195//195 
f 34//34 198//198 207//207 
f 34//34 207//207 208//208 
f 359//359 161//161 176//176 
f 176//176 184//184 359//359 
f 176//176 178//178 184//184 
f 578//578 722//722 730//730 
f 413//413 743//743 404//404 
f 206//206 195//195 181//181 
f 26//26 190//190 28//28 
f 166//166 179//179 175//175 
f 166//166 180//180 179//179 
f 205//205 207//207 206//206 
f 207//207 195//195 206//206 
f 206//206 209//209 205//205 
f 205//205 208//208 207//207 
f 205//205 209//209 208//208 
f 185//185 178//178 179//179 
f 217//217 209//209 206//206 
f 209//209 217//217 218//218 
f 209//209 218//218 222//222 
f 179//179 180//180 185//185 
f 208//208 209//209 210//210 
f 189//189 185//185 180//180 
f 209//209 222//222 210//210 
f 362//362 359//359 184//184 
f 644//644 342//342 455//455 
f 193//193 391//391 212//212 
f 242//242 196//196 223//223 
f 189//189 201//201 186//186 
f 183//183 362//362 186//186 
f 186//186 201//201 183//183 
f 193//193 212//212 469//469 
f 362//362 184//184 186//186 
f 178//178 185//185 184//184 
f 206//206 181//181 217//217 
f 195//195 203//203 181//181 
f 186//186 184//184 185//185 
f 215//215 217//217 181//181 
f 185//185 189//189 186//186 
f 202//202 404//404 770//770 
f 218//218 217//217 215//215 
f 180//180 166//166 169//169 
f 189//189 180//180 170//170 
f 215//215 219//219 304//304 
f 128//128 194//194 191//191 
f 222//222 218//218 304//304 
f 194//194 199//199 191//191 
f 197//197 200//200 194//194 
f 557//557 736//736 272//272 
f 197//197 363//363 357//357 
f 200//200 199//199 194//194 
f 221//221 224//224 210//210 
f 221//221 210//210 222//222 
f 225//225 224//224 565//565 
f 201//201 200//200 197//197 
f 197//197 357//357 201//201 
f 222//222 558//558 221//221 
f 565//565 221//221 558//558 
f 546//546 458//458 593//593 
f 227//227 196//196 339//339 
f 259//259 268//268 270//270 
f 339//339 343//343 227//227 
f 270//270 237//237 230//230 
f 565//565 224//224 221//221 
f 739//739 597//597 596//596 
f 227//227 343//343 376//376 
f 79//79 234//234 238//238 
f 455//455 231//231 644//644 
f 213//213 79//79 238//238 
f 237//237 226//226 238//238 
f 238//238 226//226 213//213 
f 247//247 532//532 529//529 
f 407//407 458//458 546//546 
f 214//214 299//299 79//79 
f 214//214 305//305 298//298 
f 220//220 305//305 214//214 
f 533//533 532//532 235//235 
f 220//220 213//213 226//226 
f 213//213 220//220 214//214 
f 223//223 196//196 227//227 
f 267//267 220//220 226//226 
f 267//267 226//226 270//270 
f 305//305 220//220 267//267 
f 227//227 376//376 720//720 
f 227//227 774//774 223//223 
f 517//517 507//507 543//543 
f 287//287 244//244 519//519 
f 519//519 244//244 584//584 
f 533//533 235//235 243//243 
f 237//237 270//270 226//226 
f 243//243 507//507 533//533 
f 228//228 229//229 236//236 
f 229//229 240//240 236//236 
f 240//240 239//239 233//233 
f 243//243 261//261 507//507 
f 351//351 353//353 229//229 
f 229//229 353//353 249//249 
f 240//240 229//229 249//249 
f 230//230 237//237 239//239 
f 519//519 517//517 287//287 
f 477//477 231//231 455//455 
f 239//239 245//245 246//246 
f 230//230 239//239 246//246 
f 259//259 230//230 246//246 
f 230//230 259//259 270//270 
f 246//246 252//252 259//259 
f 111//111 233//233 234//234 
f 253//253 243//243 235//235 
f 233//233 238//238 234//234 
f 236//236 233//233 111//111 
f 247//247 235//235 532//532 
f 239//239 238//238 233//233 
f 233//233 236//236 240//240 
f 312//312 584//584 244//244 
f 237//237 238//238 239//239 
f 261//261 243//243 253//253 
f 517//517 543//543 287//287 
f 353//353 241//241 249//249 
f 192//192 562//562 196//196 
f 261//261 253//253 477//477 
f 363//363 319//319 254//254 
f 235//235 232//232 253//253 
f 356//356 254//254 355//355 
f 231//231 253//253 232//232 
f 255//255 250//250 241//241 
f 253//253 231//231 477//477 
f 255//255 241//241 355//355 
f 363//363 254//254 356//356 
f 239//239 240//240 245//245 
f 216//216 578//578 493//493 
f 279//279 278//278 251//251 
f 319//319 326//326 327//327 
f 342//342 562//562 192//192 
f 248//248 279//279 255//255 
f 255//255 327//327 248//248 
f 248//248 283//283 284//284 
f 284//284 279//279 248//248 
f 261//261 477//477 409//409 
f 283//283 248//248 327//327 
f 245//245 251//251 246//246 
f 245//245 250//250 251//251 
f 250//250 255//255 251//251 
f 249//249 241//241 250//250 
f 557//557 339//339 196//196 
f 244//244 287//287 476//476 
f 252//252 251//251 278//278 
f 251//251 255//255 279//279 
f 254//254 327//327 255//255 
f 319//319 327//327 254//254 
f 257//257 269//269 268//268 
f 263//263 271//271 256//256 
f 481//481 513//513 593//593 
f 257//257 260//260 262//262 
f 256//256 269//269 257//257 
f 262//262 256//256 257//257 
f 266//266 307//307 306//306 
f 257//257 268//268 259//259 
f 260//260 258//258 273//273 
f 260//260 257//257 258//258 
f 258//258 257//257 259//259 
f 260//260 265//265 264//264 
f 260//260 285//285 277//277 
f 277//277 265//265 260//260 
f 626//626 281//281 280//280 
f 262//262 263//263 256//256 
f 262//262 264//264 595//595 
f 595//595 263//263 262//262 
f 292//292 274//274 276//276 
f 263//263 614//614 365//365 
f 263//263 595//595 614//614 
f 598//598 595//595 264//264 
f 274//274 247//247 529//529 
f 276//276 280//280 292//292 
f 280//280 276//276 626//626 
f 264//264 262//262 260//260 
f 196//196 562//562 557//557 
f 543//543 289//289 287//287 
f 202//202 211//211 601//601 
f 598//598 264//264 265//265 
f 306//306 232//232 282//282 
f 265//265 277//277 275//275 
f 562//562 342//342 644//644 
f 476//476 287//287 289//289 
f 269//269 271//271 78//78 
f 267//267 270//270 269//269 
f 270//270 268//268 269//269 
f 269//269 256//256 271//271 
f 271//271 263//263 365//365 
f 312//312 244//244 476//476 
f 348//348 639//639 294//294 
f 348//348 698//698 639//639 
f 232//232 306//306 307//307 
f 307//307 231//231 232//232 
f 273//273 258//258 278//278 
f 273//273 279//279 285//285 
f 277//277 636//636 275//275 
f 293//293 636//636 277//277 
f 278//278 279//279 273//273 
f 279//279 286//286 285//285 
f 279//279 284//284 286//286 
f 282//282 292//292 323//323 
f 283//283 286//286 284//284 
f 323//323 306//306 282//282 
f 285//285 286//286 277//277 
f 286//286 283//283 291//291 
f 557//557 272//272 339//339 
f 291//291 283//283 290//290 
f 290//290 283//283 350//350 
f 290//290 350//350 334//334 
f 292//292 333//333 323//323 
f 286//286 291//291 293//293 
f 293//293 277//277 286//286 
f 293//293 291//291 295//295 
f 312//312 476//476 751//751 
f 291//291 294//294 295//295 
f 636//636 293//293 295//295 
f 295//295 634//634 636//636 
f 295//295 294//294 634//634 
f 307//307 266//266 288//288 
f 294//294 290//290 348//348 
f 306//306 323//323 266//266 
f 294//294 291//291 290//290 
f 294//294 639//639 634//634 
f 323//323 272//272 266//266 
f 299//299 214//214 298//298 
f 296//296 300//300 301//301 
f 282//282 247//247 274//274 
f 300//300 297//297 299//299 
f 299//299 298//298 301//301 
f 274//274 292//292 282//282 
f 301//301 300//300 299//299 
f 298//298 302//302 301//301 
f 301//301 317//317 314//314 
f 298//298 305//305 302//302 
f 303//303 302//302 305//305 
f 313//313 302//302 303//303 
f 333//333 292//292 280//280 
f 333//333 280//280 281//281 
f 313//313 303//303 310//310 
f 313//313 310//310 311//311 
f 303//303 308//308 309//309 
f 309//309 310//310 303//303 
f 330//330 310//310 309//309 
f 329//329 311//311 310//310 
f 310//310 330//330 329//329 
f 317//317 301//301 302//302 
f 302//302 313//313 317//317 
f 326//326 335//335 324//324 
f 326//326 320//320 335//335 
f 317//317 313//313 4//4 
f 4//4 322//322 317//317 
f 313//313 311//311 4//4 
f 369//369 543//543 261//261 
f 320//320 322//322 4//4 
f 409//409 401//401 369//369 
f 320//320 336//336 335//335 
f 336//336 320//320 311//311 
f 311//311 329//329 336//336 
f 325//325 339//339 272//272 
f 296//296 301//301 315//315 
f 314//314 316//316 315//315 
f 315//315 301//301 314//314 
f 272//272 323//323 325//325 
f 316//316 314//314 318//318 
f 318//318 197//197 316//316 
f 317//317 318//318 314//314 
f 317//317 322//322 318//318 
f 338//338 339//339 325//325 
f 318//318 322//322 321//321 
f 325//325 323//323 333//333 
f 333//333 352//352 325//325 
f 333//333 346//346 352//352 
f 321//321 319//319 363//363 
f 363//363 197//197 321//321 
f 321//321 197//197 318//318 
f 338//338 325//325 352//352 
f 326//326 321//321 320//320 
f 352//352 366//366 338//338 
f 320//320 321//321 322//322 
f 326//326 319//319 321//321 
f 324//324 283//283 327//327 
f 327//327 326//326 324//324 
f 328//328 330//330 309//309 
f 330//330 328//328 329//329 
f 331//331 329//329 328//328 
f 331//331 332//332 329//329 
f 332//332 336//336 329//329 
f 340//340 337//337 331//331 
f 337//337 332//332 331//331 
f 343//343 339//339 338//338 
f 347//347 336//336 332//332 
f 337//337 349//349 332//332 
f 332//332 349//349 347//347 
f 324//324 335//335 334//334 
f 346//346 333//333 281//281 
f 334//334 350//350 324//324 
f 334//334 347//347 348//348 
f 334//334 348//348 290//290 
f 336//336 334//334 335//335 
f 334//334 336//336 347//347 
f 340//340 695//695 337//337 
f 695//695 345//345 349//349 
f 349//349 337//337 695//695 
f 349//349 345//345 344//344 
f 341//341 695//695 340//340 
f 354//354 346//346 281//281 
f 344//344 345//345 698//698 
f 348//348 344//344 698//698 
f 347//347 349//349 344//344 
f 344//344 348//348 347//347 
f 324//324 350//350 283//283 
f 409//409 407//407 401//401 
f 694//694 352//352 346//346 
f 694//694 346//346 354//354 
f 644//644 231//231 307//307 
f 358//358 353//353 351//351 
f 358//358 360//360 353//353 
f 353//353 360//360 241//241 
f 361//361 355//355 241//241 
f 361//361 241//241 360//360 
f 352//352 368//368 366//366 
f 368//368 352//352 694//694 
f 694//694 706//706 368//368 
f 363//363 356//356 357//357 
f 356//356 355//355 361//361 
f 357//357 356//356 361//361 
f 362//362 361//361 360//360 
f 343//343 338//338 366//366 
f 360//360 358//358 359//359 
f 359//359 362//362 360//360 
f 362//362 357//357 361//361 
f 600//600 371//371 614//614 
f 367//367 371//371 611//611 
f 609//609 367//367 611//611 
f 365//365 371//371 364//364 
f 376//376 343//343 366//366 
f 376//376 366//366 373//373 
f 371//371 365//365 614//614 
f 371//371 367//367 370//370 
f 401//401 407//407 511//511 
f 364//364 380//380 372//372 
f 364//364 371//371 370//370 
f 370//370 380//380 364//364 
f 706//706 708//708 368//368 
f 370//370 377//377 380//380 
f 539//539 407//407 546//546 
f 481//481 458//458 455//455 
f 377//377 370//370 367//367 
f 367//367 374//374 377//377 
f 375//375 377//377 374//374 
f 374//374 367//367 609//609 
f 374//374 609//609 651//651 
f 651//651 375//375 374//374 
f 653//653 375//375 651//651 
f 378//378 375//375 653//653 
f 708//708 376//376 373//373 
f 375//375 378//378 393//393 
f 393//393 377//377 375//375 
f 433//433 382//382 138//138 
f 539//539 511//511 407//407 
f 397//397 396//396 385//385 
f 382//382 431//431 385//385 
f 393//393 378//378 701//701 
f 704//704 705//705 701//701 
f 386//386 385//385 384//384 
f 369//369 289//289 543//543 
f 384//384 400//400 386//386 
f 380//380 379//379 372//372 
f 380//380 383//383 379//379 
f 379//379 383//383 388//388 
f 393//393 381//381 383//383 
f 383//383 380//380 377//377 
f 383//383 377//377 393//393 
f 396//396 402//402 394//394 
f 381//381 389//389 388//388 
f 396//396 391//391 138//138 
f 388//388 383//383 381//381 
f 381//381 701//701 387//387 
f 381//381 393//393 701//701 
f 387//387 389//389 381//381 
f 387//387 692//692 389//389 
f 388//388 390//390 102//102 
f 390//390 103//103 102//102 
f 389//389 390//390 388//388 
f 389//389 392//392 390//390 
f 390//390 104//104 103//103 
f 394//394 391//391 396//396 
f 693//693 341//341 104//104 
f 104//104 390//390 693//693 
f 693//693 390//390 392//392 
f 402//402 396//396 397//397 
f 386//386 397//397 385//385 
f 389//389 692//692 392//392 
f 701//701 378//378 704//704 
f 472//472 395//395 428//428 
f 397//397 386//386 402//402 
f 421//421 400//400 384//384 
f 481//481 342//342 242//242 
f 400//400 403//403 408//408 
f 400//400 408//408 386//386 
f 427//427 482//482 430//430 
f 593//593 458//458 481//481 
f 428//428 470//470 427//427 
f 428//428 395//395 470//470 
f 427//427 470//470 482//482 
f 408//408 402//402 386//386 
f 528//528 402//402 408//408 
f 412//412 398//398 605//605 
f 605//605 398//398 612//612 
f 736//736 266//266 272//272 
f 547//547 539//539 546//546 
f 289//289 369//369 490//490 
f 455//455 342//342 481//481 
f 403//403 610//610 406//406 
f 410//410 438//438 422//422 
f 369//369 401//401 490//490 
f 613//613 612//612 398//398 
f 411//411 410//410 398//398 
f 410//410 613//613 398//398 
f 398//398 412//412 411//411 
f 607//607 404//404 601//601 
f 410//410 422//422 613//613 
f 613//613 422//422 399//399 
f 607//607 413//413 404//404 
f 476//476 289//289 490//490 
f 192//192 242//242 342//342 
f 406//406 610//610 604//604 
f 405//405 508//508 429//429 
f 406//406 623//623 408//408 
f 479//479 476//476 490//490 
f 414//414 416//416 505//505 
f 505//505 405//405 414//414 
f 288//288 266//266 736//736 
f 400//400 421//421 403//403 
f 605//605 618//618 412//412 
f 417//417 412//412 618//618 
f 618//618 620//620 417//417 
f 415//415 412//412 417//417 
f 420//420 403//403 421//421 
f 410//410 411//411 437//437 
f 437//437 438//438 410//410 
f 437//437 411//411 414//414 
f 751//751 476//476 479//479 
f 420//420 610//610 403//403 
f 411//411 412//412 415//415 
f 414//414 411//411 415//415 
f 620//620 418//418 417//417 
f 418//418 620//620 628//628 
f 416//416 415//415 417//417 
f 420//420 421//421 452//452 
f 418//418 505//505 416//416 
f 416//416 417//417 418//418 
f 415//415 416//416 414//414 
f 419//419 505//505 418//418 
f 419//419 418//418 628//628 
f 628//628 629//629 419//419 
f 629//629 631//631 523//523 
f 523//523 419//419 629//629 
f 526//526 523//523 631//631 
f 439//439 422//422 438//438 
f 464//464 420//420 452//452 
f 440//440 442//442 423//423 
f 423//423 439//439 440//440 
f 642//642 399//399 422//422 
f 422//422 439//439 642//642 
f 439//439 645//645 642//642 
f 439//439 423//423 645//645 
f 424//424 645//645 423//423 
f 442//442 424//424 423//423 
f 428//428 425//425 429//429 
f 427//427 425//425 428//428 
f 433//433 431//431 382//382 
f 433//433 140//140 3//3 
f 431//431 433//433 434//434 
f 430//430 440//440 427//427 
f 434//434 433//433 3//3 
f 432//432 436//436 441//441 
f 441//441 434//434 432//432 
f 425//425 437//437 429//429 
f 431//431 434//434 444//444 
f 444//444 384//384 431//431 
f 425//425 426//426 438//438 
f 444//444 421//421 384//384 
f 425//425 438//438 437//437 
f 427//427 426//426 425//425 
f 426//426 427//427 440//440 
f 441//441 444//444 434//434 
f 429//429 508//508 472//472 
f 428//428 429//429 472//472 
f 435//435 440//440 430//430 
f 435//435 442//442 440//440 
f 430//430 482//482 484//484 
f 484//484 435//435 430//430 
f 484//484 577//577 435//435 
f 577//577 443//443 435//435 
f 535//535 446//446 443//443 
f 441//441 436//436 447//447 
f 438//438 426//426 439//439 
f 440//440 439//439 426//426 
f 526//526 631//631 667//667 
f 524//524 526//526 667//667 
f 667//667 668//668 524//524 
f 677//677 531//531 524//524 
f 524//524 668//668 677//677 
f 442//442 443//443 22//22 
f 443//443 442//442 435//435 
f 443//443 446//446 22//22 
f 14//14 552//552 447//447 
f 441//441 447//447 452//452 
f 671//671 424//424 442//442 
f 424//424 671//671 650//650 
f 447//447 456//456 452//452 
f 671//671 445//445 672//672 
f 445//445 671//671 22//22 
f 446//446 448//448 445//445 
f 447//447 552//552 456//456 
f 448//448 680//680 445//445 
f 445//445 680//680 672//672 
f 444//444 452//452 421//421 
f 446//446 535//535 448//448 
f 452//452 444//444 441//441 
f 677//677 678//678 531//531 
f 678//678 681//681 592//592 
f 680//680 592//592 681//681 
f 680//680 448//448 538//538 
f 538//538 592//592 680//680 
f 593//593 547//547 546//546 
f 43//43 55//55 459//459 
f 459//459 463//463 449//449 
f 450//450 486//486 449//449 
f 449//449 463//463 450//450 
f 490//490 401//401 511//511 
f 511//511 539//539 490//490 
f 452//452 580//580 464//464 
f 451//451 43//43 453//453 
f 539//539 560//560 490//490 
f 459//459 453//453 43//43 
f 459//459 457//457 453//453 
f 453//453 485//485 454//454 
f 485//485 494//494 45//45 
f 453//453 457//457 485//485 
f 485//485 457//457 487//487 
f 459//459 449//449 457//457 
f 471//471 465//465 480//480 
f 580//580 452//452 456//456 
f 460//460 461//461 55//55 
f 463//463 459//459 55//55 
f 55//55 462//462 463//463 
f 461//461 462//462 55//55 
f 465//465 471//471 461//461 
f 465//465 461//461 460//460 
f 462//462 461//461 474//474 
f 547//547 560//560 539//539 
f 462//462 474//474 463//463 
f 450//450 463//463 474//474 
f 461//461 471//471 474//474 
f 489//489 469//469 478//478 
f 465//465 467//467 480//480 
f 467//467 483//483 480//480 
f 541//541 483//483 467//467 
f 465//465 466//466 467//467 
f 544//544 467//467 466//466 
f 467//467 544//544 541//541 
f 471//471 395//395 468//468 
f 468//468 474//474 471//471 
f 468//468 473//473 474//474 
f 470//470 395//395 471//471 
f 481//481 242//242 777//777 
f 468//468 472//472 473//473 
f 468//468 395//395 472//472 
f 533//533 489//489 478//478 
f 510//510 500//500 475//475 
f 473//473 475//475 450//450 
f 450//450 474//474 473//473 
f 478//478 394//394 532//532 
f 394//394 478//478 212//212 
f 475//475 486//486 450//450 
f 478//478 532//532 533//533 
f 559//559 479//479 490//490 
f 532//532 394//394 402//402 
f 490//490 560//560 559//559 
f 216//216 547//547 593//593 
f 491//491 469//469 489//489 
f 500//500 516//516 499//499 
f 499//499 516//516 514//514 
f 470//470 471//471 480//480 
f 480//480 482//482 470//470 
f 483//483 484//484 482//482 
f 480//480 483//483 482//482 
f 502//502 515//515 520//520 
f 497//497 489//489 533//533 
f 520//520 521//521 502//502 
f 494//494 485//485 492//492 
f 494//494 492//492 495//495 
f 492//492 485//485 487//487 
f 449//449 488//488 457//457 
f 491//491 489//489 497//497 
f 492//492 496//496 495//495 
f 5//5 496//496 492//492 
f 496//496 498//498 495//495 
f 498//498 47//47 58//58 
f 507//507 497//497 533//533 
f 572//572 47//47 498//498 
f 47//47 572//572 44//44 
f 44//44 572//572 567//567 
f 572//572 571//571 567//567 
f 572//572 498//498 574//574 
f 486//486 475//475 500//500 
f 500//500 488//488 486//486 
f 500//500 499//499 488//488 
f 413//413 597//597 739//739 
f 499//499 515//515 5//5 
f 496//496 502//502 501//501 
f 507//507 491//491 497//497 
f 496//496 501//501 498//498 
f 574//574 498//498 501//501 
f 501//501 503//503 574//574 
f 501//501 502//502 503//503 
f 521//521 503//503 502//502 
f 584//584 616//616 304//304 
f 413//413 607//607 583//583 
f 510//510 508//508 504//504 
f 504//504 512//512 510//510 
f 616//616 584//584 312//312 
f 405//405 504//504 508//508 
f 506//506 504//504 405//405 
f 505//505 506//506 405//405 
f 504//504 506//506 512//512 
f 506//506 509//509 512//512 
f 419//419 506//506 505//505 
f 506//506 419//419 523//523 
f 616//616 312//312 751//751 
f 491//491 182//182 469//469 
f 523//523 509//509 506//506 
f 517//517 187//187 491//491 
f 508//508 473//473 472//472 
f 508//508 510//510 473//473 
f 522//522 526//526 525//525 
f 510//510 512//512 516//516 
f 516//516 500//500 510//510 
f 517//517 519//519 187//187 
f 514//514 522//522 515//515 
f 517//517 491//491 507//507 
f 515//515 522//522 520//520 
f 514//514 515//515 499//499 
f 509//509 516//516 512//512 
f 509//509 514//514 516//516 
f 509//509 522//522 514//514 
f 522//522 525//525 520//520 
f 528//528 276//276 274//274 
f 525//525 531//531 520//520 
f 531//531 527//527 520//520 
f 274//274 529//529 528//528 
f 529//529 532//532 402//402 
f 527//527 530//530 590//590 
f 529//529 402//402 528//528 
f 521//521 590//590 518//518 
f 518//518 553//553 575//575 
f 503//503 521//521 518//518 
f 527//527 521//521 520//520 
f 590//590 521//521 527//527 
f 276//276 528//528 408//408 
f 509//509 523//523 522//522 
f 522//522 523//523 526//526 
f 526//526 524//524 525//525 
f 408//408 623//623 626//626 
f 525//525 524//524 531//531 
f 276//276 408//408 626//626 
f 592//592 591//591 530//530 
f 531//531 530//530 527//527 
f 678//678 530//530 531//531 
f 530//530 678//678 592//592 
f 304//304 558//558 222//222 
f 543//543 507//507 261//261 
f 584//584 304//304 219//219 
f 730//730 493//493 578//578 
f 261//261 409//409 369//369 
f 536//536 443//443 577//577 
f 535//535 443//443 536//536 
f 536//536 589//589 535//535 
f 709//709 558//558 616//616 
f 537//537 589//589 581//581 
f 537//537 535//535 589//589 
f 537//537 448//448 535//535 
f 538//538 448//448 537//537 
f 616//616 751//751 709//709 
f 552//552 14//14 550//550 
f 544//544 545//545 541//541 
f 542//542 541//541 545//545 
f 545//545 544//544 540//540 
f 549//549 542//542 545//545 
f 561//561 545//545 540//540 
f 552//552 585//585 582//582 
f 552//552 550//550 585//585 
f 219//219 519//519 584//584 
f 549//549 545//545 561//561 
f 548//548 484//484 483//483 
f 548//548 483//483 541//541 
f 555//555 585//585 550//550 
f 548//548 577//577 484//484 
f 304//304 218//218 215//215 
f 548//548 579//579 577//577 
f 777//777 513//513 481//481 
f 589//589 579//579 556//556 
f 542//542 579//579 548//548 
f 548//548 541//541 542//542 
f 554//554 542//542 549//549 
f 554//554 579//579 542//542 
f 579//579 554//554 556//556 
f 551//551 554//554 549//549 
f 554//554 551//551 576//576 
f 575//575 503//503 518//518 
f 553//553 576//576 575//575 
f 225//225 566//566 563//563 
f 566//566 225//225 565//565 
f 553//553 581//581 556//556 
f 589//589 556//556 581//581 
f 554//554 576//576 556//556 
f 556//556 576//576 553//553 
f 558//558 709//709 565//565 
f 713//713 566//566 565//565 
f 735//735 560//560 493//493 
f 544//544 69//69 76//76 
f 464//464 580//580 768//768 
f 76//76 540//540 544//544 
f 569//569 561//561 540//540 
f 540//540 570//570 569//569 
f 574//574 573//573 571//571 
f 571//571 573//573 564//564 
f 565//565 709//709 713//713 
f 561//561 564//564 551//551 
f 561//561 551//551 549//549 
f 582//582 456//456 552//552 
f 561//561 569//569 564//564 
f 567//567 569//569 568//568 
f 585//585 555//555 588//588 
f 588//588 594//594 587//587 
f 571//571 569//569 567//567 
f 570//570 568//568 569//569 
f 580//580 456//456 582//582 
f 768//768 580//580 582//582 
f 571//571 572//572 574//574 
f 564//564 569//569 571//571 
f 575//575 576//576 573//573 
f 574//574 575//575 573//573 
f 585//585 587//587 583//583 
f 583//583 582//582 585//585 
f 588//588 555//555 563//563 
f 588//588 563//563 594//594 
f 587//587 585//585 588//588 
f 551//551 564//564 573//573 
f 551//551 573//573 576//576 
f 503//503 575//575 574//574 
f 579//579 536//536 577//577 
f 566//566 713//713 594//594 
f 566//566 594//594 563//563 
f 713//713 596//596 594//594 
f 536//536 579//579 589//589 
f 767//767 709//709 751//751 
f 578//578 216//216 513//513 
f 587//587 594//594 597//597 
f 594//594 596//596 597//597 
f 578//578 513//513 777//777 
f 581//581 591//591 537//537 
f 581//581 586//586 591//591 
f 586//586 590//590 530//530 
f 591//591 586//586 530//530 
f 586//586 518//518 590//590 
f 518//518 586//586 553//553 
f 586//586 581//581 553//553 
f 537//537 591//591 538//538 
f 709//709 767//767 702//702 
f 592//592 538//538 591//591 
f 623//623 406//406 604//604 
f 777//777 722//722 578//578 
f 202//202 601//601 404//404 
f 604//604 610//610 652//652 
f 599//599 614//614 595//595 
f 600//600 614//614 599//599 
f 599//599 602//602 600//600 
f 599//599 595//595 598//598 
f 602//602 612//612 600//600 
f 600//600 611//611 371//371 
f 598//598 606//606 599//599 
f 413//413 739//739 743//743 
f 602//602 599//599 606//606 
f 603//603 617//617 606//606 
f 606//606 598//598 603//603 
f 602//602 605//605 612//612 
f 602//602 606//606 605//605 
f 610//610 420//420 652//652 
f 606//606 618//618 605//605 
f 606//606 617//617 618//618 
f 265//265 603//603 598//598 
f 600//600 608//608 611//611 
f 638//638 604//604 652//652 
f 612//612 613//613 608//608 
f 608//608 600//600 612//612 
f 652//652 420//420 464//464 
f 613//613 399//399 608//608 
f 399//399 643//643 608//608 
f 651//651 609//609 643//643 
f 609//609 608//608 643//643 
f 611//611 608//608 609//609 
f 637//637 639//639 698//698 
f 698//698 699//699 637//637 
f 699//699 641//641 637//637 
f 699//699 710//710 641//641 
f 705//705 704//704 707//707 
f 641//641 710//710 640//640 
f 615//615 707//707 664//664 
f 702//702 713//713 709//709 
f 710//710 663//663 685//685 
f 685//685 640//640 710//710 
f 409//409 477//477 455//455 
f 615//615 664//664 663//663 
f 663//663 710//710 615//615 
f 603//603 621//621 617//617 
f 621//621 619//619 617//617 
f 638//638 626//626 623//623 
f 617//617 619//619 618//618 
f 619//619 620//620 618//618 
f 619//619 624//624 620//620 
f 620//620 624//624 628//628 
f 603//603 275//275 621//621 
f 275//275 636//636 621//621 
f 281//281 626//626 638//638 
f 603//603 265//265 275//275 
f 636//636 622//622 621//621 
f 622//622 624//624 619//619 
f 619//619 621//621 622//622 
f 638//638 623//623 604//604 
f 624//624 622//622 635//635 
f 635//635 625//625 624//624 
f 633//633 625//625 635//635 
f 624//624 625//625 628//628 
f 625//625 633//633 632//632 
f 627//627 632//632 633//633 
f 688//688 665//665 627//627 
f 627//627 640//640 688//688 
f 628//628 625//625 629//629 
f 625//625 632//632 629//629 
f 632//632 627//627 631//631 
f 630//630 629//629 632//632 
f 630//630 631//631 629//629 
f 631//631 630//630 632//632 
f 631//631 665//665 667//667 
f 631//631 627//627 665//665 
f 647//647 638//638 666//666 
f 634//634 637//637 635//635 
f 281//281 638//638 647//647 
f 634//634 639//639 637//637 
f 622//622 636//636 634//634 
f 622//622 634//634 635//635 
f 635//635 637//637 633//633 
f 751//751 479//479 734//734 
f 633//633 637//637 641//641 
f 659//659 638//638 652//652 
f 640//640 633//633 641//641 
f 633//633 640//640 627//627 
f 642//642 643//643 399//399 
f 642//642 646//646 648//648 
f 648//648 643//643 642//642 
f 643//643 648//648 651//651 
f 654//654 651//651 648//648 
f 648//648 656//656 654//654 
f 642//642 645//645 646//646 
f 646//646 656//656 648//648 
f 646//646 650//650 649//649 
f 649//649 656//656 646//646 
f 657//657 656//656 649//649 
f 649//649 673//673 657//657 
f 649//649 650//650 674//674 
f 650//650 645//645 424//424 
f 650//650 646//646 645//645 
f 670//670 674//674 650//650 
f 674//674 673//673 649//649 
f 653//653 651//651 654//654 
f 653//653 655//655 378//378 
f 654//654 657//657 653//653 
f 659//659 652//652 753//753 
f 653//653 661//661 655//655 
f 653//653 657//657 661//661 
f 657//657 654//654 656//656 
f 655//655 704//704 378//378 
f 655//655 661//661 704//704 
f 661//661 707//707 704//704 
f 661//661 657//657 662//662 
f 638//638 659//659 666//666 
f 660//660 663//663 662//662 
f 673//673 658//658 657//657 
f 658//658 673//673 689//689 
f 658//658 660//660 662//662 
f 662//662 657//657 658//658 
f 662//662 664//664 661//661 
f 661//661 664//664 707//707 
f 664//664 662//662 663//663 
f 669//669 665//665 690//690 
f 665//665 688//688 690//690 
f 679//679 647//647 666//666 
f 682//682 673//673 683//683 
f 690//690 689//689 682//682 
f 659//659 675//675 687//687 
f 675//675 659//659 753//753 
f 689//689 673//673 682//682 
f 669//669 690//690 682//682 
f 667//667 669//669 668//668 
f 667//667 665//665 669//669 
f 682//682 668//668 669//669 
f 668//668 676//676 677//677 
f 668//668 682//682 676//676 
f 671//671 670//670 650//650 
f 671//671 672//672 670//670 
f 672//672 684//684 670//670 
f 666//666 659//659 687//687 
f 670//670 684//684 674//674 
f 672//672 680//680 684//684 
f 683//683 673//673 674//674 
f 683//683 674//674 684//684 
f 647//647 679//679 354//354 
f 677//677 676//676 681//681 
f 354//354 281//281 647//647 
f 676//676 684//684 681//681 
f 677//677 681//681 678//678 
f 680//680 681//681 684//684 
f 676//676 682//682 683//683 
f 683//683 684//684 676//676 
f 640//640 685//685 688//688 
f 679//679 687//687 697//697 
f 685//685 663//663 660//660 
f 687//687 679//679 666//666 
f 660//660 686//686 685//685 
f 686//686 688//688 685//685 
f 688//688 686//686 690//690 
f 689//689 686//686 658//658 
f 689//689 690//690 686//686 
f 660//660 658//658 686//686 
f 703//703 692//692 387//387 
f 694//694 354//354 679//679 
f 387//387 701//701 703//703 
f 692//692 711//711 700//700 
f 692//692 703//703 711//711 
f 693//693 695//695 341//341 
f 693//693 696//696 695//695 
f 392//392 696//696 693//693 
f 691//691 345//345 696//696 
f 691//691 698//698 345//345 
f 691//691 696//696 700//700 
f 696//696 345//345 695//695 
f 692//692 696//696 392//392 
f 692//692 700//700 696//696 
f 679//679 697//697 718//718 
f 698//698 691//691 699//699 
f 691//691 700//700 699//699 
f 718//718 694//694 679//679 
f 700//700 710//710 699//699 
f 705//705 703//703 701//701 
f 703//703 705//705 707//707 
f 734//734 767//767 751//751 
f 734//734 479//479 559//559 
f 703//703 707//707 711//711 
f 706//706 694//694 718//718 
f 711//711 710//710 700//700 
f 711//711 615//615 710//710 
f 707//707 615//615 711//711 
f 712//712 715//715 714//714 
f 714//714 761//761 712//712 
f 763//763 771//771 712//712 
f 715//715 771//771 774//774 
f 715//715 712//712 771//771 
f 765//765 761//761 714//714 
f 31//31 714//714 715//715 
f 31//31 715//715 774//774 
f 765//765 714//714 719//719 
f 774//774 721//721 31//31 
f 721//721 717//717 719//719 
f 718//718 745//745 706//706 
f 774//774 720//720 721//721 
f 767//767 734//734 744//744 
f 720//720 774//774 227//227 
f 721//721 723//723 717//717 
f 723//723 721//721 720//720 
f 720//720 376//376 723//723 
f 716//716 765//765 719//719 
f 719//719 717//717 716//716 
f 708//708 706//706 745//745 
f 717//717 723//723 716//716 
f 723//723 708//708 716//716 
f 723//723 376//376 708//708 
f 2//2 762//762 725//725 
f 725//725 724//724 2//2 
f 716//716 708//708 765//765 
f 708//708 745//745 765//765 
f 725//725 742//742 724//724 
f 727//727 742//742 725//725 
f 740//740 724//724 742//742 
f 750//750 752//752 724//724 
f 725//725 762//762 727//727 
f 697//697 726//726 718//718 
f 750//750 724//724 740//740 
f 740//740 729//729 750//750 
f 687//687 675//675 211//211 
f 728//728 727//727 762//762 
f 697//697 687//687 211//211 
f 697//697 211//211 726//726 
f 760//760 728//728 762//762 
f 760//760 764//764 770//770 
f 745//745 718//718 726//726 
f 743//743 742//742 727//727 
f 727//727 728//728 743//743 
f 728//728 404//404 743//743 
f 770//770 728//728 760//760 
f 770//770 404//404 728//728 
f 733//733 745//745 726//726 
f 731//731 732//732 740//740 
f 740//740 732//732 729//729 
f 729//729 732//732 730//730 
f 202//202 726//726 211//211 
f 730//730 534//534 729//729 
f 733//733 726//726 202//202 
f 741//741 744//744 731//731 
f 731//731 735//735 732//732 
f 731//731 734//734 559//559 
f 742//742 743//743 739//739 
f 744//744 737//737 738//738 
f 722//722 777//777 776//776 
f 744//744 702//702 767//767 
f 739//739 737//737 742//742 
f 737//737 739//739 596//596 
f 740//740 741//741 731//731 
f 742//742 741//741 740//740 
f 741//741 737//737 744//744 
f 742//742 737//737 741//741 
f 734//734 731//731 744//744 
f 738//738 702//702 744//744 
f 752//752 750//750 757//757 
f 752//752 757//757 747//747 
f 746//746 762//762 2//2 
f 746//746 2//2 747//747 
f 749//749 763//763 746//746 
f 747//747 749//749 746//746 
f 747//747 748//748 749//749 
f 757//757 758//758 748//748 
f 749//749 766//766 763//763 
f 748//748 758//758 755//755 
f 753//753 652//652 464//464 
f 755//755 749//749 748//748 
f 749//749 755//755 766//766 
f 750//750 729//729 754//754 
f 754//754 757//757 750//750 
f 738//738 596//596 713//713 
f 757//757 754//754 758//758 
f 754//754 756//756 758//758 
f 758//758 769//769 755//755 
f 758//758 756//756 769//769 
f 754//754 729//729 756//756 
f 713//713 702//702 738//738 
f 756//756 534//534 769//769 
f 759//759 712//712 761//761 
f 746//746 759//759 762//762 
f 759//759 760//760 762//762 
f 712//712 759//759 763//763 
f 746//746 763//763 759//759 
f 464//464 768//768 753//753 
f 761//761 760//760 759//759 
f 761//761 764//764 760//760 
f 768//768 775//775 773//773 
f 772//772 771//771 763//763 
f 766//766 772//772 763//763 
f 766//766 776//776 778//778 
f 764//764 761//761 765//765 
f 733//733 770//770 764//764 
f 745//745 764//764 765//765 
f 733//733 764//764 745//745 
f 755//755 769//769 766//766 
f 776//776 766//766 769//769 
f 534//534 722//722 769//769 
f 769//769 722//722 776//776 
f 772//772 774//774 771//771 
f 773//773 753//753 768//768 
f 778//778 772//772 766//766 
f 607//607 773//773 775//775 
f 776//776 777//777 778//778 
f 775//775 583//583 607//607 
f 772//772 223//223 774//774 
f 773//773 675//675 753//753 
f 778//778 223//223 772//772 
f 778//778 777//777 242//242 
f 242//242 223//223 778//778 
f 773//773 204//204 675//675 
f 593//593 513//513 216//216 
f 733//733 202//202 770//770 
f 773//773 607//607 204//204 
f 768//768 582//582 775//775 
f 775//775 582//582 583//583 
f 534//534 756//756 729//729 
f 722//722 534//534 730//730 
f 211//211 675//675 204//204 
f 204//204 601//601 211//211 
f 735//735 730//730 732//732 
f 730//730 735//735 493//493 
f 2//2 752//752 780//780 
f 752//752 747//747 780//780 
f 747//747 2//2 780//780 
f 171//171 158//158 781//781 
f 158//158 779//779 781//781 
f 779//779 171//171 781//781 
