# PIPER geometrical reference model based on a manual segmentation. See the
# documentation for more info.
# Author: CEESAR, SOTON, UCBL-Ifsttar
# Version: 1.0.0
# License: Creative Commons Attribution 4.0 International License.
# (https://creativecommons.org/licenses/by/4.0/)
# 
# This work has received funding from the European Union Seventh Framework
# Program ([FP7/2007-2013]) under grant agreement 605544 [PIPER project]).
# Contributors include Pierre Maillez, Christophe Lecomte (SOTON), Erwan
# Jolivet (CEESAR), Philippe Beillas (UCBL-Ifsttar)
# This work is derived from a CT scan provided by CEESAR under a CCBY-4.0
# License
# 
# wavefront obj file written by the visualization toolkit

mtllib C:/desktop/registration_reference_model/22_REF_LTE635_Assembly_hands_corr/CCTu635_BP177_Metatarsal2_R.mtl

v -9.24302 170.73 -1703.29
v -10.38 173.282 -1703.73
v -10.351 176.016 -1709.72
v -11.739 165.535 -1711.07
v -7.37801 164.118 -1710.46
v -13.995 165.854 -1714.69
v -4.83001 163.391 -1712.68
v -11.937 158.868 -1717.56
v -13.685 164.568 -1719.53
v -10.591 161.415 -1720.14
v -6.11201 172.002 -1722.72
v -8.23002 175.513 -1706.22
v -7.50702 179.669 -1712.91
v -13.703 171.427 -1718.05
v -10.513 177.683 -1715.87
v -7.47802 185.045 -1717.29
v -4.35802 180.633 -1724.94
v -8.00802 181.603 -1723.74
v -10.373 172.313 -1722.77
v -7.93201 172.751 -1723.93
v -9.69402 179.76 -1720.41
v -4.18002 189.709 -1719.65
v -7.72202 187.948 -1723.5
v -6.36802 180.96 -1725.46
v -0.829015 165.978 -1705.8
v -6.03502 172.019 -1703.84
v 1.86799 168.556 -1706.94
v -1.34402 173.374 -1708.56
v 0.640986 164.423 -1708.48
v -5.61801 164.843 -1716.82
v 1.38498 169.158 -1710.76
v 0.326985 174.203 -1714.27
v -4.30102 177.92 -1711.57
v -3.23802 181.898 -1714.97
v -0.467016 180.654 -1718.47
v -1.18502 179.145 -1715.17
v -1.91702 182.16 -1722.72
v -6.87602 191.006 -1722.55
v -6.52802 195.219 -1728.36
v -0.224017 193.783 -1723.7
v -1.93102 190.865 -1728.91
v -5.58902 192.647 -1729.88
v -3.99202 190.578 -1729.92
v -5.92502 198.586 -1729.33
v -4.10802 196.522 -1725.48
v -2.61502 208.638 -1736.19
v -6.47302 210.033 -1747.6
v -3.39902 217.202 -1741.9
v -4.78202 209.133 -1740.01
v -8.36102 214.991 -1747.02
v -5.00002 221.582 -1747.36
v -8.81602 214.179 -1750.19
v -6.63902 219.407 -1750.35
v -2.38002 198.197 -1735.29
v 1.03898 194.603 -1727.02
v 0.022983 199.016 -1733.54
v -4.58902 203.236 -1737.69
v -0.130017 199.045 -1727.38
v 1.96498 205.222 -1735.56
v 0.145982 206.332 -1734.03
v -4.25202 206.622 -1742.45
v 1.42398 206.194 -1740.94
v 3.77098 209.441 -1740.23
v 1.90598 211.998 -1738.63
v 2.54898 211.939 -1750.82
v -1.83402 206.686 -1745.69
v -0.351019 222.921 -1743.83
v 2.48298 221.776 -1743.68
v 5.02798 216.111 -1743.65
v 5.87398 212.861 -1745.45
v 5.71398 220.133 -1748.72
v -1.87702 209.257 -1753.99
v -2.44602 215.721 -1754.91
v 2.70798 218.314 -1753.67
v -0.253019 222.83 -1750.68
v 1.87798 222.013 -1744.68
vn -0.340266 -0.287058 0.895442
vn -0.546856 0.371006 0.750535
vn -0.74626 0.606313 0.274737
vn -0.616116 -0.535184 0.577909
vn -0.123092 -0.818874 0.560619
vn -0.960228 -0.158608 0.229795
vn 0.344877 -0.938407 0.0212747
vn -0.286988 -0.951557 -0.110348
vn -0.835511 -0.198944 -0.512194
vn 0.118546 -0.598435 -0.792352
vn 0.609325 -0.357063 -0.707975
vn -0.00583368 0.810834 0.585247
vn -0.338722 0.725636 0.598932
vn -0.956931 0.228919 -0.178545
vn -0.86434 0.474852 0.165628
vn -0.605935 0.520826 0.601317
vn 0.509222 -0.355808 -0.783641
vn -0.848379 0.0330339 -0.528357
vn -0.647803 0.00637268 -0.761782
vn 0.00296452 -0.253882 -0.967231
vn -0.942598 0.284065 -0.175543
vn -0.0644558 0.601992 0.795896
vn -0.985485 0.158531 -0.0607296
vn -0.306929 -0.228675 -0.923852
vn 0.237554 -0.550224 0.800514
vn 0.318869 0.327239 0.889515
vn 0.884009 0.108119 0.454795
vn 0.646685 0.578982 0.496568
vn 0.596767 -0.795352 0.106223
vn 0.690507 -0.530025 -0.492213
vn 0.96325 -0.00546472 -0.268552
vn 0.989729 0.0574763 -0.130891
vn 0.332796 0.693341 0.63916
vn 0.331021 0.518363 0.788495
vn 0.996711 -0.0440105 -0.0680428
vn 0.772268 0.385925 0.504643
vn 0.803211 -0.334426 -0.492962
vn -0.778325 0.460172 0.427144
vn -0.989296 0.0616773 -0.132248
vn 0.589664 0.450198 0.670536
vn 0.64102 -0.449769 -0.621934
vn -0.767002 -0.253202 -0.589573
vn -0.00867483 -0.476662 -0.879044
vn -0.867081 0.405219 0.289774
vn -0.279903 0.633834 0.721047
vn -0.407439 0.58506 0.701212
vn -0.773527 -0.622221 -0.120408
vn -0.607467 0.42342 0.672086
vn -0.949805 0.0759107 0.303492
vn -0.943168 0.110253 0.313494
vn -0.636736 0.755962 0.15195
vn -0.933417 -0.106467 -0.342634
vn -0.731306 0.551582 -0.401184
vn 0.151091 -0.637959 -0.755102
vn 0.996523 -0.0829801 -0.00751695
vn 0.746008 -0.4796 -0.462012
vn -0.882809 -0.310675 -0.352318
vn 0.469378 0.540592 0.698172
vn 0.969726 -0.00889103 0.244033
vn 0.358233 0.581868 0.730136
vn -0.836025 -0.493046 -0.240763
vn 0.719603 -0.617718 -0.317169
vn 0.939396 -0.202231 0.276835
vn 0.492144 0.379743 0.783319
vn 0.734533 -0.48483 -0.474765
vn 0.0191594 -0.895112 -0.44543
vn -0.0771942 0.867284 0.491793
vn 0.500704 0.697046 0.513247
vn 0.856824 0.216049 0.468162
vn 0.958176 -0.277514 -0.0698828
vn 0.875476 0.444279 -0.190152
vn 0.0152893 -0.673362 -0.739155
vn -0.208135 0.135712 -0.968639
vn 0.531192 0.226188 -0.816501
vn 0.0235692 0.890748 -0.453886
vn 0.37471 0.927116 -0.00688654

g grp1
usemtl mtl1
f 1//1 6//6 4//4 
f 1//1 2//2 6//6 
f 25//25 26//26 1//1 
f 1//1 4//4 5//5 
f 1//1 26//26 2//2 
f 14//14 2//2 3//3 
f 12//12 2//2 26//26 
f 26//26 28//28 12//12 
f 28//28 33//33 12//12 
f 12//12 3//3 2//2 
f 7//7 8//8 10//10 
f 4//4 6//6 8//8 
f 4//4 8//8 5//5 
f 2//2 14//14 6//6 
f 6//6 9//9 8//8 
f 7//7 5//5 8//8 
f 7//7 10//10 30//30 
f 6//6 14//14 9//9 
f 8//8 9//9 10//10 
f 9//9 14//14 19//19 
f 10//10 9//9 19//19 
f 19//19 20//20 10//10 
f 30//30 10//10 11//11 
f 10//10 20//20 11//11 
f 12//12 13//13 3//3 
f 12//12 33//33 13//13 
f 34//34 13//13 33//33 
f 3//3 15//15 14//14 
f 21//21 15//15 16//16 
f 16//16 15//15 13//13 
f 3//3 13//13 15//15 
f 22//22 16//16 34//34 
f 13//13 34//34 16//16 
f 17//17 11//11 20//20 
f 15//15 21//21 14//14 
f 14//14 21//21 19//19 
f 19//19 21//21 18//18 
f 18//18 24//24 19//19 
f 20//20 19//19 24//24 
f 24//24 17//17 20//20 
f 16//16 38//38 21//21 
f 23//23 18//18 21//21 
f 21//21 38//38 23//23 
f 16//16 22//22 38//38 
f 17//17 24//24 43//43 
f 23//23 39//39 18//18 
f 42//42 18//18 39//39 
f 25//25 27//27 26//26 
f 25//25 1//1 5//5 
f 25//25 29//29 27//27 
f 28//28 26//26 27//27 
f 5//5 7//7 25//25 
f 25//25 7//7 29//29 
f 29//29 7//7 30//30 
f 30//30 31//31 29//29 
f 27//27 29//29 31//31 
f 31//31 30//30 11//11 
f 28//28 27//27 31//31 
f 28//28 31//31 32//32 
f 36//36 33//33 28//28 
f 28//28 32//32 36//36 
f 36//36 34//34 33//33 
f 11//11 32//32 31//31 
f 32//32 11//11 37//37 
f 32//32 35//35 36//36 
f 17//17 37//37 11//11 
f 37//37 35//35 32//32 
f 35//35 55//55 36//36 
f 37//37 55//55 35//35 
f 17//17 41//41 37//37 
f 17//17 43//43 41//41 
f 37//37 41//41 55//55 
f 22//22 45//45 38//38 
f 38//38 39//39 23//23 
f 38//38 44//44 39//39 
f 38//38 45//45 44//44 
f 22//22 34//34 40//40 
f 34//34 36//36 40//40 
f 36//36 55//55 40//40 
f 45//45 22//22 40//40 
f 45//45 40//40 58//58 
f 40//40 55//55 58//58 
f 42//42 24//24 18//18 
f 43//43 24//24 42//42 
f 57//57 43//43 42//42 
f 44//44 57//57 39//39 
f 39//39 57//57 42//42 
f 45//45 46//46 44//44 
f 49//49 57//57 44//44 
f 44//44 46//46 49//49 
f 61//61 57//57 49//49 
f 46//46 48//48 49//49 
f 47//47 61//61 49//49 
f 50//50 49//49 48//48 
f 50//50 47//47 49//49 
f 47//47 50//50 52//52 
f 53//53 52//52 50//50 
f 48//48 51//51 50//50 
f 51//51 53//53 50//50 
f 47//47 52//52 72//72 
f 73//73 72//72 52//52 
f 53//53 73//73 52//52 
f 53//53 75//75 73//73 
f 51//51 75//75 53//53 
f 41//41 43//43 54//54 
f 56//56 41//41 54//54 
f 41//41 56//56 55//55 
f 57//57 54//54 43//43 
f 59//59 55//55 56//56 
f 55//55 59//59 58//58 
f 46//46 45//45 58//58 
f 59//59 60//60 58//58 
f 58//58 60//60 46//46 
f 59//59 56//56 62//62 
f 57//57 61//61 54//54 
f 64//64 60//60 59//59 
f 64//64 46//46 60//60 
f 59//59 62//62 63//63 
f 64//64 59//59 63//63 
f 54//54 61//61 66//66 
f 66//66 62//62 54//54 
f 56//56 54//54 62//62 
f 63//63 62//62 70//70 
f 66//66 65//65 62//62 
f 47//47 66//66 61//61 
f 72//72 65//65 66//66 
f 62//62 65//65 70//70 
f 48//48 46//46 67//67 
f 67//67 46//46 64//64 
f 69//69 64//64 63//63 
f 69//69 63//63 70//70 
f 64//64 68//68 67//67 
f 51//51 48//48 67//67 
f 69//69 68//68 64//64 
f 69//69 71//71 68//68 
f 69//69 70//70 71//71 
f 70//70 65//65 71//71 
f 67//67 75//75 51//51 
f 68//68 71//71 75//75 
f 72//72 66//66 47//47 
f 65//65 72//72 74//74 
f 73//73 75//75 74//74 
f 71//71 65//65 74//74 
f 71//71 74//74 75//75 
f 72//72 73//73 74//74 
f 68//68 75//75 76//76 
f 75//75 67//67 76//76 
f 67//67 68//68 76//76 
