<?xml version="1.0" encoding="UTF-8" standalone="no"?>
<VTKFile type="UnstructuredGrid" version="0.1" byte_order="LittleEndian">
    <UnstructuredGrid>
        <Piece NumberOfPoints="9" NumberOfCells="0">
            <Points>
                <DataArray Name="Points" type="Float32" NumberOfComponents="3" format="ascii">
                    1. 2. 3.
                    2. 0. 4.
                    4. 0. 4.
                    2. 2. 6.
                    4. 2. 6.
                    2. 1. -2.
                    3. 2. -2.
                    2. 3. -2.
                    2. 2. -3.
                </DataArray>
            </Points>
            <PointData Scalars="nid">
                <DataArray Name="nid" type="Int32" format="ascii">
                    100 201 202 203 204 301 302 303 304
                </DataArray>
            </PointData>
            <Cells>
                <DataArray type="Int32" Name="connectivity" format="ascii" RangeMin="0" RangeMax="35"></DataArray>
                <DataArray type="Int32" Name="offsets" format="ascii" RangeMin="2" RangeMax="42"></DataArray>
                <DataArray type="UInt8" Name="types" format="ascii" RangeMin="3" RangeMax="13"></DataArray>
            </Cells>
            <CellData Scalars="eid">
                <DataArray Name="eid" type="UInt32" NumberOfComponents="1" format="ascii"></DataArray>
            </CellData>
        </Piece>
    </UnstructuredGrid>
</VTKFile>
