
************************************
*         PluginExample.txt        *
************************************



AUTHOR :
 - Thomas Lemaire, Thomas Dupeux




LICENCE :
 - GPLv3



OTHER COMMENTS :
