<?xml version="1.0" encoding="UTF-8" standalone="no"?>
<!-- Generator: Adobe Illustrator 16.0.0, SVG Export Plug-In . SVG Version: 6.00 Build 0)  -->

<svg
   xmlns:dc="http://purl.org/dc/elements/1.1/"
   xmlns:cc="http://creativecommons.org/ns#"
   xmlns:rdf="http://www.w3.org/1999/02/22-rdf-syntax-ns#"
   xmlns:svg="http://www.w3.org/2000/svg"
   xmlns="http://www.w3.org/2000/svg"
   xmlns:sodipodi="http://sodipodi.sourceforge.net/DTD/sodipodi-0.dtd"
   xmlns:inkscape="http://www.inkscape.org/namespaces/inkscape"
   version="1.1"
   id="Check_1_"
   x="0px"
   y="0px"
   width="64px"
   height="64px"
   viewBox="0 0 64 64"
   enable-background="new 0 0 64 64"
   xml:space="preserve"
   inkscape:version="0.48.4 r9939"
   sodipodi:docname="module_background.svg"
   inkscape:export-filename="/local/usr/src/piper/share/artwork/module_check.png"
   inkscape:export-xdpi="90"
   inkscape:export-ydpi="90"><metadata
     id="metadata29"><rdf:RDF><cc:Work
         rdf:about=""><dc:format>image/svg+xml</dc:format><dc:type
           rdf:resource="http://purl.org/dc/dcmitype/StillImage" /><dc:title></dc:title></cc:Work></rdf:RDF></metadata><defs
     id="defs27" /><sodipodi:namedview
     pagecolor="#ffffff"
     bordercolor="#666666"
     borderopacity="1"
     objecttolerance="10"
     gridtolerance="10"
     guidetolerance="10"
     inkscape:pageopacity="0"
     inkscape:pageshadow="2"
     inkscape:window-width="978"
     inkscape:window-height="836"
     id="namedview25"
     showgrid="false"
     inkscape:zoom="3.6875"
     inkscape:cx="30.237288"
     inkscape:cy="22.237288"
     inkscape:window-x="0"
     inkscape:window-y="0"
     inkscape:window-maximized="0"
     inkscape:current-layer="Check_1_" /><g
     id="fond"><linearGradient
       id="SVGID_1_"
       gradientUnits="userSpaceOnUse"
       x1="391.2637"
       y1="-498.2354"
       x2="451.2646"
       y2="-498.2354"
       gradientTransform="matrix(-1.000000e-004 1 -1 -1.000000e-004 -466.1942 -389.314)"><stop
         offset="0"
         style="stop-color:#B6B9BB"
         id="stop5" /><stop
         offset="0.7143"
         style="stop-color:#5B5D5E"
         id="stop7" /><stop
         offset="0.9951"
         style="stop-color:#404243"
         id="stop9" /></linearGradient><path
       fill="url(#SVGID_1_)"
       d="M13.996,61.998c-12-0.002-12-0.002-11.999-13.002l0.005-35c0.001-12,0.001-12,12.001-11.999   l35,0.005c13,0.001,13,0.001,12.998,12.001l-0.004,35c-0.002,13-0.002,13-13.002,12.998L13.996,61.998z"
       id="path11" /></g><g
     inkscape:groupmode="layer"
     id="layer1"
     inkscape:label="bup" /></svg>