name,description
FMA,Foundation Model of Anatomy (http://xiphoid.biostr.washington.edu/fma/index.html)
Kepple1997,
ISB_JCS,"3 publications which define Joint Coordinate Systems for knee, anckle, hip, spine, shoulder, elbow, wrist and hand"
ISB_BCS,Bone Coordinate System following as mush as possible ISB recomandations
Dugaillay2010,In vitro 3D-kinematics of the upper cervical spine helical axis and simulation for axial rotation and flexion extension
