{
    "version": 2,
    "name": "dollar-chart",
    "builds": [{
        "src": "package.json",
        "use": "@now/static-build"
    }],
    "build": {
        "env": {
            "KEY_SBIF": ""
        }
    },
    "routes": [
        { "src": "/(.*).js", "dest": "/$1.js" },
        { "src": "/(.*).json", "dest": "/$1.json" },
        { "src": "/.*", "dest": "/index.html" }
    ]
}