       5
na=16 nb=14 sa=2 sb=0 A=2 MB
 O -0.600850000  0.000000000 -1.548000000
 O  0.600850000  0.000000000 -1.548000000
 N  0.000000000 -0.548400000  1.548000000
 N  0.000000000  0.548400000  1.548000000
 H  0.000000000  0.000000000  0.000000000
