       5
na=16 nb=2 sa=2 sb=0 A=2 MB
 O -0.300425000  0.000000000 -1.639550000
 O  0.901275000  0.000000000 -1.639550000
 H -0.300425000 -0.371400000  1.639550000
 H -0.300425000  0.371400000  1.639550000
 H  0.000000000  0.000000000  0.000000000
