       6
 na=22 nb=16 sa=0 sb=2 A=3 MB
 C -1.692341104  0.341075582  0.000000000
 O -1.692341104  1.501075582  0.000000000
 O -1.692341104 -0.818924418  0.000000000
 O  1.430047459  0.082627798  0.000000000
 O  1.954634748 -0.764778963  0.000000000
 H  0.000000000  0.000000000  0.000000000
