       5
 na=11 nb=10 sa=1 sb=0 A=1 MB
Na  0.000011347  0.000000000 -1.465773625
 O -0.000063347  0.000000000  1.403010344
 H  0.000401360  0.758137925  1.963905880
 H  0.000401360 -0.758137925  1.963905880
 H  0.000000000  0.000000000  0.000000000
