       6
na=10 nb=16 sa=0 sb=2 A=3 MB
 H -2.342136430  0.069282299  0.000000000
 O -1.395456186 -0.083638660  0.000000000
 H -1.010361619  0.794850735  0.000000000
 O  1.303480449  0.616939606  0.000000000
 O  1.550272430 -0.565075397  0.000000000
 H  0.000000000  0.000000000  0.000000000
