"sys_no";"sys_name";"RHF";"LC-wPBE";"LC-wPBE+XDM";"MP2";"UMP2";"SCS-MP2";"SCS-UMP2";"RCCSD";"RCCSD-F12a";"RCCSD-F12b";"RCCSD(T**)-F12a";"RCCSD(T**)-F12b";"UCCSD(T**)-F12a";"UCCSD(T**)-F12b";"RCCSD(T)/CBS"
1;"nh_nh";-410.88;-430.25;-483.13;-469.11;-470.85;-440.85;-448.99;-452.07;-452.85;-450.77;-460.40;-458.32;-460.92;-458.85;-459.91
2;"ch2o_nh2";-648.05;-606.04;-751.22;-732.81;-732.82;-683.98;-684.65;-713.53;-713.48;-709.58;-731.13;-727.23;-731.61;-727.69;-731.41
3;"h2o_na";-938.39;-1122.44;-1172.12;-1173.99;-1173.54;-1101.47;-1101.59;-1244.92;-1246.03;-1243.25;-1285.60;-1282.81;-1286.48;-1283.69;-1283.1
4;"h2o_oh";-1265.71;-1274.44;-1357.48;-1357.00;-1357.58;-1308.43;-1308.62;-1334.30;-1336.25;-1332.12;-1353.73;-1349.59;-1353.86;-1349.73;-1352.5
5;"h2o_o2h";-1398.99;-1522.95;-1620.92;-1594.08;-1599.66;-1524.99;-1537.10;-1568.20;-1571.41;-1567.70;-1599.21;-1595.50;-1603.94;-1600.20;-1597.02
6;"li_nh3_gm";-3280.66;-3620.16;-3652.90;-3630.63;-3630.93;-3544.50;-3546.91;-3762.19;-3762.83;-3757.72;-3811.84;-3806.73;-3814.46;-3809.36;-3810.8
7;"li_o2";8.92;2.79;-17.46;-18.65;-19.00;-13.46;-15.03;-20.05;-18.80;-18.64;-22.98;-22.82;-23.06;-22.90;-24.41
8;"cn_h2";5.73;0.82;-31.20;-29.64;-24.53;-22.03;-17.25;-23.81;-23.59;-23.17;-28.20;-27.78;-23.72;-23.30;-28.51
9;"li_nh3_lm";35.07;-12.73;-58.66;-45.42;-45.58;-28.49;-28.74;-58.21;-57.30;-56.60;-72.38;-71.68;-72.46;-71.76;-73.1
10;"h2o_o2_min";-29.92;-48.64;-154.01;-103.02;-128.64;-86.95;-103.05;-110.29;-111.69;-110.58;-127.77;-126.65;-129.22;-128.09;-126.5
11;"na_li";53.92;-47.61;-183.28;-50.71;-50.57;19.04;19.09;-188.18;-185.66;-185.30;-185.65;-185.30;-185.65;-185.30;-188.18
12;"co2_o2";-31.12;-44.26;-133.32;-128.70;-128.93;-105.11;-104.54;-115.53;-116.25;-115.14;-133.10;-131.99;-133.37;-132.26;-132.52
13;"c2h3_co2";-175.04;-210.03;-412.82;-421.00;-425.98;-359.22;-370.63;-372.51;-374.12;-370.60;-416.99;-413.48;-417.53;-414.03;-415.05
14;"he*_he*";30.27;-328.34;-348.44;-290.28;-290.28;-72.05;-72.05;-768.39;-783.08;-785.52;-794.20;-796.64;-794.20;-796.64;-790.24
15;"hf_co+";-6119.85;-9579.77;-9722.91;-7338.36;-8390.49;-7032.01;-8364.75;-7359.57;-7410.10;-7381.89;-7708.22;-7680.01;-7795.90;-7765.56;-7656.09
16;"cn_he";0.80;0.01;-9.49;-10.71;-10.35;-8.03;-7.86;-9.89;-9.96;-9.84;-11.27;-11.15;-10.04;-9.92;-11.24
17;"nh_he";0.80;-0.02;-10.58;-8.37;-8.27;-6.23;-6.19;-9.21;-9.36;-9.29;-10.47;-10.41;-9.37;-9.31;-10.38
18;"c2h3_c2h4";75.67;51.93;-9.86;-20.60;2.19;-5.20;19.05;2.67;2.03;3.08;-12.06;-11.01;-12.17;-11.11;-10.96
19;"o2_h2";3.97;-0.75;-33.78;-28.75;-30.22;-21.41;-22.35;-26.28;-26.02;-25.68;-30.62;-30.28;-26.19;-25.85;-31.11
20;"nh_ar";1.08;-3.13;-40.80;-41.03;-40.52;-31.31;-31.00;-35.73;-35.18;-34.64;-41.20;-40.65;-41.27;-40.73;-42.26
21;"cn_ar";5.09;-2.08;-55.18;-78.92;-74.52;-59.34;-56.15;-54.56;-54.66;-53.43;-65.82;-64.58;-65.99;-64.75;-66.45
22;"o2_n2";10.06;0.38;-69.79;-69.76;-72.38;-51.72;-53.58;-50.29;-50.83;-49.78;-63.02;-61.97;-63.30;-62.24;-62.69
23;"h2o_o2";29.42;16.82;-62.03;-54.23;-51.38;-35.69;-34.49;-43.71;-44.22;-43.27;-59.99;-59.04;-60.36;-59.40;-59.42
24;"o2_o2";8.04;-1.28;-74.56;-71.93;-79.12;-54.77;-57.75;-58.26;-58.71;-57.91;-71.29;-70.48;-71.68;-70.87;-71.34
