       4
na=8 nb=18 sa=2 sb=0 A=2 MB
 N -0.054937107  0.000000000  2.288887388
 H  0.855979826  0.000000000  1.792889223
Ar -0.006213184  0.000000000 -2.255590793
 H  0.000000000  0.000000000  0.000000000
