       5
na=8 nb=8 sa=2 sb=2 A=2 MB
 N -1.819614308  0.000000000  0.000000000
 H -0.782614308  0.000000000  0.000000000
 N  1.680385692  0.000000000  0.000000000
 H  2.717385692  0.000000000  0.000000000
 H  0.000000000  0.000000000  0.000000000
