       4
na=13 nb=18 sa=1 sb=0 A=2 MB
 C -0.427112733  0.000000000  2.134178904
 N  0.427713476  0.000000000  1.339428634
Ar -0.033090602  0.000000000 -1.706317987
 H  0.000000000  0.000000000  0.000000000
