       5
 na=16 nb=16 sa=2 sb=2 A=2 MB
 O  0.601000000 -1.980000000  0.000000000
 O -0.601000000 -1.980000000  0.000000000
 O  0.000000000  1.980000000  0.601000000
 O  0.000000000  1.980000000 -0.601000000
 H  0.000000000  0.000000000  0.000000000
