       6
 na=10 nb=17 sa=0 sb=1 A=3
 O  0.009394188 -0.115233807 -2.299213762
 H  0.035498024 -0.988569742 -2.655527861
 H -0.174548279  0.468001035 -3.017795065
 H  0.007337653  0.448158238  1.146786139
 O  0.006532160  0.685838875  2.070790860
 O -0.008156400 -0.442860681  2.724305726
