       4
na=13 nb=18 sa=1 sb=0 A=2 MB
 C -0.423436000  0.000000000  2.323769791
 N  0.431390210  0.000000000  1.529019521
Ar -0.036767336  0.000000000 -1.895908875
 H  0.000000000  0.000000000  0.000000000
