      12
na=15 nb=16 sa=1 sb=0 A=5 MB
 H  0.906742609  1.254916769 -2.200000000
 H  0.906742609 -1.209003231 -2.200000000
 H -0.941177391 -1.209003231 -2.200000000
 C -0.017217391  0.690136769 -2.200000000
 C -0.017217391 -0.644223231 -2.200000000
 H -0.941177391  1.254916769  2.200000000
 H  0.906742609  1.254916769  2.200000000
 H  0.906742609 -1.209003231  2.200000000
 H -0.941177391 -1.209003231  2.200000000
 C -0.017217391  0.690136769  2.200000000
 C -0.017217391 -0.644223231  2.200000000
 H  0.000000000  0.000000000  0.000000000
