       4
na=16 nb=3 sa=2 sb=1 A=2 MB
 O  0.000000000  0.603367899 -2.143167858
 O  0.000000000 -0.603367899 -2.143167858
Li  0.000000000  0.000000000  2.143167858
 H  0.000000000  0.000000000  0.000000000
