       4
na=8 nb=18 sa=2 sb=0 A=2 MB
 N -0.050794984  0.000000000  3.792614584
 H  0.860121949  0.000000000  3.296616418
Ar -0.010355307  0.000000000 -3.759317989
 H  0.000000000  0.000000000  0.000000000
