       6
 na=22 nb=16 sa=0 sb=2 A=3 MB
 C -2.538511656  0.511613373  0.000000000
 O -2.538511656  1.671613373  0.000000000
 O -2.538511656 -0.648386627  0.000000000
 O  2.276218011 -0.087909993  0.000000000
 O  2.800805300 -0.935316754  0.000000000
 H  0.000000000  0.000000000  0.000000000
