       6
na=10 nb=3 sa=0 sb=1 A=4 MB
 N  0.000000000  0.000000000 -2.208077408
 H  0.937314431  0.000000000 -1.826520319
 H -0.468657216 -0.811738109 -1.826520319
 H -0.468657216  0.811738109 -1.826520319
Li  0.000000000  0.000000000  2.140330800
 H  0.000000000  0.000000000  0.000000000
