       5
na=13 nb=2 sa=1 sb=0 A=2 MB
 C -1.595250000 -0.609996639  0.000000000
 N -1.595250000  0.560603361  0.000000000
 H  1.595250000 -0.020206341  0.371400000
 H  1.595250000 -0.020206341 -0.371400000
 H  0.000000000  0.000000000  0.000000000
