       5
 na=11 nb=10 sa=1 sb=0 A=1 MB
Na  0.000018912  0.000000000 -2.442956042
 O -0.000070912  0.000000000  2.380192760
 H  0.000393795  0.758137925  2.941088297
 H  0.000393795 -0.758137925  2.941088297
 H  0.000000000  0.000000000  0.000000000
