Compute node: compute-0-11.local
Job ID: 2015737
Started at:
Mon May 23 00:00:26 EDT 2016
openmpi_1.6.5/intel_2013/1.6.5(12):ERROR:150: Module 'openmpi_1.6.5/intel_2013/1.6.5' conflicts with the currently loaded module(s) 'gnu/4.8.1'
openmpi_1.6.5/intel_2013/1.6.5(12):ERROR:102: Tcl command execution failed: conflict mpich2 pgi intel gnu

rsync: link_stat "/home/mpmetz/autoPES/example/H2O2/GRID1/H2O2.ener" failed: No such file or directory (2)
rsync error: some files could not be transferred (code 23) at main.c(892) [sender=2.6.8]

total 348
-rw-rw-r-- 1 mpmetz mpmetz   1533 May 23 00:00 H2O2.input_long
-rw-r--r-- 1 mpmetz mpmetz 344662 May 23 00:00 oplsaa.prm


real	0m0.286s
user	0m0.181s
sys	0m0.040s

total 380
-rw-r--r-- 1 mpmetz mpmetz      0 May 23 00:00 GRID_DONE
-rw-r--r-- 1 mpmetz mpmetz    148 May 23 00:00 gridgen.out
-rw-r--r-- 1 mpmetz mpmetz   1206 May 23 00:00 H2O2.geo_main
-rw-r--r-- 1 mpmetz mpmetz    713 May 23 00:00 H2O2_GRID.o2015737
-rw-rw-r-- 1 mpmetz mpmetz   1533 May 23 00:00 H2O2.input_long
-rw-r--r-- 1 mpmetz mpmetz    474 May 23 00:00 H2O2_MINIMA.o2015736
-rw-r--r-- 1 mpmetz mpmetz      0 May 23 00:00 H2O2_MINIMA.po2015736
-rw-rw-r-- 1 mpmetz mpmetz      0 May 23 00:00 MINIMA_RUNNING
-rw-rw-r-- 1 mpmetz mpmetz      3 May 23 00:00 npoint.info
-rw-r--r-- 1 mpmetz mpmetz 344662 May 23 00:00 oplsaa.prm
-rw-rw-r-- 1 mpmetz mpmetz      0 May 23 00:00 SLAVE_GRIDGEN_STARTED
-rw-rw-r-- 1 mpmetz mpmetz    454 May 23 00:00 slv_gridgen.out
-rwxr-xr-x 1 mpmetz mpmetz   1033 May 23 00:00 submit_GRID
-rwxr-xr-x 1 mpmetz mpmetz    989 May 23 00:00 submit_MINIMA

total 380
-rw-r--r-- 1 mpmetz mpmetz      0 May 23 00:00 GRID_DONE
-rw-r--r-- 1 mpmetz mpmetz    148 May 23 00:00 gridgen.out
-rw-r--r-- 1 mpmetz mpmetz   1206 May 23 00:00 H2O2.geo_main
-rw-r--r-- 1 mpmetz mpmetz   1598 May 23 00:00 H2O2_GRID.o2015737
-rw-rw-r-- 1 mpmetz mpmetz   1533 May 23 00:00 H2O2.input_long
-rw-r--r-- 1 mpmetz mpmetz    474 May 23 00:00 H2O2_MINIMA.o2015736
-rw-r--r-- 1 mpmetz mpmetz      0 May 23 00:00 H2O2_MINIMA.po2015736
-rw-rw-r-- 1 mpmetz mpmetz      0 May 23 00:00 MINIMA_RUNNING
-rw-rw-r-- 1 mpmetz mpmetz      3 May 23 00:00 npoint.info
-rw-r--r-- 1 mpmetz mpmetz 344662 May 23 00:00 oplsaa.prm
-rw-rw-r-- 1 mpmetz mpmetz      0 May 23 00:00 SLAVE_GRIDGEN_STARTED
-rw-rw-r-- 1 mpmetz mpmetz    454 May 23 00:00 slv_gridgen.out
-rwxr-xr-x 1 mpmetz mpmetz   1033 May 23 00:00 submit_GRID
-rwxr-xr-x 1 mpmetz mpmetz    989 May 23 00:00 submit_MINIMA
End at:
Mon May 23 00:00:26 EDT 2016
