       2.9356758202      99.4603580089      43.8499130901      54.0623451934      80.0020761706     107.0466852276      10.1405253925
       2.9641937526     171.7541144235     283.6604620103     252.8345767273      94.5168379459     207.0996337214       8.2409491712
       4.1357736407      32.8493356600     221.8613776463     113.2058799185      39.5480457995     168.9218844838      -8.7501365047
       3.9513298490     104.4139964763     169.2304287220     170.6433737393      25.1656476391     119.2608786641      -9.2567592906
       3.7934060173      73.6016831943     299.4593325509     154.8554484559     101.5866699663     355.6136912234       0.2942260360
       4.2270755737      21.6386478383     208.8807020499     333.1667744364      76.8860729079     356.5443525772      -4.2685851963
       4.4038462912      73.6855163111     220.3155393930     267.5895717112      52.5371303206      77.7148729031      -4.3761698745
       3.2882106048     158.4074487977      54.2444242773     356.5507887056      96.0353630377     358.2234084462       0.1684545977
       2.9428718828      55.1439405995      37.0136520388     296.3507229229     151.4165862716     242.0531035655      29.6995079073
       3.2207045025     139.7352260000      55.5892230000     185.7387350000      29.4414120000     180.0000000000     -13.4793845849
