 
       -----------------------------------------------
       ------------ Monomer B in its MC+BS -----------
       -----------------------------------------------
 
/home/teodar/SAPTY/AMD/SAPT2016.1/bin/asymp_com//../SAPT: line 330: /home/teodar/SAPTY/AMD/dalton: is a directory

real	0m0.001s
user	0m0.000s
sys	0m0.000s
cat: H2O2MB.out: No such file or directory
rm: cannot remove `H2O2MB.out': No such file or directory
mv: cannot stat `./H2O2MB/AOONEINT': No such file or directory
mv: cannot stat `./H2O2MB/AOTWOINT': No such file or directory
mv: cannot stat `./H2O2MB/SIRIUS.RST': No such file or directory
mv: cannot stat `./H2O2MB/SIRIFC': No such file or directory
mv: cannot stat `./H2O2MB/DALTON.BAS': No such file or directory
 Input/defaults from namelist INPUT 
 ================================== 
 Vector output file:                  10
 One-electron integral output file:    9
 Information output file:             12
 Print vectors:                        F
 Full run:                             T
forrtl: No such file or directory
forrtl: severe (29): file not found, unit 88, file /home/teodar/SAPTY/AMD/autoPES-1.0/example/H2O2/DAREK/ASYM/ASYM_work/monomerB/SIRIUS.RST
Image              PC                Routine            Line        Source             
daltintf           000000000040A9C9  Unknown               Unknown  Unknown
daltintf           0000000000416E72  Unknown               Unknown  Unknown
daltintf           000000000040338A  Unknown               Unknown  Unknown
daltintf           0000000000402F1E  Unknown               Unknown  Unknown
libc.so.6          0000003B3401ED1D  Unknown               Unknown  Unknown
daltintf           0000000000402E29  Unknown               Unknown  Unknown

real	0m0.007s
user	0m0.000s
sys	0m0.004s
grep: DALTON.BAS: No such file or directory
cat: scfener.data.dalton: No such file or directory
rm: cannot remove `scfener.data.dalton': No such file or directory
