       2.4648536405     148.6915741236      58.7108335572     337.7341643996     104.1604735958     125.1791279858       6.5249028094
       2.7615913811      58.7121734446     231.7954587729     228.7806098713      98.1997929470     107.7664607981       1.9848654362
       2.8574552454      96.3850893566     338.1772234766     217.0695432200      63.8459703955      92.2322217042      -1.5768047575
       3.4205366391     124.8320714483      42.8782036038      43.0989334114     122.5796571907     275.9579765447      -0.7115593403
       3.9609517516      76.1391740912       3.9889154843      25.5403055400      47.3968224796      68.1336555446       1.1054579679
       3.1918490979     123.6143940681       4.2740289508      96.4816823169     101.6353405385     127.9408712370      -2.2642835449
       3.2997778051     123.5419036494      39.9755451095      57.8021235395      30.5576489829     345.5303114625       2.4294668643
       3.6862912686      55.9933533084     264.0336998364     254.1855445809     167.5477932425      16.8144935961       1.8481178859
       2.7198897529      70.0086084541     157.3739432378       9.8343893093      36.7712817045     162.1844051961      -1.1210490715
       2.7541326263      20.4009730000     270.0000040000     180.0000010000      50.3752160000       0.0000000000      -6.8517912450
