Compute node: compute-0-1.local
Job ID: 2017649
Started at:
Tue Jul 19 22:19:36 EDT 2016
openmpi_1.6.5/intel_2013/1.6.5(12):ERROR:150: Module 'openmpi_1.6.5/intel_2013/1.6.5' conflicts with the currently loaded module(s) 'gnu/4.8.1'
openmpi_1.6.5/intel_2013/1.6.5(12):ERROR:102: Tcl command execution failed: conflict mpich2 pgi intel gnu


total 4
drwxrwxr-x 2 mpmetz mpmetz 4096 Jul 19 22:19 PART5


total 8
-rw-r--r-- 1 mpmetz mpmetz  402 Jul 19 22:28 H2O26_SAPT.o2017649
lrwxrwxrwx 1 mpmetz mpmetz   45 Jul 19 22:19 PART5 -> /home/mpmetz/autoPES/example/H2O2/SAPT1/PART5
-rw-r--r-- 1 mpmetz mpmetz    0 Jul 19 22:28 SAPT_DONE
-rwxr-xr-x 1 mpmetz mpmetz 1134 Jul 19 22:19 submit_SAPT

total 8
-rw-r--r-- 1 mpmetz mpmetz  688 Jul 19 22:28 H2O26_SAPT.o2017649
lrwxrwxrwx 1 mpmetz mpmetz   45 Jul 19 22:19 PART5 -> /home/mpmetz/autoPES/example/H2O2/SAPT1/PART5
-rw-r--r-- 1 mpmetz mpmetz    0 Jul 19 22:28 SAPT_DONE
-rwxr-xr-x 1 mpmetz mpmetz 1134 Jul 19 22:19 submit_SAPT
End at:
Tue Jul 19 22:28:01 EDT 2016
