0 completed,  0 running,  0 queued,  10 remaining,  0 failed

Starting 10 new points
Submitting JOB1 : PART1
Your job 2017634 ("H2O21_SAPT") has been submitted
Submitting JOB2 : PART10
Your job 2017635 ("H2O22_SAPT") has been submitted
Submitting JOB3 : PART2
Your job 2017636 ("H2O23_SAPT") has been submitted
Submitting JOB4 : PART3
Your job 2017637 ("H2O24_SAPT") has been submitted
Submitting JOB5 : PART4
Your job 2017638 ("H2O25_SAPT") has been submitted
Submitting JOB6 : PART5
Your job 2017639 ("H2O26_SAPT") has been submitted
Submitting JOB7 : PART6
Your job 2017640 ("H2O27_SAPT") has been submitted
Submitting JOB8 : PART7
Your job 2017641 ("H2O28_SAPT") has been submitted
Submitting JOB9 : PART8
Your job 2017642 ("H2O29_SAPT") has been submitted
Submitting JOB10 : PART9
Your job 2017643 ("H2O210_SAPT") has been submitted

10 completed,  0 running,  0 queued,  0 remaining,  0 failed
SAPT calculations completed
