/home/1446/.bash_profile: line 13: workgroup: command not found
Compute node: n046
Job ID: 2273791
Started at:
Sat Dec 24 20:13:26 EST 2016
Adding package `intel/2011-8.273-64bit` to your environment
Adding dependency `pgi/12.10` to your environment
Adding package `gotoblas2/1.13-pgi12` to your environment
ERROR: unknown package: lapack
total 4
drwxr-xr-x 2 mpmetz everyone 4096 Dec 24 20:13 PART5

End at:
Sat Dec 24 20:17:24 EST 2016
