{
  "taskList": [
    {
      "id": 2,
      "priority": 5,
      "content": "Enter your task",
      "isDone": false
    },
    {
      "id": 3,
      "priority": 5,
      "content": "Enter your task",
      "isDone": false
    },
    {
      "id": 8,
      "priority": 5,
      "content": "Enter your task",
      "isDone": false
    },
    {
      "id": 10,
      "priority": 5,
      "content": "Enter your task",
      "isDone": false
    },
    {
      "id": 5,
      "priority": 3,
      "content": "Enter your task",
      "isDone": false
    },
    {
      "id": 1,
      "priority": 1,
      "content": "Enter your task",
      "isDone": false
    },
    {
      "id": 12,
      "priority": 5,
      "content": "Enter your task",
      "isDone": true
    },
    {
      "id": 6,
      "priority": 4,
      "content": "Enter your task",
      "isDone": true
    },
    {
      "id": 13,
      "priority": 4,
      "content": "Enter your task",
      "isDone": false
    },
    {
      "id": 4,
      "priority": 3,
      "content": "Enter your task",
      "isDone": true
    },
    {
      "id": 7,
      "priority": 2,
      "content": "Enter your task",
      "isDone": true
    },
    {
      "id": 9,
      "priority": 2,
      "content": "Enter your task",
      "isDone": true
    },
    {
      "id": 14,
      "priority": 2,
      "content": "Enter your task",
      "isDone": true
    },
    {
      "id": 11,
      "priority": 1,
      "content": "Enter your task",
      "isDone": true
    }
  ],
  "sequence": 15
}